beam-builds mailing list archives

Site index · List index
Message view « Date » · « Thread »
Top « Date » · « Thread »
From Apache Jenkins Server <jenk...@builds.apache.org>
Subject Build failed in Jenkins: beam_PostCommit_Py_VR_Dataflow #2188
Date Fri, 04 Jan 2019 18:40:08 GMT
See <https://builds.apache.org/job/beam_PostCommit_Py_VR_Dataflow/2188/display/redirect>

------------------------------------------
[...truncated 296.15 KB...]
    "--num_workers=$NUM_WORKERS"
    "--sleep_secs=$SLEEP_SECS"
  )

  # Add --streaming if provided
  if [[ "$STREAMING" = true ]]; then
    opts+=("--streaming")
  fi

  # Add --dataflow_worker_jar if provided
  if [[ ! -z "$WORKER_JAR" ]]; then
    opts+=("--dataflow_worker_jar=$WORKER_JAR")
  fi

  if [[ ! -z "$KMS_KEY_NAME" ]]; then
    opts+=("--kms_key_name=$KMS_KEY_NAME")
  fi

  PIPELINE_OPTS=$(IFS=" " ; echo "${opts[*]}")

fi
pwd | sed 's/sdks\/python.*/sdks\/python/'
find ${SDK_LOCATION}
find ${SDK_LOCATION}
IFS=" " ; echo "${opts[*]}"

>>> RUNNING integration tests with pipeline options: --runner=TestDataflowRunner
--project=apache-beam-testing --staging_location=gs://temp-storage-for-end-to-end-tests/staging-it
--temp_location=gs://temp-storage-for-end-to-end-tests/temp-it --output=gs://temp-storage-for-end-to-end-tests/py-it-cloud/output
--sdk_location=build/apache-beam.tar.gz --requirements_file=postcommit_requirements.txt --num_workers=1
--sleep_secs=20 --streaming --dataflow_worker_jar=<https://builds.apache.org/job/beam_PostCommit_Py_VR_Dataflow/ws/src/runners/google-cloud-dataflow-java/worker/build/libs/beam-runners-google-cloud-dataflow-java-fn-api-worker-2.10.0-SNAPSHOT.jar>
--kms_key_name=projects/apache-beam-testing/locations/global/keyRings/beam-it/cryptoKeys/test/cryptoKeyVersions/1
###########################################################################
# Run tests and validate that jobs finish successfully.

echo ">>> RUNNING integration tests with pipeline options: $PIPELINE_OPTS"
python setup.py nosetests \
  --test-pipeline-options="$PIPELINE_OPTS" \
  $TEST_OPTS
<https://builds.apache.org/job/beam_PostCommit_Py_VR_Dataflow/ws/src/build/gradleenv/1327086738/local/lib/python2.7/site-packages/setuptools/dist.py>:470:
UserWarning: Normalizing '2.10.0.dev' to '2.10.0.dev0'
  normalized_version,
running nosetests
running egg_info
writing requirements to apache_beam.egg-info/requires.txt
writing apache_beam.egg-info/PKG-INFO
writing top-level names to apache_beam.egg-info/top_level.txt
writing dependency_links to apache_beam.egg-info/dependency_links.txt
writing entry points to apache_beam.egg-info/entry_points.txt
reading manifest file 'apache_beam.egg-info/SOURCES.txt'
reading manifest template 'MANIFEST.in'
warning: no files found matching 'README.md'
warning: no files found matching 'NOTICE'
warning: no files found matching 'LICENSE'
writing manifest file 'apache_beam.egg-info/SOURCES.txt'
test_par_do_with_multiple_outputs_and_using_return (apache_beam.transforms.ptransform_test.PTransformTest)
... ERROR
test_as_dict_twice (apache_beam.transforms.sideinputs_test.SideInputsTest) ... ok
test_as_list_and_as_dict_side_inputs (apache_beam.transforms.sideinputs_test.SideInputsTest)
... ok
test_undeclared_outputs (apache_beam.transforms.ptransform_test.PTransformTest) ... ok
test_multiple_empty_outputs (apache_beam.transforms.ptransform_test.PTransformTest) ... ok
test_as_list_twice (apache_beam.transforms.sideinputs_test.SideInputsTest) ... ok
test_as_singleton_with_different_defaults (apache_beam.transforms.sideinputs_test.SideInputsTest)
... ok
test_par_do_with_multiple_outputs_and_using_yield (apache_beam.transforms.ptransform_test.PTransformTest)
... ok
test_flatten_multiple_pcollections_having_multiple_consumers (apache_beam.transforms.ptransform_test.PTransformTest)
... ok
test_flattened_side_input (apache_beam.transforms.sideinputs_test.SideInputsTest) ... ok
test_as_singleton_without_unique_labels (apache_beam.transforms.sideinputs_test.SideInputsTest)
... ok
test_empty_singleton_side_input (apache_beam.transforms.sideinputs_test.SideInputsTest) ...
ok
test_iterable_side_input (apache_beam.transforms.sideinputs_test.SideInputsTest) ... ok
test_default_value_singleton_side_input (apache_beam.transforms.sideinputs_test.SideInputsTest)
... ok

======================================================================
ERROR: test_par_do_with_multiple_outputs_and_using_return (apache_beam.transforms.ptransform_test.PTransformTest)
----------------------------------------------------------------------
Traceback (most recent call last):
  File "<https://builds.apache.org/job/beam_PostCommit_Py_VR_Dataflow/ws/src/sdks/python/apache_beam/transforms/ptransform_test.py",>
line 257, in test_par_do_with_multiple_outputs_and_using_return
    pipeline.run()
  File "<https://builds.apache.org/job/beam_PostCommit_Py_VR_Dataflow/ws/src/sdks/python/apache_beam/testing/test_pipeline.py",>
line 107, in run
    else test_runner_api))
  File "<https://builds.apache.org/job/beam_PostCommit_Py_VR_Dataflow/ws/src/sdks/python/apache_beam/pipeline.py",>
line 405, in run
    self._options).run(False)
  File "<https://builds.apache.org/job/beam_PostCommit_Py_VR_Dataflow/ws/src/sdks/python/apache_beam/pipeline.py",>
line 418, in run
    return self.runner.run_pipeline(self, self._options)
  File "<https://builds.apache.org/job/beam_PostCommit_Py_VR_Dataflow/ws/src/sdks/python/apache_beam/runners/dataflow/test_dataflow_runner.py",>
line 53, in run_pipeline
    pipeline, options)
  File "<https://builds.apache.org/job/beam_PostCommit_Py_VR_Dataflow/ws/src/sdks/python/apache_beam/runners/dataflow/dataflow_runner.py",>
line 394, in run_pipeline
    self.dataflow_client.create_job(self.job), self)
  File "<https://builds.apache.org/job/beam_PostCommit_Py_VR_Dataflow/ws/src/sdks/python/apache_beam/utils/retry.py",>
line 184, in wrapper
    return fun(*args, **kwargs)
  File "<https://builds.apache.org/job/beam_PostCommit_Py_VR_Dataflow/ws/src/sdks/python/apache_beam/runners/dataflow/internal/apiclient.py",>
line 504, in create_job
    self.create_job_description(job)
  File "<https://builds.apache.org/job/beam_PostCommit_Py_VR_Dataflow/ws/src/sdks/python/apache_beam/runners/dataflow/internal/apiclient.py",>
line 533, in create_job_description
    resources = self._stage_resources(job.options)
  File "<https://builds.apache.org/job/beam_PostCommit_Py_VR_Dataflow/ws/src/sdks/python/apache_beam/runners/dataflow/internal/apiclient.py",>
line 464, in _stage_resources
    staging_location=google_cloud_options.staging_location)
  File "<https://builds.apache.org/job/beam_PostCommit_Py_VR_Dataflow/ws/src/sdks/python/apache_beam/runners/portability/stager.py",>
line 270, in stage_job_resources
    self.stage_artifact(dataflow_worker_jar, staged_path)
  File "<https://builds.apache.org/job/beam_PostCommit_Py_VR_Dataflow/ws/src/sdks/python/apache_beam/runners/dataflow/internal/apiclient.py",>
line 791, in stage_artifact
    artifact_name)
  File "<https://builds.apache.org/job/beam_PostCommit_Py_VR_Dataflow/ws/src/sdks/python/apache_beam/utils/retry.py",>
line 184, in wrapper
    return fun(*args, **kwargs)
  File "<https://builds.apache.org/job/beam_PostCommit_Py_VR_Dataflow/ws/src/sdks/python/apache_beam/runners/dataflow/internal/apiclient.py",>
line 451, in _gcs_file_copy
    self.stage_file(to_folder, to_name, f)
  File "<https://builds.apache.org/job/beam_PostCommit_Py_VR_Dataflow/ws/src/sdks/python/apache_beam/runners/dataflow/internal/apiclient.py",>
line 485, in stage_file
    response = self._storage_client.objects.Insert(request, upload=upload)
  File "<https://builds.apache.org/job/beam_PostCommit_Py_VR_Dataflow/ws/src/sdks/python/apache_beam/io/gcp/internal/clients/storage/storage_v1_client.py",>
line 1154, in Insert
    upload=upload, upload_config=upload_config)
  File "<https://builds.apache.org/job/beam_PostCommit_Py_VR_Dataflow/ws/src/build/gradleenv/1327086738/local/lib/python2.7/site-packages/apitools/base/py/base_api.py",>
line 703, in _RunMethod
    download)
  File "<https://builds.apache.org/job/beam_PostCommit_Py_VR_Dataflow/ws/src/build/gradleenv/1327086738/local/lib/python2.7/site-packages/apitools/base/py/base_api.py",>
line 679, in PrepareHttpRequest
    upload.ConfigureRequest(upload_config, http_request, url_builder)
  File "<https://builds.apache.org/job/beam_PostCommit_Py_VR_Dataflow/ws/src/build/gradleenv/1327086738/local/lib/python2.7/site-packages/apitools/base/py/transfer.py",>
line 731, in ConfigureRequest
    self.__ConfigureMultipartRequest(http_request)
  File "<https://builds.apache.org/job/beam_PostCommit_Py_VR_Dataflow/ws/src/build/gradleenv/1327086738/local/lib/python2.7/site-packages/apitools/base/py/transfer.py",>
line 791, in __ConfigureMultipartRequest
    g.flatten(msg_root, unixfrom=False)
  File "/usr/lib/python2.7/email/generator.py", line 83, in flatten
    self._write(msg)
  File "/usr/lib/python2.7/email/generator.py", line 108, in _write
    self._dispatch(msg)
  File "/usr/lib/python2.7/email/generator.py", line 134, in _dispatch
    meth(msg)
  File "/usr/lib/python2.7/email/generator.py", line 210, in _handle_multipart
    alltext = NL.join(msgtexts)
MemoryError: 
-------------------- >> begin captured logging << --------------------
root: DEBUG: Connecting using Google Application Default Credentials.
root: INFO: Starting GCS upload to gs://temp-storage-for-end-to-end-tests/staging-it/beamapp-jenkins-0104182229-233972.1546626149.234150/pipeline.pb...
oauth2client.transport: INFO: Attempting refresh to obtain initial access_token
oauth2client.transport: INFO: Attempting refresh to obtain initial access_token
root: INFO: Completed GCS upload to gs://temp-storage-for-end-to-end-tests/staging-it/beamapp-jenkins-0104182229-233972.1546626149.234150/pipeline.pb
in 0 seconds.
root: INFO: Starting GCS upload to gs://temp-storage-for-end-to-end-tests/staging-it/beamapp-jenkins-0104182229-233972.1546626149.234150/requirements.txt...
root: INFO: Completed GCS upload to gs://temp-storage-for-end-to-end-tests/staging-it/beamapp-jenkins-0104182229-233972.1546626149.234150/requirements.txt
in 0 seconds.
root: INFO: Executing command: ['<https://builds.apache.org/job/beam_PostCommit_Py_VR_Dataflow/ws/src/build/gradleenv/1327086738/bin/python',>
'-m', 'pip', 'download', '--dest', '/tmp/dataflow-requirements-cache', '-r', 'postcommit_requirements.txt',
'--exists-action', 'i', '--no-binary', ':all:']
root: WARNING: Retry with exponential backoff: waiting for 4.46370211949 seconds before retrying
_populate_requirements_cache because we caught exception: CalledProcessError: Command '['<https://builds.apache.org/job/beam_PostCommit_Py_VR_Dataflow/ws/src/build/gradleenv/1327086738/bin/python',>
'-m', 'pip', 'download', '--dest', '/tmp/dataflow-requirements-cache', '-r', 'postcommit_requirements.txt',
'--exists-action', 'i', '--no-binary', ':all:']' returned non-zero exit status 1
 Traceback for above exception (most recent call last):
  File "<https://builds.apache.org/job/beam_PostCommit_Py_VR_Dataflow/ws/src/sdks/python/apache_beam/utils/retry.py",>
line 184, in wrapper
    return fun(*args, **kwargs)
  File "<https://builds.apache.org/job/beam_PostCommit_Py_VR_Dataflow/ws/src/sdks/python/apache_beam/runners/portability/stager.py",>
line 427, in _populate_requirements_cache
    processes.check_output(cmd_args, stderr=processes.STDOUT)
  File "<https://builds.apache.org/job/beam_PostCommit_Py_VR_Dataflow/ws/src/sdks/python/apache_beam/utils/processes.py",>
line 53, in check_output
    return subprocess.check_output(*args, **kwargs)
  File "/usr/lib/python2.7/subprocess.py", line 574, in check_output
    raise CalledProcessError(retcode, cmd, output=output)

root: INFO: Executing command: ['<https://builds.apache.org/job/beam_PostCommit_Py_VR_Dataflow/ws/src/build/gradleenv/1327086738/bin/python',>
'-m', 'pip', 'download', '--dest', '/tmp/dataflow-requirements-cache', '-r', 'postcommit_requirements.txt',
'--exists-action', 'i', '--no-binary', ':all:']
root: INFO: Starting GCS upload to gs://temp-storage-for-end-to-end-tests/staging-it/beamapp-jenkins-0104182229-233972.1546626149.234150/pbr-4.2.0.tar.gz...
root: INFO: Completed GCS upload to gs://temp-storage-for-end-to-end-tests/staging-it/beamapp-jenkins-0104182229-233972.1546626149.234150/pbr-4.2.0.tar.gz
in 0 seconds.
root: INFO: Starting GCS upload to gs://temp-storage-for-end-to-end-tests/staging-it/beamapp-jenkins-0104182229-233972.1546626149.234150/setuptools-40.0.0.zip...
root: INFO: Completed GCS upload to gs://temp-storage-for-end-to-end-tests/staging-it/beamapp-jenkins-0104182229-233972.1546626149.234150/setuptools-40.0.0.zip
in 0 seconds.
root: INFO: Starting GCS upload to gs://temp-storage-for-end-to-end-tests/staging-it/beamapp-jenkins-0104182229-233972.1546626149.234150/pbr-4.3.0.tar.gz...
root: INFO: Completed GCS upload to gs://temp-storage-for-end-to-end-tests/staging-it/beamapp-jenkins-0104182229-233972.1546626149.234150/pbr-4.3.0.tar.gz
in 0 seconds.
root: INFO: Starting GCS upload to gs://temp-storage-for-end-to-end-tests/staging-it/beamapp-jenkins-0104182229-233972.1546626149.234150/setuptools-40.3.0.zip...
root: INFO: Completed GCS upload to gs://temp-storage-for-end-to-end-tests/staging-it/beamapp-jenkins-0104182229-233972.1546626149.234150/setuptools-40.3.0.zip
in 0 seconds.
root: INFO: Starting GCS upload to gs://temp-storage-for-end-to-end-tests/staging-it/beamapp-jenkins-0104182229-233972.1546626149.234150/setuptools-39.1.0.zip...
root: INFO: Completed GCS upload to gs://temp-storage-for-end-to-end-tests/staging-it/beamapp-jenkins-0104182229-233972.1546626149.234150/setuptools-39.1.0.zip
in 0 seconds.
root: INFO: Starting GCS upload to gs://temp-storage-for-end-to-end-tests/staging-it/beamapp-jenkins-0104182229-233972.1546626149.234150/PyHamcrest-1.9.0.tar.gz...
root: INFO: Completed GCS upload to gs://temp-storage-for-end-to-end-tests/staging-it/beamapp-jenkins-0104182229-233972.1546626149.234150/PyHamcrest-1.9.0.tar.gz
in 0 seconds.
root: INFO: Starting GCS upload to gs://temp-storage-for-end-to-end-tests/staging-it/beamapp-jenkins-0104182229-233972.1546626149.234150/setuptools-40.4.2.zip...
root: INFO: Completed GCS upload to gs://temp-storage-for-end-to-end-tests/staging-it/beamapp-jenkins-0104182229-233972.1546626149.234150/setuptools-40.4.2.zip
in 0 seconds.
root: INFO: Starting GCS upload to gs://temp-storage-for-end-to-end-tests/staging-it/beamapp-jenkins-0104182229-233972.1546626149.234150/pbr-5.1.1.tar.gz...
root: INFO: Completed GCS upload to gs://temp-storage-for-end-to-end-tests/staging-it/beamapp-jenkins-0104182229-233972.1546626149.234150/pbr-5.1.1.tar.gz
in 0 seconds.
root: INFO: Starting GCS upload to gs://temp-storage-for-end-to-end-tests/staging-it/beamapp-jenkins-0104182229-233972.1546626149.234150/setuptools-40.5.0.zip...
root: INFO: Completed GCS upload to gs://temp-storage-for-end-to-end-tests/staging-it/beamapp-jenkins-0104182229-233972.1546626149.234150/setuptools-40.5.0.zip
in 0 seconds.
root: INFO: Starting GCS upload to gs://temp-storage-for-end-to-end-tests/staging-it/beamapp-jenkins-0104182229-233972.1546626149.234150/pbr-4.0.4.tar.gz...
root: INFO: Completed GCS upload to gs://temp-storage-for-end-to-end-tests/staging-it/beamapp-jenkins-0104182229-233972.1546626149.234150/pbr-4.0.4.tar.gz
in 0 seconds.
root: INFO: Starting GCS upload to gs://temp-storage-for-end-to-end-tests/staging-it/beamapp-jenkins-0104182229-233972.1546626149.234150/setuptools-40.4.1.zip...
root: INFO: Completed GCS upload to gs://temp-storage-for-end-to-end-tests/staging-it/beamapp-jenkins-0104182229-233972.1546626149.234150/setuptools-40.4.1.zip
in 0 seconds.
root: INFO: Starting GCS upload to gs://temp-storage-for-end-to-end-tests/staging-it/beamapp-jenkins-0104182229-233972.1546626149.234150/setuptools-40.6.1.zip...
root: INFO: Completed GCS upload to gs://temp-storage-for-end-to-end-tests/staging-it/beamapp-jenkins-0104182229-233972.1546626149.234150/setuptools-40.6.1.zip
in 0 seconds.
root: INFO: Starting GCS upload to gs://temp-storage-for-end-to-end-tests/staging-it/beamapp-jenkins-0104182229-233972.1546626149.234150/pbr-5.1.0.tar.gz...
root: INFO: Completed GCS upload to gs://temp-storage-for-end-to-end-tests/staging-it/beamapp-jenkins-0104182229-233972.1546626149.234150/pbr-5.1.0.tar.gz
in 0 seconds.
root: INFO: Starting GCS upload to gs://temp-storage-for-end-to-end-tests/staging-it/beamapp-jenkins-0104182229-233972.1546626149.234150/setuptools-40.1.0.zip...
root: INFO: Completed GCS upload to gs://temp-storage-for-end-to-end-tests/staging-it/beamapp-jenkins-0104182229-233972.1546626149.234150/setuptools-40.1.0.zip
in 0 seconds.
root: INFO: Starting GCS upload to gs://temp-storage-for-end-to-end-tests/staging-it/beamapp-jenkins-0104182229-233972.1546626149.234150/pbr-4.0.3.tar.gz...
root: INFO: Completed GCS upload to gs://temp-storage-for-end-to-end-tests/staging-it/beamapp-jenkins-0104182229-233972.1546626149.234150/pbr-4.0.3.tar.gz
in 0 seconds.
root: INFO: Starting GCS upload to gs://temp-storage-for-end-to-end-tests/staging-it/beamapp-jenkins-0104182229-233972.1546626149.234150/pbr-4.1.1.tar.gz...
root: INFO: Completed GCS upload to gs://temp-storage-for-end-to-end-tests/staging-it/beamapp-jenkins-0104182229-233972.1546626149.234150/pbr-4.1.1.tar.gz
in 0 seconds.
root: INFO: Starting GCS upload to gs://temp-storage-for-end-to-end-tests/staging-it/beamapp-jenkins-0104182229-233972.1546626149.234150/setuptools-39.2.0.zip...
root: INFO: Completed GCS upload to gs://temp-storage-for-end-to-end-tests/staging-it/beamapp-jenkins-0104182229-233972.1546626149.234150/setuptools-39.2.0.zip
in 0 seconds.
root: INFO: Starting GCS upload to gs://temp-storage-for-end-to-end-tests/staging-it/beamapp-jenkins-0104182229-233972.1546626149.234150/mock-2.0.0.tar.gz...
root: INFO: Completed GCS upload to gs://temp-storage-for-end-to-end-tests/staging-it/beamapp-jenkins-0104182229-233972.1546626149.234150/mock-2.0.0.tar.gz
in 0 seconds.
root: INFO: Starting GCS upload to gs://temp-storage-for-end-to-end-tests/staging-it/beamapp-jenkins-0104182229-233972.1546626149.234150/pbr-5.0.0.tar.gz...
root: INFO: Completed GCS upload to gs://temp-storage-for-end-to-end-tests/staging-it/beamapp-jenkins-0104182229-233972.1546626149.234150/pbr-5.0.0.tar.gz
in 0 seconds.
root: INFO: Starting GCS upload to gs://temp-storage-for-end-to-end-tests/staging-it/beamapp-jenkins-0104182229-233972.1546626149.234150/setuptools-40.6.0.zip...
root: INFO: Completed GCS upload to gs://temp-storage-for-end-to-end-tests/staging-it/beamapp-jenkins-0104182229-233972.1546626149.234150/setuptools-40.6.0.zip
in 0 seconds.
root: INFO: Starting GCS upload to gs://temp-storage-for-end-to-end-tests/staging-it/beamapp-jenkins-0104182229-233972.1546626149.234150/setuptools-40.2.0.zip...
root: INFO: Completed GCS upload to gs://temp-storage-for-end-to-end-tests/staging-it/beamapp-jenkins-0104182229-233972.1546626149.234150/setuptools-40.2.0.zip
in 0 seconds.
root: INFO: Starting GCS upload to gs://temp-storage-for-end-to-end-tests/staging-it/beamapp-jenkins-0104182229-233972.1546626149.234150/six-1.12.0.tar.gz...
root: INFO: Completed GCS upload to gs://temp-storage-for-end-to-end-tests/staging-it/beamapp-jenkins-0104182229-233972.1546626149.234150/six-1.12.0.tar.gz
in 0 seconds.
root: INFO: Starting GCS upload to gs://temp-storage-for-end-to-end-tests/staging-it/beamapp-jenkins-0104182229-233972.1546626149.234150/six-1.11.0.tar.gz...
root: INFO: Completed GCS upload to gs://temp-storage-for-end-to-end-tests/staging-it/beamapp-jenkins-0104182229-233972.1546626149.234150/six-1.11.0.tar.gz
in 0 seconds.
root: INFO: Starting GCS upload to gs://temp-storage-for-end-to-end-tests/staging-it/beamapp-jenkins-0104182229-233972.1546626149.234150/setuptools-40.6.2.zip...
root: INFO: Completed GCS upload to gs://temp-storage-for-end-to-end-tests/staging-it/beamapp-jenkins-0104182229-233972.1546626149.234150/setuptools-40.6.2.zip
in 0 seconds.
root: INFO: Starting GCS upload to gs://temp-storage-for-end-to-end-tests/staging-it/beamapp-jenkins-0104182229-233972.1546626149.234150/setuptools-40.4.3.zip...
root: INFO: Completed GCS upload to gs://temp-storage-for-end-to-end-tests/staging-it/beamapp-jenkins-0104182229-233972.1546626149.234150/setuptools-40.4.3.zip
in 0 seconds.
root: INFO: Starting GCS upload to gs://temp-storage-for-end-to-end-tests/staging-it/beamapp-jenkins-0104182229-233972.1546626149.234150/setuptools-40.6.3.zip...
root: INFO: Completed GCS upload to gs://temp-storage-for-end-to-end-tests/staging-it/beamapp-jenkins-0104182229-233972.1546626149.234150/setuptools-40.6.3.zip
in 0 seconds.
root: INFO: Starting GCS upload to gs://temp-storage-for-end-to-end-tests/staging-it/beamapp-jenkins-0104182229-233972.1546626149.234150/funcsigs-1.0.2.tar.gz...
root: INFO: Completed GCS upload to gs://temp-storage-for-end-to-end-tests/staging-it/beamapp-jenkins-0104182229-233972.1546626149.234150/funcsigs-1.0.2.tar.gz
in 0 seconds.
root: INFO: Starting GCS upload to gs://temp-storage-for-end-to-end-tests/staging-it/beamapp-jenkins-0104182229-233972.1546626149.234150/pbr-4.1.0.tar.gz...
root: INFO: Completed GCS upload to gs://temp-storage-for-end-to-end-tests/staging-it/beamapp-jenkins-0104182229-233972.1546626149.234150/pbr-4.1.0.tar.gz
in 0 seconds.
root: INFO: Copying Beam SDK "build/apache-beam.tar.gz" to staging location.
root: INFO: Starting GCS upload to gs://temp-storage-for-end-to-end-tests/staging-it/beamapp-jenkins-0104182229-233972.1546626149.234150/dataflow_python_sdk.tar...
root: INFO: Completed GCS upload to gs://temp-storage-for-end-to-end-tests/staging-it/beamapp-jenkins-0104182229-233972.1546626149.234150/dataflow_python_sdk.tar
in 0 seconds.
root: INFO: Starting GCS upload to gs://temp-storage-for-end-to-end-tests/staging-it/beamapp-jenkins-0104182229-233972.1546626149.234150/dataflow-worker.jar...
--------------------- >> end captured logging << ---------------------

----------------------------------------------------------------------
XML: <https://builds.apache.org/job/beam_PostCommit_Py_VR_Dataflow/ws/src/sdks/python/nosetests.xml>
----------------------------------------------------------------------
Ran 14 tests in 1061.348s

FAILED (errors=1)
Found: https://console.cloud.google.com/dataflow/jobsDetail/locations/us-central1/jobs/2019-01-04_10_22_57-14862668819449875023?project=apache-beam-testing.
Found: https://console.cloud.google.com/dataflow/jobsDetail/locations/us-central1/jobs/2019-01-04_10_22_57-9662986971108086110?project=apache-beam-testing.
Found: https://console.cloud.google.com/dataflow/jobsDetail/locations/us-central1/jobs/2019-01-04_10_32_19-15407053095864462184?project=apache-beam-testing.
Found: https://console.cloud.google.com/dataflow/jobsDetail/locations/us-central1/jobs/2019-01-04_10_23_19-8502575892379159217?project=apache-beam-testing.
Found: https://console.cloud.google.com/dataflow/jobsDetail/locations/us-central1/jobs/2019-01-04_10_22_57-14423318018667013657?project=apache-beam-testing.
Found: https://console.cloud.google.com/dataflow/jobsDetail/locations/us-central1/jobs/2019-01-04_10_22_58-12363543344375314021?project=apache-beam-testing.
Found: https://console.cloud.google.com/dataflow/jobsDetail/locations/us-central1/jobs/2019-01-04_10_32_29-11182904275770976928?project=apache-beam-testing.
Found: https://console.cloud.google.com/dataflow/jobsDetail/locations/us-central1/jobs/2019-01-04_10_22_57-5049263944925046868?project=apache-beam-testing.
Found: https://console.cloud.google.com/dataflow/jobsDetail/locations/us-central1/jobs/2019-01-04_10_31_43-1752253568225193178?project=apache-beam-testing.
Found: https://console.cloud.google.com/dataflow/jobsDetail/locations/us-central1/jobs/2019-01-04_10_22_57-18048041334059740858?project=apache-beam-testing.
Found: https://console.cloud.google.com/dataflow/jobsDetail/locations/us-central1/jobs/2019-01-04_10_32_19-1902770146477912592?project=apache-beam-testing.
Found: https://console.cloud.google.com/dataflow/jobsDetail/locations/us-central1/jobs/2019-01-04_10_22_57-11099449257856985231?project=apache-beam-testing.
Found: https://console.cloud.google.com/dataflow/jobsDetail/locations/us-central1/jobs/2019-01-04_10_31_44-6278272748982046746?project=apache-beam-testing.

> Task :beam-sdks-python:validatesRunnerStreamingTests FAILED
:beam-sdks-python:validatesRunnerStreamingTests (Thread[Task worker for ':' Thread 10,5,main])
completed. Took 17 mins 50.427 secs.

FAILURE: Build failed with an exception.

* Where:
Build file '<https://builds.apache.org/job/beam_PostCommit_Py_VR_Dataflow/ws/src/sdks/python/build.gradle'>
line: 306

* What went wrong:
Execution failed for task ':beam-sdks-python:validatesRunnerStreamingTests'.
> Process 'command 'sh'' finished with non-zero exit value 1

* Try:
Run with --stacktrace option to get the stack trace. Run with --debug option to get more log
output. Run with --scan to get full insights.

* Get more help at https://help.gradle.org

Deprecated Gradle features were used in this build, making it incompatible with Gradle 5.0.
Use '--warning-mode all' to show the individual deprecation warnings.
See https://docs.gradle.org/4.10.3/userguide/command_line_interface.html#sec:command_line_warnings

BUILD FAILED in 39m 50s
60 actionable tasks: 55 executed, 5 from cache

Publishing build scan...
https://gradle.com/s/causwzzulltkw

Build step 'Invoke Gradle script' changed build result to FAILURE
Build step 'Invoke Gradle script' marked build as failure

---------------------------------------------------------------------
To unsubscribe, e-mail: builds-unsubscribe@beam.apache.org
For additional commands, e-mail: builds-help@beam.apache.org


Mime
View raw message