beam-builds mailing list archives

Site index · List index
Message view « Date » · « Thread »
Top « Date » · « Thread »
From Apache Jenkins Server <jenk...@builds.apache.org>
Subject Build failed in Jenkins: beam_PreCommit_Website_Cron #488
Date Tue, 01 Jan 2019 12:04:06 GMT
See <https://builds.apache.org/job/beam_PreCommit_Website_Cron/488/display/redirect>

------------------------------------------
[...truncated 7.38 KB...]
> Task :buildSrc:classes UP-TO-DATE
Skipping task ':buildSrc:classes' as it has no actions.
:buildSrc:classes (Thread[Task worker for ':buildSrc' Thread 6,5,main]) completed. Took 0.0
secs.
:buildSrc:jar (Thread[Task worker for ':buildSrc' Thread 6,5,main]) started.

> Task :buildSrc:jar
Build cache key for task ':buildSrc:jar' is 6bb08d1bf83b61c4bbdc08dccb492f97
Caching disabled for task ':buildSrc:jar': Caching has not been enabled for the task
Task ':buildSrc:jar' is not up-to-date because:
  No history is available.
:buildSrc:jar (Thread[Task worker for ':buildSrc' Thread 6,5,main]) completed. Took 0.182
secs.
:buildSrc:assemble (Thread[Task worker for ':buildSrc' Thread 6,5,main]) started.

> Task :buildSrc:assemble
Skipping task ':buildSrc:assemble' as it has no actions.
:buildSrc:assemble (Thread[Task worker for ':buildSrc' Thread 6,5,main]) completed. Took 0.0
secs.
:buildSrc:spotlessGroovy (Thread[Task worker for ':buildSrc' Thread 11,5,main]) started.

> Task :buildSrc:spotlessGroovy
file or directory '<https://builds.apache.org/job/beam_PreCommit_Website_Cron/ws/src/buildSrc/src/test/groovy',>
not found
file or directory '<https://builds.apache.org/job/beam_PreCommit_Website_Cron/ws/src/buildSrc/src/test/groovy',>
not found
file or directory '<https://builds.apache.org/job/beam_PreCommit_Website_Cron/ws/src/buildSrc/src/test/groovy',>
not found
Caching disabled for task ':buildSrc:spotlessGroovy': Caching has not been enabled for the
task
Task ':buildSrc:spotlessGroovy' is not up-to-date because:
  No history is available.
All input files are considered out-of-date for incremental task ':buildSrc:spotlessGroovy'.
file or directory '<https://builds.apache.org/job/beam_PreCommit_Website_Cron/ws/src/buildSrc/src/test/groovy',>
not found
:buildSrc:spotlessGroovy (Thread[Task worker for ':buildSrc' Thread 11,5,main]) completed.
Took 2.315 secs.
:buildSrc:spotlessGroovyCheck (Thread[Task worker for ':buildSrc' Thread 11,5,main]) started.

> Task :buildSrc:spotlessGroovyCheck
Skipping task ':buildSrc:spotlessGroovyCheck' as it has no actions.
:buildSrc:spotlessGroovyCheck (Thread[Task worker for ':buildSrc' Thread 11,5,main]) completed.
Took 0.001 secs.
:buildSrc:spotlessGroovyGradle (Thread[Task worker for ':buildSrc' Thread 9,5,main]) started.

> Task :buildSrc:spotlessGroovyGradle
Caching disabled for task ':buildSrc:spotlessGroovyGradle': Caching has not been enabled for
the task
Task ':buildSrc:spotlessGroovyGradle' is not up-to-date because:
  No history is available.
All input files are considered out-of-date for incremental task ':buildSrc:spotlessGroovyGradle'.
:buildSrc:spotlessGroovyGradle (Thread[Task worker for ':buildSrc' Thread 9,5,main]) completed.
Took 0.053 secs.
:buildSrc:spotlessGroovyGradleCheck (Thread[Task worker for ':buildSrc' Thread 9,5,main])
started.

> Task :buildSrc:spotlessGroovyGradleCheck
Skipping task ':buildSrc:spotlessGroovyGradleCheck' as it has no actions.
:buildSrc:spotlessGroovyGradleCheck (Thread[Task worker for ':buildSrc' Thread 9,5,main])
completed. Took 0.0 secs.
:buildSrc:spotlessCheck (Thread[Task worker for ':buildSrc' Thread 9,5,main]) started.

> Task :buildSrc:spotlessCheck
Skipping task ':buildSrc:spotlessCheck' as it has no actions.
:buildSrc:spotlessCheck (Thread[Task worker for ':buildSrc' Thread 9,5,main]) completed. Took
0.0 secs.
:buildSrc:compileTestJava (Thread[Task worker for ':buildSrc' Thread 9,5,main]) started.

> Task :buildSrc:compileTestJava NO-SOURCE
file or directory '<https://builds.apache.org/job/beam_PreCommit_Website_Cron/ws/src/buildSrc/src/test/java',>
not found
Skipping task ':buildSrc:compileTestJava' as it has no source files and no previous output
files.
:buildSrc:compileTestJava (Thread[Task worker for ':buildSrc' Thread 9,5,main]) completed.
Took 0.002 secs.
:buildSrc:compileTestGroovy (Thread[Task worker for ':buildSrc' Thread 9,5,main]) started.

> Task :buildSrc:compileTestGroovy NO-SOURCE
file or directory '<https://builds.apache.org/job/beam_PreCommit_Website_Cron/ws/src/buildSrc/src/test/groovy',>
not found
Skipping task ':buildSrc:compileTestGroovy' as it has no source files and no previous output
files.
:buildSrc:compileTestGroovy (Thread[Task worker for ':buildSrc' Thread 9,5,main]) completed.
Took 0.004 secs.
:buildSrc:processTestResources (Thread[Task worker for ':buildSrc' Thread 9,5,main]) started.

> Task :buildSrc:processTestResources NO-SOURCE
file or directory '<https://builds.apache.org/job/beam_PreCommit_Website_Cron/ws/src/buildSrc/src/test/resources',>
not found
Skipping task ':buildSrc:processTestResources' as it has no source files and no previous output
files.
:buildSrc:processTestResources (Thread[Task worker for ':buildSrc' Thread 9,5,main]) completed.
Took 0.001 secs.
:buildSrc:testClasses (Thread[Task worker for ':buildSrc' Thread 9,5,main]) started.

> Task :buildSrc:testClasses UP-TO-DATE
Skipping task ':buildSrc:testClasses' as it has no actions.
:buildSrc:testClasses (Thread[Task worker for ':buildSrc' Thread 9,5,main]) completed. Took
0.0 secs.
:buildSrc:test (Thread[Task worker for ':buildSrc' Thread 11,5,main]) started.

> Task :buildSrc:test NO-SOURCE
Skipping task ':buildSrc:test' as it has no source files and no previous output files.
:buildSrc:test (Thread[Task worker for ':buildSrc' Thread 11,5,main]) completed. Took 0.003
secs.
:buildSrc:check (Thread[Task worker for ':buildSrc' Thread 11,5,main]) started.

> Task :buildSrc:check
Skipping task ':buildSrc:check' as it has no actions.
:buildSrc:check (Thread[Task worker for ':buildSrc' Thread 11,5,main]) completed. Took 0.0
secs.
:buildSrc:build (Thread[Task worker for ':buildSrc' Thread 11,5,main]) started.

> Task :buildSrc:build
Skipping task ':buildSrc:build' as it has no actions.
:buildSrc:build (Thread[Task worker for ':buildSrc' Thread 11,5,main]) completed. Took 0.0
secs.
Settings evaluated using settings file '<https://builds.apache.org/job/beam_PreCommit_Website_Cron/ws/src/settings.gradle'.>
Using local directory build cache for the root build (location = /home/jenkins/.gradle/caches/build-cache-1,
removeUnusedEntriesAfter = 7 days).
Projects loaded. Root project using build file '<https://builds.apache.org/job/beam_PreCommit_Website_Cron/ws/src/build.gradle'.>
Included projects: [root project 'beam', project ':beam-examples-java', project ':beam-model-fn-execution',
project ':beam-model-job-management', project ':beam-model-pipeline', project ':beam-runners-apex',
project ':beam-runners-core-construction-java', project ':beam-runners-core-java', project
':beam-runners-direct-java', project ':beam-runners-extensions-java-metrics', project ':beam-runners-flink-1.6',
project ':beam-runners-flink-1.6-job-server', project ':beam-runners-flink-1.6-job-server-container',
project ':beam-runners-flink_2.11', project ':beam-runners-flink_2.11-job-server', project
':beam-runners-flink_2.11-job-server-container', project ':beam-runners-gcp-gcemd', project
':beam-runners-gcp-gcsproxy', project ':beam-runners-gearpump', project ':beam-runners-google-cloud-dataflow-java',
project ':beam-runners-google-cloud-dataflow-java-examples', project ':beam-runners-google-cloud-dataflow-java-examples-streaming',
project ':beam-runners-google-cloud-dataflow-java-fn-api-worker', project ':beam-runners-google-cloud-dataflow-java-legacy-worker',
project ':beam-runners-google-cloud-dataflow-java-windmill', project ':beam-runners-java-fn-execution',
project ':beam-runners-local-java-core', project ':beam-runners-reference-java', project ':beam-runners-reference-job-server',
project ':beam-runners-samza', project ':beam-runners-spark', project ':beam-sdks-go', project
':beam-sdks-go-container', project ':beam-sdks-go-examples', project ':beam-sdks-go-test',
project ':beam-sdks-java-bom', project ':beam-sdks-java-build-tools', project ':beam-sdks-java-container',
project ':beam-sdks-java-core', project ':beam-sdks-java-extensions-euphoria', project ':beam-sdks-java-extensions-google-cloud-platform-core',
project ':beam-sdks-java-extensions-join-library', project ':beam-sdks-java-extensions-json-jackson',
project ':beam-sdks-java-extensions-kryo', project ':beam-sdks-java-extensions-protobuf',
project ':beam-sdks-java-extensions-sketching', project ':beam-sdks-java-extensions-sorter',
project ':beam-sdks-java-extensions-sql', project ':beam-sdks-java-extensions-sql-jdbc', project
':beam-sdks-java-extensions-sql-shell', project ':beam-sdks-java-fn-execution', project ':beam-sdks-java-harness',
project ':beam-sdks-java-io-amazon-web-services', project ':beam-sdks-java-io-amqp', project
':beam-sdks-java-io-cassandra', project ':beam-sdks-java-io-common', project ':beam-sdks-java-io-elasticsearch',
project ':beam-sdks-java-io-elasticsearch-tests-2', project ':beam-sdks-java-io-elasticsearch-tests-5',
project ':beam-sdks-java-io-elasticsearch-tests-6', project ':beam-sdks-java-io-elasticsearch-tests-common',
project ':beam-sdks-java-io-file-based-io-tests', project ':beam-sdks-java-io-google-cloud-platform',
project ':beam-sdks-java-io-hadoop-common', project ':beam-sdks-java-io-hadoop-file-system',
project ':beam-sdks-java-io-hadoop-format', project ':beam-sdks-java-io-hadoop-input-format',
project ':beam-sdks-java-io-hbase', project ':beam-sdks-java-io-hcatalog', project ':beam-sdks-java-io-jdbc',
project ':beam-sdks-java-io-jms', project ':beam-sdks-java-io-kafka', project ':beam-sdks-java-io-kinesis',
project ':beam-sdks-java-io-kudu', project ':beam-sdks-java-io-mongodb', project ':beam-sdks-java-io-mqtt',
project ':beam-sdks-java-io-parquet', project ':beam-sdks-java-io-rabbitmq', project ':beam-sdks-java-io-redis',
project ':beam-sdks-java-io-solr', project ':beam-sdks-java-io-synthetic', project ':beam-sdks-java-io-tika',
project ':beam-sdks-java-io-xml', project ':beam-sdks-java-javadoc', project ':beam-sdks-java-load-tests',
project ':beam-sdks-java-maven-archetypes-examples', project ':beam-sdks-java-maven-archetypes-starter',
project ':beam-sdks-java-nexmark', project ':beam-sdks-java-test-utils', project ':beam-sdks-python',
project ':beam-sdks-python-container', project ':beam-sdks-python-container-py3', project
':beam-sdks-python-precommit-dataflow', project ':beam-test-infra-metrics', project ':beam-vendor-grpc-1_13_1',
project ':beam-vendor-guava-20_0', project ':beam-vendor-sdks-java-extensions-protobuf', project
':beam-website', project ':release']
Parallel execution with configuration on demand is an incubating feature.

> Configure project :
Evaluating root project 'beam' using build file '<https://builds.apache.org/job/beam_PreCommit_Website_Cron/ws/src/build.gradle'.>
Offline dependencies root configured at 'offline-repository'
Selected primary task ':websitePreCommit' from project :

> Configure project :beam-website
Evaluating project ':beam-website' using build file '<https://builds.apache.org/job/beam_PreCommit_Website_Cron/ws/src/website/build.gradle'.>
All projects evaluated.
Tasks to be executed: [task ':beam-website:setupBuildDir', task ':beam-website:buildDockerImage',
task ':beam-website:createDockerContainer', task ':beam-website:startDockerContainer', task
':beam-website:buildLocalWebsite', task ':beam-website:testWebsite', task ':beam-website:stopAndRemoveDockerContainer',
task ':beam-website:preCommit', task ':websitePreCommit']
VisTEG: Dependency graph written into <https://builds.apache.org/job/beam_PreCommit_Website_Cron/ws/src/build/reports/visteg.dot>
:beam-website:setupBuildDir (Thread[Task worker for ':',5,main]) started.

> Task :beam-website:setupBuildDir
Build cache key for task ':beam-website:setupBuildDir' is fb2b365f958e0219d3a886db810dc756
Caching disabled for task ':beam-website:setupBuildDir': Caching has not been enabled for
the task
Task ':beam-website:setupBuildDir' is not up-to-date because:
  No history is available.
:beam-website:setupBuildDir (Thread[Task worker for ':',5,main]) completed. Took 0.091 secs.
:beam-website:buildDockerImage (Thread[Task worker for ':' Thread 11,5,main]) started.

> Task :beam-website:buildDockerImage
Caching disabled for task ':beam-website:buildDockerImage': Caching has not been enabled for
the task
Task ':beam-website:buildDockerImage' is not up-to-date because:
  Task has not declared any outputs despite executing actions.
Starting process 'command 'docker''. Working directory: <https://builds.apache.org/job/beam_PreCommit_Website_Cron/ws/src/website>
Command: docker build -t beam-website .
Successfully started process 'command 'docker''
Sending build context to Docker daemon  26.38MB

Step 1/7 : FROM ruby:2.5
 ---> 6fc6e4e7a8ee
Step 2/7 : WORKDIR /ruby
 ---> Using cache
 ---> acf4f90a7cde
Step 3/7 : RUN gem install bundler
 ---> Using cache
 ---> 81aa3d90e297
Step 4/7 : ADD Gemfile Gemfile.lock /ruby/
 ---> Using cache
 ---> 2d54dde9bd90
Step 5/7 : RUN bundle install --deployment --path $GEM_HOME
 ---> Using cache
 ---> 40d50b1f587d
Step 6/7 : ENV LC_ALL C.UTF-8
 ---> Using cache
 ---> 6108c0ad835b
Step 7/7 : CMD sleep 3600
 ---> Using cache
 ---> 439e7ec2889f
Successfully built 439e7ec2889f
Successfully tagged beam-website:latest
:beam-website:buildDockerImage (Thread[Task worker for ':' Thread 11,5,main]) completed. Took
0.39 secs.
:beam-website:createDockerContainer (Thread[Task worker for ':' Thread 11,5,main]) started.

> Task :beam-website:createDockerContainer
Caching disabled for task ':beam-website:createDockerContainer': Caching has not been enabled
for the task
Task ':beam-website:createDockerContainer' is not up-to-date because:
  Task has not declared any outputs despite executing actions.
Starting process 'command '/bin/bash''. Working directory: <https://builds.apache.org/job/beam_PreCommit_Website_Cron/ws/src/website>
Command: /bin/bash -c docker create -v <https://builds.apache.org/job/beam_PreCommit_Website_Cron/ws/src>:/repo
-u $(id -u):$(id -g)  beam-website
Successfully started process 'command '/bin/bash''
:beam-website:createDockerContainer (Thread[Task worker for ':' Thread 11,5,main]) completed.
Took 0.56 secs.
:beam-website:startDockerContainer (Thread[Task worker for ':' Thread 11,5,main]) started.

> Task :beam-website:startDockerContainer
Caching disabled for task ':beam-website:startDockerContainer': Caching has not been enabled
for the task
Task ':beam-website:startDockerContainer' is not up-to-date because:
  Task has not declared any outputs despite executing actions.
Starting process 'command 'docker''. Working directory: <https://builds.apache.org/job/beam_PreCommit_Website_Cron/ws/src/website>
Command: docker start 9902182c0fbe74441f9561e40cee02756e8b15b92d90ec055322bc4a703d8775
Successfully started process 'command 'docker''
9902182c0fbe74441f9561e40cee02756e8b15b92d90ec055322bc4a703d8775
:beam-website:startDockerContainer (Thread[Task worker for ':' Thread 11,5,main]) completed.
Took 0.434 secs.
:beam-website:buildLocalWebsite (Thread[Task worker for ':' Thread 11,5,main]) started.

> Task :beam-website:buildLocalWebsite
Build cache key for task ':beam-website:buildLocalWebsite' is d2ab156100fa552086ca959c00e7b6e6
Caching disabled for task ':beam-website:buildLocalWebsite': Caching has not been enabled
for the task
Task ':beam-website:buildLocalWebsite' is not up-to-date because:
  No history is available.
Starting process 'command 'docker''. Working directory: <https://builds.apache.org/job/beam_PreCommit_Website_Cron/ws/src/website>
Command: docker exec 9902182c0fbe74441f9561e40cee02756e8b15b92d90ec055322bc4a703d8775 /bin/bash
-c cd /repo/build/website &&         bundle exec jekyll build 	--destination generated-local-content
        --config /repo/website/_config.yml,/repo/website/_config_test.yml         --incremental
         --source /repo/website/src
        
Successfully started process 'command 'docker''
`/` is not writable.
Bundler will use `/tmp/bundler/home/unknown' as your home directory temporarily.
Configuration file: /repo/website/_config.yml
Configuration file: /repo/website/_config_test.yml
            Source: /repo/website/src
       Destination: generated-local-content
 Incremental build: enabled
      Generating... 
                    done in 13.335 seconds.
 Auto-regeneration: disabled. Use --watch to enable.
:beam-website:buildLocalWebsite (Thread[Task worker for ':' Thread 11,5,main]) completed.
Took 15.143 secs.
:beam-website:testWebsite (Thread[Task worker for ':' Thread 11,5,main]) started.

> Task :beam-website:testWebsite
Caching disabled for task ':beam-website:testWebsite': Caching has not been enabled for the
task
Task ':beam-website:testWebsite' is not up-to-date because:
  Task has not declared any outputs despite executing actions.
Starting process 'command 'docker''. Working directory: <https://builds.apache.org/job/beam_PreCommit_Website_Cron/ws/src/website>
Command: docker exec 9902182c0fbe74441f9561e40cee02756e8b15b92d90ec055322bc4a703d8775 /bin/bash
-c cd /repo/build/website &&       bundle exec rake test
Successfully started process 'command 'docker''
`/` is not writable.
Bundler will use `/tmp/bundler/home/unknown' as your home directory temporarily.
Running ["LinkCheck", "ScriptCheck", "ImageCheck", "HtmlCheck"] on ["./generated-local-content"]
on *.html... 


Checking 737 external links...
Ran on 181 files!


- ./generated-local-content/contribute/become-a-committer/index.html
  *  External link https://lists.apache.org/trends.html?dev@beam.apache.org failed: got a
time out (response code 0)
rake aborted!
HTML-Proofer found 1 failure!
/usr/local/bundle/ruby/2.5.0/gems/html-proofer-3.8.0/lib/html-proofer/runner.rb:167:in `print_failed_tests'
/usr/local/bundle/ruby/2.5.0/gems/html-proofer-3.8.0/lib/html-proofer/runner.rb:48:in `run'
/repo/build/website/Rakefile:23:in `block in <top (required)>'
/usr/local/bundle/ruby/2.5.0/gems/rake-12.3.0/exe/rake:27:in `<top (required)>'
/usr/local/bundle/bin/bundle:23:in `load'
/usr/local/bundle/bin/bundle:23:in `<main>'
Tasks: TOP => test
(See full trace by running task with --trace)

> Task :beam-website:testWebsite FAILED
:beam-website:testWebsite (Thread[Task worker for ':' Thread 11,5,main]) completed. Took 2
mins 37.243 secs.
:beam-website:stopAndRemoveDockerContainer (Thread[Task worker for ':' Thread 11,5,main])
started.

> Task :beam-website:stopAndRemoveDockerContainer
Caching disabled for task ':beam-website:stopAndRemoveDockerContainer': Caching has not been
enabled for the task
Task ':beam-website:stopAndRemoveDockerContainer' is not up-to-date because:
  Task has not declared any outputs despite executing actions.
Starting process 'command 'docker''. Working directory: <https://builds.apache.org/job/beam_PreCommit_Website_Cron/ws/src/website>
Command: docker rm -f 9902182c0fbe74441f9561e40cee02756e8b15b92d90ec055322bc4a703d8775
Successfully started process 'command 'docker''
9902182c0fbe74441f9561e40cee02756e8b15b92d90ec055322bc4a703d8775
:beam-website:stopAndRemoveDockerContainer (Thread[Task worker for ':' Thread 11,5,main])
completed. Took 0.353 secs.

FAILURE: Build failed with an exception.

* What went wrong:
Execution failed for task ':beam-website:testWebsite'.
> Process 'command 'docker'' finished with non-zero exit value 1

* Try:
Run with --stacktrace option to get the stack trace. Run with --debug option to get more log
output. Run with --scan to get full insights.

* Get more help at https://help.gradle.org

BUILD FAILED in 3m 5s
7 actionable tasks: 7 executed

Publishing build scan...
https://gradle.com/s/6xpeoyfawvafa

Closing Git repo: <https://builds.apache.org/job/beam_PreCommit_Website_Cron/ws/src/.git>
Build step 'Invoke Gradle script' changed build result to FAILURE
Build step 'Invoke Gradle script' marked build as failure

---------------------------------------------------------------------
To unsubscribe, e-mail: builds-unsubscribe@beam.apache.org
For additional commands, e-mail: builds-help@beam.apache.org


Mime
View raw message