beam-builds mailing list archives

Site index · List index
Message view « Date » · « Thread »
Top « Date » · « Thread »
From Apache Jenkins Server <jenk...@builds.apache.org>
Subject Build failed in Jenkins: beam_PostCommit_Java #2252
Date Wed, 02 Jan 2019 23:13:00 GMT
See <https://builds.apache.org/job/beam_PostCommit_Java/2252/display/redirect?page=changes>

Changes:

[aaltay] [BEAM-5315] Python 3 port io.source* and io.concat_source* modules

------------------------------------------
[...truncated 4.58 MB...]
    Jan 02, 2019 11:07:30 PM org.apache.beam.runners.dataflow.util.PackageUtil tryStagePackage
    INFO: Uploading /home/jenkins/.gradle/caches/modules-2/files-2.1/org.apache.beam/beam-vendor-grpc-1_13_1/0.2/249a9a576fc6541d87972e2dc24cf11ea8129b8f/beam-vendor-grpc-1_13_1-0.2.jar
to gs://temp-storage-for-end-to-end-tests/spannerwriteit0testreportfailures-jenkins-0102230728-8d5472f8/output/results/staging/beam-vendor-grpc-1_13_1-0.2-2fE94kZQ2ONeR3ea5r0PvA.jar
    Jan 02, 2019 11:07:30 PM org.apache.beam.runners.dataflow.util.PackageUtil tryStagePackage
    INFO: Uploading /home/jenkins/.gradle/caches/modules-2/files-2.1/com.esotericsoftware.minlog/minlog/1.2/59bfcd171d82f9981a5e242b9e840191f650e209/minlog-1.2.jar
to gs://temp-storage-for-end-to-end-tests/spannerwriteit0testreportfailures-jenkins-0102230728-8d5472f8/output/results/staging/minlog-1.2-98-99jtn3wu_pMfLJgiFvA.jar
    Jan 02, 2019 11:07:30 PM org.apache.beam.runners.dataflow.util.PackageUtil tryStagePackage
    INFO: Uploading /home/jenkins/.gradle/caches/modules-2/files-2.1/org.powermock/powermock-core/1.6.4/a14be0d1805c3ecad7526671aff6c34f498d1860/powermock-core-1.6.4-sources.jar
to gs://temp-storage-for-end-to-end-tests/spannerwriteit0testreportfailures-jenkins-0102230728-8d5472f8/output/results/staging/powermock-core-1.6.4-sources-6lfOhNBrlWBEBKmRxNlL-g.jar
    Jan 02, 2019 11:07:30 PM org.apache.beam.runners.dataflow.util.PackageUtil tryStagePackage
    INFO: Uploading /home/jenkins/.gradle/caches/modules-2/files-2.1/io.netty/netty-transport/4.1.25.Final/19a6f1f649894b6705aa9d8cbcced188dff133b0/netty-transport-4.1.25.Final.jar
to gs://temp-storage-for-end-to-end-tests/spannerwriteit0testreportfailures-jenkins-0102230728-8d5472f8/output/results/staging/netty-transport-4.1.25.Final-3-E9kW1IVWJlpjxjfs5xBA.jar
    Jan 02, 2019 11:07:30 PM org.apache.beam.runners.dataflow.util.PackageUtil tryStagePackage
    INFO: Uploading /home/jenkins/.gradle/caches/modules-2/files-2.1/io.netty/netty-resolver/4.1.25.Final/dc0965d00746b782b33f419b005cbc130973030d/netty-resolver-4.1.25.Final.jar
to gs://temp-storage-for-end-to-end-tests/spannerwriteit0testreportfailures-jenkins-0102230728-8d5472f8/output/results/staging/netty-resolver-4.1.25.Final-P7rE-qrpxYHhZqQizPWgXw.jar
    Jan 02, 2019 11:07:30 PM org.apache.beam.runners.dataflow.util.PackageUtil tryStagePackage
    INFO: Uploading /home/jenkins/.gradle/caches/modules-2/files-2.1/org.objenesis/objenesis/2.6/639033469776fd37c08358c6b92a4761feb2af4b/objenesis-2.6.jar
to gs://temp-storage-for-end-to-end-tests/spannerwriteit0testreportfailures-jenkins-0102230728-8d5472f8/output/results/staging/objenesis-2.6-X_rD9RQFypspFZcKIks-jw.jar
    Jan 02, 2019 11:07:30 PM org.apache.beam.runners.dataflow.util.PackageUtil tryStagePackage
    INFO: Uploading /home/jenkins/.gradle/caches/modules-2/files-2.1/com.esotericsoftware.reflectasm/reflectasm/1.07/76f11c94a53ee975a0d9154b325c408b210155bd/reflectasm-1.07-shaded.jar
to gs://temp-storage-for-end-to-end-tests/spannerwriteit0testreportfailures-jenkins-0102230728-8d5472f8/output/results/staging/reflectasm-1.07-shaded-IELCIoQPsh49E873w5ZYMQ.jar
    Jan 02, 2019 11:07:30 PM org.apache.beam.runners.dataflow.util.PackageUtil tryStagePackage
    INFO: Uploading /home/jenkins/.gradle/caches/modules-2/files-2.1/org.javaruntype/javaruntype/1.3/26ba963f4b20c751e07b58b990bb41bf850622d8/javaruntype-1.3.jar
to gs://temp-storage-for-end-to-end-tests/spannerwriteit0testreportfailures-jenkins-0102230728-8d5472f8/output/results/staging/javaruntype-1.3-rOez6Sa6vLqndviPQ7_noQ.jar
    Jan 02, 2019 11:07:30 PM org.apache.beam.runners.dataflow.util.PackageUtil tryStagePackage
    INFO: Uploading /home/jenkins/.gradle/caches/modules-2/files-2.1/org.apache.httpcomponents/httpcore/4.4.9/a86ce739e5a7175b4b234c290a00a5fdb80957a0/httpcore-4.4.9.jar
to gs://temp-storage-for-end-to-end-tests/spannerwriteit0testreportfailures-jenkins-0102230728-8d5472f8/output/results/staging/httpcore-4.4.9-uJRVUHg5wJ1hGWYd79IWag.jar
    Jan 02, 2019 11:07:30 PM org.apache.beam.runners.dataflow.util.PackageUtil tryStagePackage
    INFO: Uploading /home/jenkins/.gradle/caches/modules-2/files-2.1/org.powermock/powermock-module-junit3/1.6.4/3fbdbc0a435a45d9fa9db8cafc0c0b3fc0e3776a/powermock-module-junit3-1.6.4.jar
to gs://temp-storage-for-end-to-end-tests/spannerwriteit0testreportfailures-jenkins-0102230728-8d5472f8/output/results/staging/powermock-module-junit3-1.6.4-ubMpYIiOciKneJxfj2Jp6Q.jar
    Jan 02, 2019 11:07:30 PM org.apache.beam.runners.dataflow.util.PackageUtil tryStagePackage
    INFO: Uploading /home/jenkins/.gradle/caches/modules-2/files-2.1/org.antlr/antlr-runtime/3.1.2/c4ca32c2be1b22a5553dd3171f51f9b2b04030b/antlr-runtime-3.1.2.jar
to gs://temp-storage-for-end-to-end-tests/spannerwriteit0testreportfailures-jenkins-0102230728-8d5472f8/output/results/staging/antlr-runtime-3.1.2-dpdEvr2kPK4dWHj9fUOv1A.jar
    Jan 02, 2019 11:07:30 PM org.apache.beam.runners.dataflow.util.PackageUtil tryStagePackage
    INFO: Uploading /home/jenkins/.gradle/caches/modules-2/files-2.1/org.ow2.asm/asm/4.0/659add6efc75a4715d738e73f07505246edf4d66/asm-4.0.jar
to gs://temp-storage-for-end-to-end-tests/spannerwriteit0testreportfailures-jenkins-0102230728-8d5472f8/output/results/staging/asm-4.0-Mi2PiMURGvYS34OMAZHNfg.jar
    Jan 02, 2019 11:07:30 PM org.apache.beam.runners.dataflow.util.PackageUtil tryStagePackage
    INFO: Uploading /home/jenkins/.gradle/caches/modules-2/files-2.1/commons-codec/commons-codec/1.10/4b95f4897fa13f2cd904aee711aeafc0c5295cd8/commons-codec-1.10.jar
to gs://temp-storage-for-end-to-end-tests/spannerwriteit0testreportfailures-jenkins-0102230728-8d5472f8/output/results/staging/commons-codec-1.10-NTz2or26CVlcz6Bzt4x_yw.jar
    Jan 02, 2019 11:07:30 PM org.apache.beam.runners.dataflow.util.PackageUtil tryStagePackage
    INFO: Uploading /home/jenkins/.gradle/caches/modules-2/files-2.1/org.yaml/snakeyaml/1.23/ec62d74fe50689c28c0ff5b35d3aebcaa8b5be68/snakeyaml-1.23.jar
to gs://temp-storage-for-end-to-end-tests/spannerwriteit0testreportfailures-jenkins-0102230728-8d5472f8/output/results/staging/snakeyaml-1.23-ZOyL0mttUDSofsscjODv3A.jar
    Jan 02, 2019 11:07:30 PM org.apache.beam.runners.dataflow.util.PackageUtil tryStagePackage
    INFO: Uploading /home/jenkins/.gradle/caches/modules-2/files-2.1/com.beust/jcommander/1.27/58c9cbf0f1fa296f93c712f2cf46de50471920f9/jcommander-1.27.jar
to gs://temp-storage-for-end-to-end-tests/spannerwriteit0testreportfailures-jenkins-0102230728-8d5472f8/output/results/staging/jcommander-1.27-YxYbyOYD5gurYr1hw0nzcA.jar
    Jan 02, 2019 11:07:30 PM org.apache.beam.runners.dataflow.util.PackageUtil tryStagePackage
    INFO: Uploading /home/jenkins/.gradle/caches/modules-2/files-2.1/ognl/ognl/3.1.12/a7fa0db32f882cd3bb41ec6c489853b3bfb6aebc/ognl-3.1.12.jar
to gs://temp-storage-for-end-to-end-tests/spannerwriteit0testreportfailures-jenkins-0102230728-8d5472f8/output/results/staging/ognl-3.1.12-aq6HFAi1aHiNX6qcImOsmw.jar
    Jan 02, 2019 11:07:30 PM org.apache.beam.runners.dataflow.util.PackageUtil tryStagePackage
    INFO: Uploading /home/jenkins/.gradle/caches/modules-2/files-2.1/io.netty/netty-common/4.1.25.Final/e17d5c05c101fe14536ce3fb34b36c54e04791f6/netty-common-4.1.25.Final.jar
to gs://temp-storage-for-end-to-end-tests/spannerwriteit0testreportfailures-jenkins-0102230728-8d5472f8/output/results/staging/netty-common-4.1.25.Final-cYwMY1_F2pzboFUnBL3CxQ.jar
    Jan 02, 2019 11:07:30 PM org.apache.beam.runners.dataflow.util.PackageUtil tryStagePackage
    INFO: Uploading /home/jenkins/.gradle/caches/modules-2/files-2.1/org.testng/testng/6.8.21/15e02d8d7be3c3640b585b97eda56026fdb5bf4d/testng-6.8.21.jar
to gs://temp-storage-for-end-to-end-tests/spannerwriteit0testreportfailures-jenkins-0102230728-8d5472f8/output/results/staging/testng-6.8.21-4nE6Pd5l58HFjEGfLzL88Q.jar
    Jan 02, 2019 11:07:30 PM org.apache.beam.runners.dataflow.util.PackageUtil tryStagePackage
    INFO: Uploading /home/jenkins/.gradle/caches/modules-2/files-2.1/org.beanshell/bsh/2.0b4/a05f0a0feefa8d8467ac80e16e7de071489f0d9c/bsh-2.0b4.jar
to gs://temp-storage-for-end-to-end-tests/spannerwriteit0testreportfailures-jenkins-0102230728-8d5472f8/output/results/staging/bsh-2.0b4-ocYKqDycmmyyORwcG4XrAA.jar
    Jan 02, 2019 11:07:30 PM org.apache.beam.runners.dataflow.util.PackageUtil tryStagePackage
    INFO: Uploading /home/jenkins/.gradle/caches/modules-2/files-2.1/org.xerial.snappy/snappy-java/1.1.4/d94ae6d7d27242eaa4b6c323f881edbb98e48da6/snappy-java-1.1.4.jar
to gs://temp-storage-for-end-to-end-tests/spannerwriteit0testreportfailures-jenkins-0102230728-8d5472f8/output/results/staging/snappy-java-1.1.4-SFNwbMuGq13aaoKVzeS1Tw.jar
    Jan 02, 2019 11:07:31 PM org.apache.beam.runners.dataflow.util.PackageUtil tryStagePackage
    INFO: Uploading /home/jenkins/.gradle/caches/modules-2/files-2.1/com.squareup.okhttp/okhttp/2.5.0/4de2b4ed3445c37ec1720a7d214712e845a24636/okhttp-2.5.0.jar
to gs://temp-storage-for-end-to-end-tests/spannerwriteit0testreportfailures-jenkins-0102230728-8d5472f8/output/results/staging/okhttp-2.5.0-64v0X4G_nxfR_PsuymOqpg.jar
    Jan 02, 2019 11:07:31 PM org.apache.beam.runners.dataflow.util.PackageUtil tryStagePackage
    INFO: Uploading /home/jenkins/.gradle/caches/modules-2/files-2.1/io.netty/netty-tcnative-boringssl-static/2.0.8.Final/5c3483dfa33cd04f5469c95abf67e1b69a8f1221/netty-tcnative-boringssl-static-2.0.8.Final.jar
to gs://temp-storage-for-end-to-end-tests/spannerwriteit0testreportfailures-jenkins-0102230728-8d5472f8/output/results/staging/netty-tcnative-boringssl-static-2.0.8.Final-RCm0wU8kBdzNqqi47Z837A.jar
    Jan 02, 2019 11:07:31 PM org.apache.beam.runners.dataflow.util.PackageUtil tryStagePackage
    INFO: Uploading <https://builds.apache.org/job/beam_PostCommit_Java/ws/src/runners/google-cloud-dataflow-java/worker/legacy-worker/build/libs/beam-runners-google-cloud-dataflow-java-legacy-worker-2.10.0-SNAPSHOT.jar>
to gs://temp-storage-for-end-to-end-tests/spannerwriteit0testreportfailures-jenkins-0102230728-8d5472f8/output/results/staging/beam-runners-google-cloud-dataflow-java-legacy-worker-2.10.0-SNAPSHOT-Jl11r3LUWp57EX1SneRK6g.jar
    Jan 02, 2019 11:07:31 PM org.apache.beam.runners.dataflow.util.PackageUtil tryStagePackage
    INFO: Uploading /home/jenkins/.gradle/caches/modules-2/files-2.1/org.javassist/javassist/3.20.0-GA/a9cbcdfb7e9f86fbc74d3afae65f2248bfbf82a0/javassist-3.20.0-GA.jar
to gs://temp-storage-for-end-to-end-tests/spannerwriteit0testreportfailures-jenkins-0102230728-8d5472f8/output/results/staging/javassist-3.20.0-GA-qJ3XkH124GHsLAfnYqdCVg.jar
    Jan 02, 2019 11:07:31 PM org.apache.beam.runners.dataflow.util.PackageUtil tryStagePackage
    INFO: Uploading /home/jenkins/.gradle/caches/modules-2/files-2.1/io.grpc/grpc-netty-shaded/1.13.1/ccdc4f2c2791d93164c574fbfb90d614aa0849ae/grpc-netty-shaded-1.13.1.jar
to gs://temp-storage-for-end-to-end-tests/spannerwriteit0testreportfailures-jenkins-0102230728-8d5472f8/output/results/staging/grpc-netty-shaded-1.13.1-YS-LK7_gIZl0B4Kw_7Rw7A.jar
    Jan 02, 2019 11:07:31 PM org.apache.beam.runners.dataflow.util.PackageUtil tryStagePackage
    INFO: Uploading <https://builds.apache.org/job/beam_PostCommit_Java/ws/src/runners/direct-java/build/libs/beam-runners-direct-java-2.10.0-SNAPSHOT.jar>
to gs://temp-storage-for-end-to-end-tests/spannerwriteit0testreportfailures-jenkins-0102230728-8d5472f8/output/results/staging/beam-runners-direct-java-2.10.0-SNAPSHOT-Z4uF8naMK2f3bD2WVP_Xog.jar
    Jan 02, 2019 11:07:33 PM org.apache.beam.runners.dataflow.util.PackageUtil stageClasspathElements
    INFO: Staging files complete: 0 files cached, 162 files newly uploaded in 4 seconds
    Jan 02, 2019 11:07:33 PM org.apache.beam.runners.dataflow.DataflowPipelineTranslator$Translator
addStep
    INFO: Adding GenerateSequence/Read(BoundedCountingSource) as step s1
    Jan 02, 2019 11:07:33 PM org.apache.beam.runners.dataflow.DataflowPipelineTranslator$Translator
addStep
    INFO: Adding ParDo(GenerateMutations) as step s2
    Jan 02, 2019 11:07:33 PM org.apache.beam.runners.dataflow.DataflowPipelineTranslator$Translator
addStep
    INFO: Adding SpannerIO.Write/To mutation group as step s3
    Jan 02, 2019 11:07:33 PM org.apache.beam.runners.dataflow.DataflowPipelineTranslator$Translator
addStep
    INFO: Adding SpannerIO.Write/Write mutations to Cloud Spanner/Create Seed/Read(CreateSource)
as step s4
    Jan 02, 2019 11:07:33 PM org.apache.beam.runners.dataflow.DataflowPipelineTranslator$Translator
addStep
    INFO: Adding SpannerIO.Write/Write mutations to Cloud Spanner/Read information schema
as step s5
    Jan 02, 2019 11:07:33 PM org.apache.beam.runners.dataflow.DataflowPipelineTranslator$Translator
addStep
    INFO: Adding SpannerIO.Write/Write mutations to Cloud Spanner/Schema View/Combine.GloballyAsSingletonView/Combine.globally(Singleton)/WithKeys/AddKeys/Map
as step s6
    Jan 02, 2019 11:07:33 PM org.apache.beam.runners.dataflow.DataflowPipelineTranslator$Translator
addStep
    INFO: Adding SpannerIO.Write/Write mutations to Cloud Spanner/Schema View/Combine.GloballyAsSingletonView/Combine.globally(Singleton)/Combine.perKey(Singleton)/GroupByKey
as step s7
    Jan 02, 2019 11:07:33 PM org.apache.beam.runners.dataflow.DataflowPipelineTranslator$Translator
addStep
    INFO: Adding SpannerIO.Write/Write mutations to Cloud Spanner/Schema View/Combine.GloballyAsSingletonView/Combine.globally(Singleton)/Combine.perKey(Singleton)/Combine.GroupedValues
as step s8
    Jan 02, 2019 11:07:33 PM org.apache.beam.runners.dataflow.DataflowPipelineTranslator$Translator
addStep
    INFO: Adding SpannerIO.Write/Write mutations to Cloud Spanner/Schema View/Combine.GloballyAsSingletonView/Combine.globally(Singleton)/Values/Values/Map
as step s9
    Jan 02, 2019 11:07:33 PM org.apache.beam.runners.dataflow.DataflowPipelineTranslator$Translator
addStep
    INFO: Adding SpannerIO.Write/Write mutations to Cloud Spanner/Schema View/Combine.GloballyAsSingletonView/BatchViewOverrides.GroupByWindowHashAsKeyAndWindowAsSortKey/ParDo(UseWindowHashAsKeyAndWindowAsSortKey)
as step s10
    Jan 02, 2019 11:07:33 PM org.apache.beam.runners.dataflow.DataflowPipelineTranslator$Translator
addStep
    INFO: Adding SpannerIO.Write/Write mutations to Cloud Spanner/Schema View/Combine.GloballyAsSingletonView/BatchViewOverrides.GroupByWindowHashAsKeyAndWindowAsSortKey/BatchViewOverrides.GroupByKeyAndSortValuesOnly
as step s11
    Jan 02, 2019 11:07:33 PM org.apache.beam.runners.dataflow.DataflowPipelineTranslator$Translator
addStep
    INFO: Adding SpannerIO.Write/Write mutations to Cloud Spanner/Schema View/Combine.GloballyAsSingletonView/ParDo(IsmRecordForSingularValuePerWindow)
as step s12
    Jan 02, 2019 11:07:33 PM org.apache.beam.runners.dataflow.DataflowPipelineTranslator$Translator
addStep
    INFO: Adding SpannerIO.Write/Write mutations to Cloud Spanner/Schema View/Combine.GloballyAsSingletonView/CreateDataflowView
as step s13
    Jan 02, 2019 11:07:33 PM org.apache.beam.runners.dataflow.DataflowPipelineTranslator$Translator
addStep
    INFO: Adding SpannerIO.Write/Write mutations to Cloud Spanner/To Global Window/Window.Assign
as step s14
    Jan 02, 2019 11:07:33 PM org.apache.beam.runners.dataflow.DataflowPipelineTranslator$Translator
addStep
    INFO: Adding SpannerIO.Write/Write mutations to Cloud Spanner/Filter Unbatchable Mutations
as step s15
    Jan 02, 2019 11:07:33 PM org.apache.beam.runners.dataflow.DataflowPipelineTranslator$Translator
addStep
    INFO: Adding SpannerIO.Write/Write mutations to Cloud Spanner/Gather And Sort as step
s16
    Jan 02, 2019 11:07:33 PM org.apache.beam.runners.dataflow.DataflowPipelineTranslator$Translator
addStep
    INFO: Adding SpannerIO.Write/Write mutations to Cloud Spanner/Create Batches as step s17
    Jan 02, 2019 11:07:33 PM org.apache.beam.runners.dataflow.DataflowPipelineTranslator$Translator
addStep
    INFO: Adding SpannerIO.Write/Write mutations to Cloud Spanner/Merge as step s18
    Jan 02, 2019 11:07:33 PM org.apache.beam.runners.dataflow.DataflowPipelineTranslator$Translator
addStep
    INFO: Adding SpannerIO.Write/Write mutations to Cloud Spanner/Write mutations to Spanner
as step s19
    Jan 02, 2019 11:07:33 PM org.apache.beam.runners.dataflow.DataflowRunner run
    INFO: Staging pipeline description to gs://temp-storage-for-end-to-end-tests/spannerwriteit0testreportfailures-jenkins-0102230728-8d5472f8/output/results/staging/
    Jan 02, 2019 11:07:33 PM org.apache.beam.runners.dataflow.util.PackageUtil tryStagePackage
    INFO: Uploading <56476 bytes, hash Z4F4LgGZNkmmRlSMkZ_N6w> to gs://temp-storage-for-end-to-end-tests/spannerwriteit0testreportfailures-jenkins-0102230728-8d5472f8/output/results/staging/pipeline-Z4F4LgGZNkmmRlSMkZ_N6w.pb

org.apache.beam.sdk.io.gcp.spanner.SpannerWriteIT > testReportFailures STANDARD_OUT
    Dataflow SDK version: 2.10.0-SNAPSHOT

org.apache.beam.sdk.io.gcp.spanner.SpannerWriteIT > testReportFailures STANDARD_ERROR
    Jan 02, 2019 11:07:34 PM org.apache.beam.runners.dataflow.DataflowRunner run
    INFO: To access the Dataflow monitoring console, please navigate to https://console.cloud.google.com/dataflow/jobsDetail/locations/us-central1/jobs/2019-01-02_15_07_33-16228586759382555117?project=apache-beam-testing

org.apache.beam.sdk.io.gcp.spanner.SpannerWriteIT > testReportFailures STANDARD_OUT
    Submitted job: 2019-01-02_15_07_33-16228586759382555117

org.apache.beam.sdk.io.gcp.spanner.SpannerWriteIT > testReportFailures STANDARD_ERROR
    Jan 02, 2019 11:07:34 PM org.apache.beam.runners.dataflow.DataflowRunner run
    INFO: To cancel the job using the 'gcloud' tool, run:
    > gcloud dataflow jobs --project=apache-beam-testing cancel --region=us-central1 2019-01-02_15_07_33-16228586759382555117
    Jan 02, 2019 11:07:34 PM org.apache.beam.runners.dataflow.TestDataflowRunner run
    INFO: Running Dataflow job 2019-01-02_15_07_33-16228586759382555117 with 0 expected assertions.
    Jan 02, 2019 11:07:51 PM org.apache.beam.runners.dataflow.util.MonitoringUtil$LoggingHandler
process
    INFO: 2019-01-02T23:07:33.665Z: Autoscaling is enabled for job 2019-01-02_15_07_33-16228586759382555117.
The number of workers will be between 1 and 1000.
    Jan 02, 2019 11:07:51 PM org.apache.beam.runners.dataflow.util.MonitoringUtil$LoggingHandler
process
    INFO: 2019-01-02T23:07:33.801Z: Autoscaling was automatically enabled for job 2019-01-02_15_07_33-16228586759382555117.
    Jan 02, 2019 11:07:51 PM org.apache.beam.runners.dataflow.util.MonitoringUtil$LoggingHandler
process
    INFO: 2019-01-02T23:07:36.440Z: Checking permissions granted to controller Service Account.
    Jan 02, 2019 11:07:51 PM org.apache.beam.runners.dataflow.util.MonitoringUtil$LoggingHandler
process
    INFO: 2019-01-02T23:07:45.816Z: Worker configuration: n1-standard-1 in us-central1-b.
    Jan 02, 2019 11:07:51 PM org.apache.beam.runners.dataflow.util.MonitoringUtil$LoggingHandler
process
    INFO: 2019-01-02T23:07:46.574Z: Expanding CoGroupByKey operations into optimizable parts.
    Jan 02, 2019 11:07:51 PM org.apache.beam.runners.dataflow.util.MonitoringUtil$LoggingHandler
process
    INFO: 2019-01-02T23:07:46.657Z: Expanding GroupByKey operations into optimizable parts.
    Jan 02, 2019 11:07:51 PM org.apache.beam.runners.dataflow.util.MonitoringUtil$LoggingHandler
process
    INFO: 2019-01-02T23:07:46.703Z: Lifting ValueCombiningMappingFns into MergeBucketsMappingFns
    Jan 02, 2019 11:07:51 PM org.apache.beam.runners.dataflow.util.MonitoringUtil$LoggingHandler
process
    INFO: 2019-01-02T23:07:46.851Z: Fusing adjacent ParDo, Read, Write, and Flatten operations
    Jan 02, 2019 11:07:51 PM org.apache.beam.runners.dataflow.util.MonitoringUtil$LoggingHandler
process
    INFO: 2019-01-02T23:07:46.893Z: Fusing consumer SpannerIO.Write/Write mutations to Cloud
Spanner/Read information schema into SpannerIO.Write/Write mutations to Cloud Spanner/Create
Seed/Read(CreateSource)
    Jan 02, 2019 11:07:51 PM org.apache.beam.runners.dataflow.util.MonitoringUtil$LoggingHandler
process
    INFO: 2019-01-02T23:07:46.935Z: Fusing consumer SpannerIO.Write/Write mutations to Cloud
Spanner/Schema View/Combine.GloballyAsSingletonView/Combine.globally(Singleton)/Combine.perKey(Singleton)/GroupByKey+SpannerIO.Write/Write
mutations to Cloud Spanner/Schema View/Combine.GloballyAsSingletonView/Combine.globally(Singleton)/Combine.perKey(Singleton)/Combine.GroupedValues/Partial
into SpannerIO.Write/Write mutations to Cloud Spanner/Schema View/Combine.GloballyAsSingletonView/Combine.globally(Singleton)/WithKeys/AddKeys/Map
    Jan 02, 2019 11:07:51 PM org.apache.beam.runners.dataflow.util.MonitoringUtil$LoggingHandler
process
    INFO: 2019-01-02T23:07:46.981Z: Fusing consumer SpannerIO.Write/Write mutations to Cloud
Spanner/Schema View/Combine.GloballyAsSingletonView/Combine.globally(Singleton)/Combine.perKey(Singleton)/Combine.GroupedValues
into SpannerIO.Write/Write mutations to Cloud Spanner/Schema View/Combine.GloballyAsSingletonView/Combine.globally(Singleton)/Combine.perKey(Singleton)/GroupByKey/Read
    Jan 02, 2019 11:07:51 PM org.apache.beam.runners.dataflow.util.MonitoringUtil$LoggingHandler
process
    INFO: 2019-01-02T23:07:47.024Z: Fusing consumer SpannerIO.Write/Write mutations to Cloud
Spanner/Schema View/Combine.GloballyAsSingletonView/Combine.globally(Singleton)/Combine.perKey(Singleton)/GroupByKey/Write
into SpannerIO.Write/Write mutations to Cloud Spanner/Schema View/Combine.GloballyAsSingletonView/Combine.globally(Singleton)/Combine.perKey(Singleton)/GroupByKey/Reify
    Jan 02, 2019 11:07:51 PM org.apache.beam.runners.dataflow.util.MonitoringUtil$LoggingHandler
process
    INFO: 2019-01-02T23:07:47.070Z: Fusing consumer SpannerIO.Write/Write mutations to Cloud
Spanner/Schema View/Combine.GloballyAsSingletonView/ParDo(IsmRecordForSingularValuePerWindow)
into SpannerIO.Write/Write mutations to Cloud Spanner/Schema View/Combine.GloballyAsSingletonView/BatchViewOverrides.GroupByWindowHashAsKeyAndWindowAsSortKey/BatchViewOverrides.GroupByKeyAndSortValuesOnly/Read
    Jan 02, 2019 11:07:51 PM org.apache.beam.runners.dataflow.util.MonitoringUtil$LoggingHandler
process
    INFO: 2019-01-02T23:07:47.114Z: Fusing consumer SpannerIO.Write/Write mutations to Cloud
Spanner/Schema View/Combine.GloballyAsSingletonView/Combine.globally(Singleton)/WithKeys/AddKeys/Map
into SpannerIO.Write/Write mutations to Cloud Spanner/Read information schema
    Jan 02, 2019 11:07:51 PM org.apache.beam.runners.dataflow.util.MonitoringUtil$LoggingHandler
process
    INFO: 2019-01-02T23:07:47.148Z: Fusing consumer SpannerIO.Write/Write mutations to Cloud
Spanner/Schema View/Combine.GloballyAsSingletonView/BatchViewOverrides.GroupByWindowHashAsKeyAndWindowAsSortKey/ParDo(UseWindowHashAsKeyAndWindowAsSortKey)
into SpannerIO.Write/Write mutations to Cloud Spanner/Schema View/Combine.GloballyAsSingletonView/Combine.globally(Singleton)/Values/Values/Map
    Jan 02, 2019 11:07:51 PM org.apache.beam.runners.dataflow.util.MonitoringUtil$LoggingHandler
process
    INFO: 2019-01-02T23:07:47.191Z: Fusing consumer SpannerIO.Write/Write mutations to Cloud
Spanner/Schema View/Combine.GloballyAsSingletonView/BatchViewOverrides.GroupByWindowHashAsKeyAndWindowAsSortKey/BatchViewOverrides.GroupByKeyAndSortValuesOnly/Write
into SpannerIO.Write/Write mutations to Cloud Spanner/Schema View/Combine.GloballyAsSingletonView/BatchViewOverrides.GroupByWindowHashAsKeyAndWindowAsSortKey/ParDo(UseWindowHashAsKeyAndWindowAsSortKey)
    Jan 02, 2019 11:07:51 PM org.apache.beam.runners.dataflow.util.MonitoringUtil$LoggingHandler
process
    INFO: 2019-01-02T23:07:47.239Z: Fusing consumer SpannerIO.Write/Write mutations to Cloud
Spanner/Schema View/Combine.GloballyAsSingletonView/Combine.globally(Singleton)/Combine.perKey(Singleton)/GroupByKey/Reify
into SpannerIO.Write/Write mutations to Cloud Spanner/Schema View/Combine.GloballyAsSingletonView/Combine.globally(Singleton)/Combine.perKey(Singleton)/GroupByKey+SpannerIO.Write/Write
mutations to Cloud Spanner/Schema View/Combine.GloballyAsSingletonView/Combine.globally(Singleton)/Combine.perKey(Singleton)/Combine.GroupedValues/Partial
    Jan 02, 2019 11:07:51 PM org.apache.beam.runners.dataflow.util.MonitoringUtil$LoggingHandler
process
    INFO: 2019-01-02T23:07:47.285Z: Fusing consumer SpannerIO.Write/Write mutations to Cloud
Spanner/Schema View/Combine.GloballyAsSingletonView/Combine.globally(Singleton)/Values/Values/Map
into SpannerIO.Write/Write mutations to Cloud Spanner/Schema View/Combine.GloballyAsSingletonView/Combine.globally(Singleton)/Combine.perKey(Singleton)/Combine.GroupedValues/Extract
    Jan 02, 2019 11:07:51 PM org.apache.beam.runners.dataflow.util.MonitoringUtil$LoggingHandler
process
    INFO: 2019-01-02T23:07:47.337Z: Fusing consumer SpannerIO.Write/Write mutations to Cloud
Spanner/Schema View/Combine.GloballyAsSingletonView/Combine.globally(Singleton)/Combine.perKey(Singleton)/Combine.GroupedValues/Extract
into SpannerIO.Write/Write mutations to Cloud Spanner/Schema View/Combine.GloballyAsSingletonView/Combine.globally(Singleton)/Combine.perKey(Singleton)/Combine.GroupedValues
    Jan 02, 2019 11:07:51 PM org.apache.beam.runners.dataflow.util.MonitoringUtil$LoggingHandler
process
    INFO: 2019-01-02T23:07:47.388Z: Unzipping flatten s18 for input s15.unbatchableMutations
    Jan 02, 2019 11:07:51 PM org.apache.beam.runners.dataflow.util.MonitoringUtil$LoggingHandler
process
    INFO: 2019-01-02T23:07:47.425Z: Fusing unzipped copy of SpannerIO.Write/Write mutations
to Cloud Spanner/Write mutations to Spanner, through flatten SpannerIO.Write/Write mutations
to Cloud Spanner/Merge, into producer SpannerIO.Write/Write mutations to Cloud Spanner/Filter
Unbatchable Mutations
    Jan 02, 2019 11:07:51 PM org.apache.beam.runners.dataflow.util.MonitoringUtil$LoggingHandler
process
    INFO: 2019-01-02T23:07:47.465Z: Fusing consumer SpannerIO.Write/Write mutations to Cloud
Spanner/Write mutations to Spanner into SpannerIO.Write/Write mutations to Cloud Spanner/Create
Batches
    Jan 02, 2019 11:07:51 PM org.apache.beam.runners.dataflow.util.MonitoringUtil$LoggingHandler
process
    INFO: 2019-01-02T23:07:47.510Z: Fusing consumer SpannerIO.Write/Write mutations to Cloud
Spanner/To Global Window/Window.Assign into SpannerIO.Write/To mutation group
    Jan 02, 2019 11:07:51 PM org.apache.beam.runners.dataflow.util.MonitoringUtil$LoggingHandler
process
    INFO: 2019-01-02T23:07:47.557Z: Fusing consumer SpannerIO.Write/To mutation group into
ParDo(GenerateMutations)
    Jan 02, 2019 11:07:51 PM org.apache.beam.runners.dataflow.util.MonitoringUtil$LoggingHandler
process
    INFO: 2019-01-02T23:07:47.602Z: Fusing consumer ParDo(GenerateMutations) into GenerateSequence/Read(BoundedCountingSource)
    Jan 02, 2019 11:07:51 PM org.apache.beam.runners.dataflow.util.MonitoringUtil$LoggingHandler
process
    INFO: 2019-01-02T23:07:47.645Z: Fusing consumer SpannerIO.Write/Write mutations to Cloud
Spanner/Create Batches into SpannerIO.Write/Write mutations to Cloud Spanner/Gather And Sort
    Jan 02, 2019 11:07:51 PM org.apache.beam.runners.dataflow.util.MonitoringUtil$LoggingHandler
process
    INFO: 2019-01-02T23:07:47.685Z: Fusing consumer SpannerIO.Write/Write mutations to Cloud
Spanner/Gather And Sort into SpannerIO.Write/Write mutations to Cloud Spanner/Filter Unbatchable
Mutations
    Jan 02, 2019 11:07:51 PM org.apache.beam.runners.dataflow.util.MonitoringUtil$LoggingHandler
process
    INFO: 2019-01-02T23:07:47.743Z: Fusing consumer SpannerIO.Write/Write mutations to Cloud
Spanner/Filter Unbatchable Mutations into SpannerIO.Write/Write mutations to Cloud Spanner/To
Global Window/Window.Assign
    Jan 02, 2019 11:07:51 PM org.apache.beam.runners.dataflow.util.MonitoringUtil$LoggingHandler
process
    INFO: 2019-01-02T23:07:48.235Z: Executing operation SpannerIO.Write/Write mutations to
Cloud Spanner/Schema View/Combine.GloballyAsSingletonView/BatchViewOverrides.GroupByWindowHashAsKeyAndWindowAsSortKey/BatchViewOverrides.GroupByKeyAndSortValuesOnly/Create
    Jan 02, 2019 11:07:51 PM org.apache.beam.runners.dataflow.util.MonitoringUtil$LoggingHandler
process
    INFO: 2019-01-02T23:07:48.276Z: Executing operation SpannerIO.Write/Write mutations to
Cloud Spanner/Schema View/Combine.GloballyAsSingletonView/Combine.globally(Singleton)/Combine.perKey(Singleton)/GroupByKey/Create
    Jan 02, 2019 11:07:51 PM org.apache.beam.runners.dataflow.util.MonitoringUtil$LoggingHandler
process
    INFO: 2019-01-02T23:07:48.325Z: Starting 1 workers in us-central1-b...
    Jan 02, 2019 11:07:51 PM org.apache.beam.runners.dataflow.util.MonitoringUtil$LoggingHandler
process
    INFO: 2019-01-02T23:07:48.566Z: Executing operation SpannerIO.Write/Write mutations to
Cloud Spanner/Create Seed/Read(CreateSource)+SpannerIO.Write/Write mutations to Cloud Spanner/Read
information schema+SpannerIO.Write/Write mutations to Cloud Spanner/Schema View/Combine.GloballyAsSingletonView/Combine.globally(Singleton)/WithKeys/AddKeys/Map+SpannerIO.Write/Write
mutations to Cloud Spanner/Schema View/Combine.GloballyAsSingletonView/Combine.globally(Singleton)/Combine.perKey(Singleton)/GroupByKey+SpannerIO.Write/Write
mutations to Cloud Spanner/Schema View/Combine.GloballyAsSingletonView/Combine.globally(Singleton)/Combine.perKey(Singleton)/Combine.GroupedValues/Partial+SpannerIO.Write/Write
mutations to Cloud Spanner/Schema View/Combine.GloballyAsSingletonView/Combine.globally(Singleton)/Combine.perKey(Singleton)/GroupByKey/Reify+SpannerIO.Write/Write
mutations to Cloud Spanner/Schema View/Combine.GloballyAsSingletonView/Combine.globally(Singleton)/Combine.perKey(Singleton)/GroupByKey/Write
    Jan 02, 2019 11:08:08 PM org.apache.beam.runners.dataflow.util.MonitoringUtil$LoggingHandler
process
    INFO: 2019-01-02T23:08:08.207Z: Autoscaling: Raised the number of workers to 0 based on
the rate of progress in the currently running step(s).
    Jan 02, 2019 11:08:41 PM org.apache.beam.runners.dataflow.util.MonitoringUtil$LoggingHandler
process
    INFO: 2019-01-02T23:08:40.680Z: Workers have started successfully.
    Jan 02, 2019 11:09:07 PM org.apache.beam.runners.dataflow.util.MonitoringUtil$LoggingHandler
process
    INFO: 2019-01-02T23:09:05.103Z: Autoscaling: Raised the number of workers to 1 based on
the rate of progress in the currently running step(s).
    Jan 02, 2019 11:09:07 PM org.apache.beam.runners.dataflow.util.MonitoringUtil$LoggingHandler
process
    INFO: 2019-01-02T23:09:05.141Z: Autoscaling: Would further reduce the number of workers
but reached the minimum number allowed for the job.
    Jan 02, 2019 11:09:13 PM org.apache.beam.runners.dataflow.util.MonitoringUtil$LoggingHandler
process
    INFO: 2019-01-02T23:09:11.853Z: Workers have started successfully.
    Jan 02, 2019 11:09:16 PM org.apache.beam.runners.dataflow.util.MonitoringUtil$LoggingHandler
process
    INFO: 2019-01-02T23:09:13.228Z: Executing operation SpannerIO.Write/Write mutations to
Cloud Spanner/Schema View/Combine.GloballyAsSingletonView/Combine.globally(Singleton)/Combine.perKey(Singleton)/GroupByKey/Close
    Jan 02, 2019 11:09:16 PM org.apache.beam.runners.dataflow.util.MonitoringUtil$LoggingHandler
process
    INFO: 2019-01-02T23:09:13.331Z: Executing operation SpannerIO.Write/Write mutations to
Cloud Spanner/Schema View/Combine.GloballyAsSingletonView/Combine.globally(Singleton)/Combine.perKey(Singleton)/GroupByKey/Read+SpannerIO.Write/Write
mutations to Cloud Spanner/Schema View/Combine.GloballyAsSingletonView/Combine.globally(Singleton)/Combine.perKey(Singleton)/Combine.GroupedValues+SpannerIO.Write/Write
mutations to Cloud Spanner/Schema View/Combine.GloballyAsSingletonView/Combine.globally(Singleton)/Combine.perKey(Singleton)/Combine.GroupedValues/Extract+SpannerIO.Write/Write
mutations to Cloud Spanner/Schema View/Combine.GloballyAsSingletonView/Combine.globally(Singleton)/Values/Values/Map+SpannerIO.Write/Write
mutations to Cloud Spanner/Schema View/Combine.GloballyAsSingletonView/BatchViewOverrides.GroupByWindowHashAsKeyAndWindowAsSortKey/ParDo(UseWindowHashAsKeyAndWindowAsSortKey)+SpannerIO.Write/Write
mutations to Cloud Spanner/Schema View/Combine.GloballyAsSingletonView/BatchViewOverrides.GroupByWindowHashAsKeyAndWindowAsSortKey/BatchViewOverrides.GroupByKeyAndSortValuesOnly/Write
    Jan 02, 2019 11:09:19 PM org.apache.beam.runners.dataflow.util.MonitoringUtil$LoggingHandler
process
    INFO: 2019-01-02T23:09:19.229Z: Executing operation SpannerIO.Write/Write mutations to
Cloud Spanner/Schema View/Combine.GloballyAsSingletonView/BatchViewOverrides.GroupByWindowHashAsKeyAndWindowAsSortKey/BatchViewOverrides.GroupByKeyAndSortValuesOnly/Close
    Jan 02, 2019 11:09:19 PM org.apache.beam.runners.dataflow.util.MonitoringUtil$LoggingHandler
process
    INFO: 2019-01-02T23:09:19.303Z: Executing operation SpannerIO.Write/Write mutations to
Cloud Spanner/Schema View/Combine.GloballyAsSingletonView/BatchViewOverrides.GroupByWindowHashAsKeyAndWindowAsSortKey/BatchViewOverrides.GroupByKeyAndSortValuesOnly/Read+SpannerIO.Write/Write
mutations to Cloud Spanner/Schema View/Combine.GloballyAsSingletonView/ParDo(IsmRecordForSingularValuePerWindow)
    Jan 02, 2019 11:09:27 PM org.apache.beam.runners.dataflow.util.MonitoringUtil$LoggingHandler
process
    INFO: 2019-01-02T23:09:27.171Z: Executing operation SpannerIO.Write/Write mutations to
Cloud Spanner/Schema View/Combine.GloballyAsSingletonView/CreateDataflowView
    Jan 02, 2019 11:09:27 PM org.apache.beam.runners.dataflow.util.MonitoringUtil$LoggingHandler
process
    INFO: 2019-01-02T23:09:27.428Z: Executing operation GenerateSequence/Read(BoundedCountingSource)+ParDo(GenerateMutations)+SpannerIO.Write/To
mutation group+SpannerIO.Write/Write mutations to Cloud Spanner/To Global Window/Window.Assign+SpannerIO.Write/Write
mutations to Cloud Spanner/Filter Unbatchable Mutations+SpannerIO.Write/Write mutations to
Cloud Spanner/Write mutations to Spanner+SpannerIO.Write/Write mutations to Cloud Spanner/Gather
And Sort+SpannerIO.Write/Write mutations to Cloud Spanner/Create Batches+SpannerIO.Write/Write
mutations to Cloud Spanner/Write mutations to Spanner
    Jan 02, 2019 11:09:39 PM org.apache.beam.runners.dataflow.util.MonitoringUtil$LoggingHandler
process
    INFO: 2019-01-02T23:09:38.444Z: Cleaning up.
    Jan 02, 2019 11:09:39 PM org.apache.beam.runners.dataflow.util.MonitoringUtil$LoggingHandler
process
    INFO: 2019-01-02T23:09:38.664Z: Stopping worker pool...
    Jan 02, 2019 11:12:51 PM org.apache.beam.runners.dataflow.util.MonitoringUtil$LoggingHandler
process
    INFO: 2019-01-02T23:12:49.896Z: Autoscaling: Resized worker pool from 1 to 0.
    Jan 02, 2019 11:12:51 PM org.apache.beam.runners.dataflow.util.MonitoringUtil$LoggingHandler
process
    INFO: 2019-01-02T23:12:49.932Z: Autoscaling: Would further reduce the number of workers
but reached the minimum number allowed for the job.
    Jan 02, 2019 11:12:51 PM org.apache.beam.runners.dataflow.util.MonitoringUtil$LoggingHandler
process
    INFO: 2019-01-02T23:12:49.988Z: Worker pool stopped.
    Jan 02, 2019 11:12:56 PM org.apache.beam.runners.dataflow.DataflowPipelineJob waitUntilFinish
    INFO: Job 2019-01-02_15_07_33-16228586759382555117 finished with status DONE.
    Jan 02, 2019 11:12:56 PM org.apache.beam.runners.dataflow.TestDataflowRunner checkForPAssertSuccess
    INFO: Success result for Dataflow job 2019-01-02_15_07_33-16228586759382555117. Found
0 success, 0 failures out of 0 expected assertions.
    Jan 02, 2019 11:12:56 PM org.apache.beam.runners.dataflow.DataflowPipelineJob waitUntilFinish
    INFO: Job 2019-01-02_15_07_33-16228586759382555117 finished with status DONE.

Gradle Test Executor 10 finished executing tests.

> Task :beam-runners-google-cloud-dataflow-java:googleCloudPlatformLegacyWorkerIntegrationTest
Finished generating test XML results (0.026 secs) into: <https://builds.apache.org/job/beam_PostCommit_Java/ws/src/runners/google-cloud-dataflow-java/build/test-results/googleCloudPlatformLegacyWorkerIntegrationTest>
Generating HTML test report...
Finished generating test html results (0.026 secs) into: <https://builds.apache.org/job/beam_PostCommit_Java/ws/src/runners/google-cloud-dataflow-java/build/reports/tests/googleCloudPlatformLegacyWorkerIntegrationTest>
Packing task ':beam-runners-google-cloud-dataflow-java:googleCloudPlatformLegacyWorkerIntegrationTest'
Invalidating in-memory cache of /home/jenkins/.gradle/caches/journal-1/file-access.bin
:beam-runners-google-cloud-dataflow-java:googleCloudPlatformLegacyWorkerIntegrationTest (Thread[Task
worker for ':' Thread 11,5,main]) completed. Took 1 hrs 34 mins 44.334 secs.

FAILURE: Build failed with an exception.

* What went wrong:
Execution failed for task ':beam-runners-google-cloud-dataflow-java:examplesJavaLegacyWorkerIntegrationTest'.
> There were failing tests. See the report at: file://<https://builds.apache.org/job/beam_PostCommit_Java/ws/src/runners/google-cloud-dataflow-java/build/reports/tests/examplesJavaLegacyWorkerIntegrationTest/index.html>

* Try:
Run with --stacktrace option to get the stack trace. Run with --debug option to get more log
output. Run with --scan to get full insights.

* Get more help at https://help.gradle.org

Deprecated Gradle features were used in this build, making it incompatible with Gradle 5.0.
Use '--warning-mode all' to show the individual deprecation warnings.
See https://docs.gradle.org/4.10.2/userguide/command_line_interface.html#sec:command_line_warnings

BUILD FAILED in 1h 54m 18s
74 actionable tasks: 69 executed, 5 from cache

Publishing build scan...
https://gradle.com/s/wm6v4rnqzwcm4

Build step 'Invoke Gradle script' changed build result to FAILURE
Build step 'Invoke Gradle script' marked build as failure

---------------------------------------------------------------------
To unsubscribe, e-mail: builds-unsubscribe@beam.apache.org
For additional commands, e-mail: builds-help@beam.apache.org


Mime
View raw message