beam-builds mailing list archives

Site index · List index
Message view « Date » · « Thread »
Top « Date » · « Thread »
From Apache Jenkins Server <jenk...@builds.apache.org>
Subject Build failed in Jenkins: beam_PostCommit_Java #2253
Date Thu, 03 Jan 2019 01:07:29 GMT
See <https://builds.apache.org/job/beam_PostCommit_Java/2253/display/redirect?page=changes>

Changes:

[aaltay] [BEAM-5315] Python 3 port io.filebased_* modules (#7386)

------------------------------------------
[...truncated 4.79 MB...]
    Jan 03, 2019 1:02:30 AM org.apache.beam.runners.dataflow.util.PackageUtil tryStagePackage
    INFO: Uploading /home/jenkins/.gradle/caches/modules-2/files-2.1/com.esotericsoftware.kryo/kryo/2.21/9a4e69cff8d225729656f7e97e40893b23bffef/kryo-2.21.jar
to gs://temp-storage-for-end-to-end-tests/spannerwriteit0testreportfailures-jenkins-0103010228-980ed777/output/results/staging/kryo-2.21-olkSUBNMYGe-WXkdlwcytQ.jar
    Jan 03, 2019 1:02:30 AM org.apache.beam.runners.dataflow.util.PackageUtil tryStagePackage
    INFO: Uploading /home/jenkins/.gradle/caches/modules-2/files-2.1/com.esotericsoftware.minlog/minlog/1.2/59bfcd171d82f9981a5e242b9e840191f650e209/minlog-1.2.jar
to gs://temp-storage-for-end-to-end-tests/spannerwriteit0testreportfailures-jenkins-0103010228-980ed777/output/results/staging/minlog-1.2-98-99jtn3wu_pMfLJgiFvA.jar
    Jan 03, 2019 1:02:30 AM org.apache.beam.runners.dataflow.util.PackageUtil tryStagePackage
    INFO: Uploading /home/jenkins/.gradle/caches/modules-2/files-2.1/org.antlr/antlr-runtime/3.1.2/c4ca32c2be1b22a5553dd3171f51f9b2b04030b/antlr-runtime-3.1.2.jar
to gs://temp-storage-for-end-to-end-tests/spannerwriteit0testreportfailures-jenkins-0103010228-980ed777/output/results/staging/antlr-runtime-3.1.2-dpdEvr2kPK4dWHj9fUOv1A.jar
    Jan 03, 2019 1:02:30 AM org.apache.beam.runners.dataflow.util.PackageUtil tryStagePackage
    INFO: Uploading /home/jenkins/.gradle/caches/modules-2/files-2.1/ru.vyarus/generics-resolver/2.0.1/2182e67f161ddbe3ff8cb055bb54398354fda3f5/generics-resolver-2.0.1.jar
to gs://temp-storage-for-end-to-end-tests/spannerwriteit0testreportfailures-jenkins-0103010228-980ed777/output/results/staging/generics-resolver-2.0.1-VrpA4CuIscdXm0wF6oMTaQ.jar
    Jan 03, 2019 1:02:30 AM org.apache.beam.runners.dataflow.util.PackageUtil tryStagePackage
    INFO: Uploading /home/jenkins/.gradle/caches/modules-2/files-2.1/com.esotericsoftware.reflectasm/reflectasm/1.07/76f11c94a53ee975a0d9154b325c408b210155bd/reflectasm-1.07-shaded.jar
to gs://temp-storage-for-end-to-end-tests/spannerwriteit0testreportfailures-jenkins-0103010228-980ed777/output/results/staging/reflectasm-1.07-shaded-IELCIoQPsh49E873w5ZYMQ.jar
    Jan 03, 2019 1:02:30 AM org.apache.beam.runners.dataflow.util.PackageUtil tryStagePackage
    INFO: Uploading /home/jenkins/.gradle/caches/modules-2/files-2.1/com.squareup.okhttp/okhttp/2.5.0/4de2b4ed3445c37ec1720a7d214712e845a24636/okhttp-2.5.0.jar
to gs://temp-storage-for-end-to-end-tests/spannerwriteit0testreportfailures-jenkins-0103010228-980ed777/output/results/staging/okhttp-2.5.0-64v0X4G_nxfR_PsuymOqpg.jar
    Jan 03, 2019 1:02:30 AM org.apache.beam.runners.dataflow.util.PackageUtil tryStagePackage
    INFO: Uploading /home/jenkins/.gradle/caches/modules-2/files-2.1/org.ow2.asm/asm/4.0/659add6efc75a4715d738e73f07505246edf4d66/asm-4.0.jar
to gs://temp-storage-for-end-to-end-tests/spannerwriteit0testreportfailures-jenkins-0103010228-980ed777/output/results/staging/asm-4.0-Mi2PiMURGvYS34OMAZHNfg.jar
    Jan 03, 2019 1:02:30 AM org.apache.beam.runners.dataflow.util.PackageUtil tryStagePackage
    INFO: Uploading /home/jenkins/.gradle/caches/modules-2/files-2.1/com.beust/jcommander/1.27/58c9cbf0f1fa296f93c712f2cf46de50471920f9/jcommander-1.27.jar
to gs://temp-storage-for-end-to-end-tests/spannerwriteit0testreportfailures-jenkins-0103010228-980ed777/output/results/staging/jcommander-1.27-YxYbyOYD5gurYr1hw0nzcA.jar
    Jan 03, 2019 1:02:30 AM org.apache.beam.runners.dataflow.util.PackageUtil tryStagePackage
    INFO: Uploading /home/jenkins/.gradle/caches/modules-2/files-2.1/org.apache.httpcomponents/httpcore/4.4.9/a86ce739e5a7175b4b234c290a00a5fdb80957a0/httpcore-4.4.9.jar
to gs://temp-storage-for-end-to-end-tests/spannerwriteit0testreportfailures-jenkins-0103010228-980ed777/output/results/staging/httpcore-4.4.9-uJRVUHg5wJ1hGWYd79IWag.jar
    Jan 03, 2019 1:02:30 AM org.apache.beam.runners.dataflow.util.PackageUtil tryStagePackage
    INFO: Uploading /home/jenkins/.gradle/caches/modules-2/files-2.1/ognl/ognl/3.1.12/a7fa0db32f882cd3bb41ec6c489853b3bfb6aebc/ognl-3.1.12.jar
to gs://temp-storage-for-end-to-end-tests/spannerwriteit0testreportfailures-jenkins-0103010228-980ed777/output/results/staging/ognl-3.1.12-aq6HFAi1aHiNX6qcImOsmw.jar
    Jan 03, 2019 1:02:30 AM org.apache.beam.runners.dataflow.util.PackageUtil tryStagePackage
    INFO: Uploading /home/jenkins/.gradle/caches/modules-2/files-2.1/org.yaml/snakeyaml/1.23/ec62d74fe50689c28c0ff5b35d3aebcaa8b5be68/snakeyaml-1.23.jar
to gs://temp-storage-for-end-to-end-tests/spannerwriteit0testreportfailures-jenkins-0103010228-980ed777/output/results/staging/snakeyaml-1.23-ZOyL0mttUDSofsscjODv3A.jar
    Jan 03, 2019 1:02:30 AM org.apache.beam.runners.dataflow.util.PackageUtil tryStagePackage
    INFO: Uploading /home/jenkins/.gradle/caches/modules-2/files-2.1/org.javaruntype/javaruntype/1.3/26ba963f4b20c751e07b58b990bb41bf850622d8/javaruntype-1.3.jar
to gs://temp-storage-for-end-to-end-tests/spannerwriteit0testreportfailures-jenkins-0103010228-980ed777/output/results/staging/javaruntype-1.3-rOez6Sa6vLqndviPQ7_noQ.jar
    Jan 03, 2019 1:02:30 AM org.apache.beam.runners.dataflow.util.PackageUtil tryStagePackage
    INFO: Uploading /home/jenkins/.gradle/caches/modules-2/files-2.1/org.xerial.snappy/snappy-java/1.1.4/d94ae6d7d27242eaa4b6c323f881edbb98e48da6/snappy-java-1.1.4.jar
to gs://temp-storage-for-end-to-end-tests/spannerwriteit0testreportfailures-jenkins-0103010228-980ed777/output/results/staging/snappy-java-1.1.4-SFNwbMuGq13aaoKVzeS1Tw.jar
    Jan 03, 2019 1:02:30 AM org.apache.beam.runners.dataflow.util.PackageUtil tryStagePackage
    INFO: Uploading /home/jenkins/.gradle/caches/modules-2/files-2.1/io.netty/netty-common/4.1.25.Final/e17d5c05c101fe14536ce3fb34b36c54e04791f6/netty-common-4.1.25.Final.jar
to gs://temp-storage-for-end-to-end-tests/spannerwriteit0testreportfailures-jenkins-0103010228-980ed777/output/results/staging/netty-common-4.1.25.Final-cYwMY1_F2pzboFUnBL3CxQ.jar
    Jan 03, 2019 1:02:30 AM org.apache.beam.runners.dataflow.util.PackageUtil tryStagePackage
    INFO: Uploading /home/jenkins/.gradle/caches/modules-2/files-2.1/org.testng/testng/6.8.21/15e02d8d7be3c3640b585b97eda56026fdb5bf4d/testng-6.8.21.jar
to gs://temp-storage-for-end-to-end-tests/spannerwriteit0testreportfailures-jenkins-0103010228-980ed777/output/results/staging/testng-6.8.21-4nE6Pd5l58HFjEGfLzL88Q.jar
    Jan 03, 2019 1:02:30 AM org.apache.beam.runners.dataflow.util.PackageUtil tryStagePackage
    INFO: Uploading /home/jenkins/.gradle/caches/modules-2/files-2.1/org.beanshell/bsh/2.0b4/a05f0a0feefa8d8467ac80e16e7de071489f0d9c/bsh-2.0b4.jar
to gs://temp-storage-for-end-to-end-tests/spannerwriteit0testreportfailures-jenkins-0103010228-980ed777/output/results/staging/bsh-2.0b4-ocYKqDycmmyyORwcG4XrAA.jar
    Jan 03, 2019 1:02:30 AM org.apache.beam.runners.dataflow.util.PackageUtil tryStagePackage
    INFO: Uploading /home/jenkins/.gradle/caches/modules-2/files-2.1/com.google.cloud/google-cloud-core/1.36.0/4588f935d78680ebf76deeb977bbf022c31900e1/google-cloud-core-1.36.0.jar
to gs://temp-storage-for-end-to-end-tests/spannerwriteit0testreportfailures-jenkins-0103010228-980ed777/output/results/staging/google-cloud-core-1.36.0-X86nX7aVHm3rJoFKBlSvhw.jar
    Jan 03, 2019 1:02:30 AM org.apache.beam.runners.dataflow.util.PackageUtil tryStagePackage
    INFO: Uploading /home/jenkins/.gradle/caches/modules-2/files-2.1/com.google.guava/guava/20.0/89507701249388e1ed5ddcf8c41f4ce1be7831ef/guava-20.0.jar
to gs://temp-storage-for-end-to-end-tests/spannerwriteit0testreportfailures-jenkins-0103010228-980ed777/output/results/staging/guava-20.0-8yqKJSRiDb7Mn2v2ogwpPw.jar
    Jan 03, 2019 1:02:30 AM org.apache.beam.runners.dataflow.util.PackageUtil tryStagePackage
    INFO: Uploading /home/jenkins/.gradle/caches/modules-2/files-2.1/io.grpc/grpc-netty-shaded/1.13.1/ccdc4f2c2791d93164c574fbfb90d614aa0849ae/grpc-netty-shaded-1.13.1.jar
to gs://temp-storage-for-end-to-end-tests/spannerwriteit0testreportfailures-jenkins-0103010228-980ed777/output/results/staging/grpc-netty-shaded-1.13.1-YS-LK7_gIZl0B4Kw_7Rw7A.jar
    Jan 03, 2019 1:02:30 AM org.apache.beam.runners.dataflow.util.PackageUtil tryStagePackage
    INFO: Uploading <https://builds.apache.org/job/beam_PostCommit_Java/ws/src/runners/google-cloud-dataflow-java/worker/legacy-worker/build/libs/beam-runners-google-cloud-dataflow-java-legacy-worker-2.10.0-SNAPSHOT.jar>
to gs://temp-storage-for-end-to-end-tests/spannerwriteit0testreportfailures-jenkins-0103010228-980ed777/output/results/staging/beam-runners-google-cloud-dataflow-java-legacy-worker-2.10.0-SNAPSHOT-lcb5_Uhm3WEnCfrPLJ1gKw.jar
    Jan 03, 2019 1:02:30 AM org.apache.beam.runners.dataflow.util.PackageUtil tryStagePackage
    INFO: Uploading /home/jenkins/.gradle/caches/modules-2/files-2.1/org.javassist/javassist/3.20.0-GA/a9cbcdfb7e9f86fbc74d3afae65f2248bfbf82a0/javassist-3.20.0-GA.jar
to gs://temp-storage-for-end-to-end-tests/spannerwriteit0testreportfailures-jenkins-0103010228-980ed777/output/results/staging/javassist-3.20.0-GA-qJ3XkH124GHsLAfnYqdCVg.jar
    Jan 03, 2019 1:02:30 AM org.apache.beam.runners.dataflow.util.PackageUtil tryStagePackage
    INFO: Uploading /home/jenkins/.gradle/caches/modules-2/files-2.1/io.netty/netty-tcnative-boringssl-static/2.0.8.Final/5c3483dfa33cd04f5469c95abf67e1b69a8f1221/netty-tcnative-boringssl-static-2.0.8.Final.jar
to gs://temp-storage-for-end-to-end-tests/spannerwriteit0testreportfailures-jenkins-0103010228-980ed777/output/results/staging/netty-tcnative-boringssl-static-2.0.8.Final-RCm0wU8kBdzNqqi47Z837A.jar
    Jan 03, 2019 1:02:30 AM org.apache.beam.runners.dataflow.util.PackageUtil tryStagePackage
    INFO: Uploading /home/jenkins/.gradle/caches/modules-2/files-2.1/com.google.api/gax-grpc/1.29.0/ca2a2853c6f9fc4a25fccd0068f88d98b28e9e35/gax-grpc-1.29.0.jar
to gs://temp-storage-for-end-to-end-tests/spannerwriteit0testreportfailures-jenkins-0103010228-980ed777/output/results/staging/gax-grpc-1.29.0-zTd_Ed8L8exEKsPYvEo82Q.jar
    Jan 03, 2019 1:02:30 AM org.apache.beam.runners.dataflow.util.PackageUtil tryStagePackage
    INFO: Uploading /home/jenkins/.gradle/caches/modules-2/files-2.1/com.google.oauth-client/google-oauth-client/1.27.0/1979e3b499f1ef49959005ca59101791361abca9/google-oauth-client-1.27.0.jar
to gs://temp-storage-for-end-to-end-tests/spannerwriteit0testreportfailures-jenkins-0103010228-980ed777/output/results/staging/google-oauth-client-1.27.0-waNrxu589XHIvY73DhrxNA.jar
    Jan 03, 2019 1:02:30 AM org.apache.beam.runners.dataflow.util.PackageUtil tryStagePackage
    INFO: Uploading <https://builds.apache.org/job/beam_PostCommit_Java/ws/src/runners/direct-java/build/libs/beam-runners-direct-java-2.10.0-SNAPSHOT.jar>
to gs://temp-storage-for-end-to-end-tests/spannerwriteit0testreportfailures-jenkins-0103010228-980ed777/output/results/staging/beam-runners-direct-java-2.10.0-SNAPSHOT-eTw060kHC5fY_dXLZuRgEQ.jar
    Jan 03, 2019 1:02:30 AM org.apache.beam.runners.dataflow.util.PackageUtil tryStagePackage
    INFO: Uploading /home/jenkins/.gradle/caches/modules-2/files-2.1/org.apache.beam/beam-vendor-grpc-1_13_1/0.2/249a9a576fc6541d87972e2dc24cf11ea8129b8f/beam-vendor-grpc-1_13_1-0.2.jar
to gs://temp-storage-for-end-to-end-tests/spannerwriteit0testreportfailures-jenkins-0103010228-980ed777/output/results/staging/beam-vendor-grpc-1_13_1-0.2-2fE94kZQ2ONeR3ea5r0PvA.jar
    Jan 03, 2019 1:02:32 AM org.apache.beam.runners.dataflow.util.PackageUtil stageClasspathElements
    INFO: Staging files complete: 0 files cached, 162 files newly uploaded in 3 seconds
    Jan 03, 2019 1:02:32 AM org.apache.beam.runners.dataflow.DataflowPipelineTranslator$Translator
addStep
    INFO: Adding GenerateSequence/Read(BoundedCountingSource) as step s1
    Jan 03, 2019 1:02:32 AM org.apache.beam.runners.dataflow.DataflowPipelineTranslator$Translator
addStep
    INFO: Adding ParDo(GenerateMutations) as step s2
    Jan 03, 2019 1:02:32 AM org.apache.beam.runners.dataflow.DataflowPipelineTranslator$Translator
addStep
    INFO: Adding SpannerIO.Write/To mutation group as step s3
    Jan 03, 2019 1:02:32 AM org.apache.beam.runners.dataflow.DataflowPipelineTranslator$Translator
addStep
    INFO: Adding SpannerIO.Write/Write mutations to Cloud Spanner/Create Seed/Read(CreateSource)
as step s4
    Jan 03, 2019 1:02:32 AM org.apache.beam.runners.dataflow.DataflowPipelineTranslator$Translator
addStep
    INFO: Adding SpannerIO.Write/Write mutations to Cloud Spanner/Read information schema
as step s5
    Jan 03, 2019 1:02:32 AM org.apache.beam.runners.dataflow.DataflowPipelineTranslator$Translator
addStep
    INFO: Adding SpannerIO.Write/Write mutations to Cloud Spanner/Schema View/Combine.GloballyAsSingletonView/Combine.globally(Singleton)/WithKeys/AddKeys/Map
as step s6
    Jan 03, 2019 1:02:32 AM org.apache.beam.runners.dataflow.DataflowPipelineTranslator$Translator
addStep
    INFO: Adding SpannerIO.Write/Write mutations to Cloud Spanner/Schema View/Combine.GloballyAsSingletonView/Combine.globally(Singleton)/Combine.perKey(Singleton)/GroupByKey
as step s7
    Jan 03, 2019 1:02:32 AM org.apache.beam.runners.dataflow.DataflowPipelineTranslator$Translator
addStep
    INFO: Adding SpannerIO.Write/Write mutations to Cloud Spanner/Schema View/Combine.GloballyAsSingletonView/Combine.globally(Singleton)/Combine.perKey(Singleton)/Combine.GroupedValues
as step s8
    Jan 03, 2019 1:02:32 AM org.apache.beam.runners.dataflow.DataflowPipelineTranslator$Translator
addStep
    INFO: Adding SpannerIO.Write/Write mutations to Cloud Spanner/Schema View/Combine.GloballyAsSingletonView/Combine.globally(Singleton)/Values/Values/Map
as step s9
    Jan 03, 2019 1:02:32 AM org.apache.beam.runners.dataflow.DataflowPipelineTranslator$Translator
addStep
    INFO: Adding SpannerIO.Write/Write mutations to Cloud Spanner/Schema View/Combine.GloballyAsSingletonView/BatchViewOverrides.GroupByWindowHashAsKeyAndWindowAsSortKey/ParDo(UseWindowHashAsKeyAndWindowAsSortKey)
as step s10
    Jan 03, 2019 1:02:32 AM org.apache.beam.runners.dataflow.DataflowPipelineTranslator$Translator
addStep
    INFO: Adding SpannerIO.Write/Write mutations to Cloud Spanner/Schema View/Combine.GloballyAsSingletonView/BatchViewOverrides.GroupByWindowHashAsKeyAndWindowAsSortKey/BatchViewOverrides.GroupByKeyAndSortValuesOnly
as step s11
    Jan 03, 2019 1:02:32 AM org.apache.beam.runners.dataflow.DataflowPipelineTranslator$Translator
addStep
    INFO: Adding SpannerIO.Write/Write mutations to Cloud Spanner/Schema View/Combine.GloballyAsSingletonView/ParDo(IsmRecordForSingularValuePerWindow)
as step s12
    Jan 03, 2019 1:02:32 AM org.apache.beam.runners.dataflow.DataflowPipelineTranslator$Translator
addStep
    INFO: Adding SpannerIO.Write/Write mutations to Cloud Spanner/Schema View/Combine.GloballyAsSingletonView/CreateDataflowView
as step s13
    Jan 03, 2019 1:02:32 AM org.apache.beam.runners.dataflow.DataflowPipelineTranslator$Translator
addStep
    INFO: Adding SpannerIO.Write/Write mutations to Cloud Spanner/To Global Window/Window.Assign
as step s14
    Jan 03, 2019 1:02:32 AM org.apache.beam.runners.dataflow.DataflowPipelineTranslator$Translator
addStep
    INFO: Adding SpannerIO.Write/Write mutations to Cloud Spanner/Filter Unbatchable Mutations
as step s15
    Jan 03, 2019 1:02:32 AM org.apache.beam.runners.dataflow.DataflowPipelineTranslator$Translator
addStep
    INFO: Adding SpannerIO.Write/Write mutations to Cloud Spanner/Gather And Sort as step
s16
    Jan 03, 2019 1:02:32 AM org.apache.beam.runners.dataflow.DataflowPipelineTranslator$Translator
addStep
    INFO: Adding SpannerIO.Write/Write mutations to Cloud Spanner/Create Batches as step s17
    Jan 03, 2019 1:02:32 AM org.apache.beam.runners.dataflow.DataflowPipelineTranslator$Translator
addStep
    INFO: Adding SpannerIO.Write/Write mutations to Cloud Spanner/Merge as step s18
    Jan 03, 2019 1:02:32 AM org.apache.beam.runners.dataflow.DataflowPipelineTranslator$Translator
addStep
    INFO: Adding SpannerIO.Write/Write mutations to Cloud Spanner/Write mutations to Spanner
as step s19
    Jan 03, 2019 1:02:32 AM org.apache.beam.runners.dataflow.DataflowRunner run
    INFO: Staging pipeline description to gs://temp-storage-for-end-to-end-tests/spannerwriteit0testreportfailures-jenkins-0103010228-980ed777/output/results/staging/
    Jan 03, 2019 1:02:33 AM org.apache.beam.runners.dataflow.util.PackageUtil tryStagePackage
    INFO: Uploading <56476 bytes, hash LlnYKc3g_CSJ_XWqa5dt9g> to gs://temp-storage-for-end-to-end-tests/spannerwriteit0testreportfailures-jenkins-0103010228-980ed777/output/results/staging/pipeline-LlnYKc3g_CSJ_XWqa5dt9g.pb

org.apache.beam.sdk.io.gcp.spanner.SpannerWriteIT > testReportFailures STANDARD_OUT
    Dataflow SDK version: 2.10.0-SNAPSHOT

org.apache.beam.sdk.io.gcp.spanner.SpannerWriteIT > testReportFailures STANDARD_ERROR
    Jan 03, 2019 1:02:34 AM org.apache.beam.runners.dataflow.DataflowRunner run
    INFO: To access the Dataflow monitoring console, please navigate to https://console.cloud.google.com/dataflow/jobsDetail/locations/us-central1/jobs/2019-01-02_17_02_33-9673317463912559731?project=apache-beam-testing

org.apache.beam.sdk.io.gcp.spanner.SpannerWriteIT > testReportFailures STANDARD_OUT
    Submitted job: 2019-01-02_17_02_33-9673317463912559731

org.apache.beam.sdk.io.gcp.spanner.SpannerWriteIT > testReportFailures STANDARD_ERROR
    Jan 03, 2019 1:02:34 AM org.apache.beam.runners.dataflow.DataflowRunner run
    INFO: To cancel the job using the 'gcloud' tool, run:
    > gcloud dataflow jobs --project=apache-beam-testing cancel --region=us-central1 2019-01-02_17_02_33-9673317463912559731
    Jan 03, 2019 1:02:34 AM org.apache.beam.runners.dataflow.TestDataflowRunner run
    INFO: Running Dataflow job 2019-01-02_17_02_33-9673317463912559731 with 0 expected assertions.
    Jan 03, 2019 1:02:50 AM org.apache.beam.runners.dataflow.util.MonitoringUtil$LoggingHandler
process
    INFO: 2019-01-03T01:02:33.600Z: Autoscaling is enabled for job 2019-01-02_17_02_33-9673317463912559731.
The number of workers will be between 1 and 1000.
    Jan 03, 2019 1:02:50 AM org.apache.beam.runners.dataflow.util.MonitoringUtil$LoggingHandler
process
    INFO: 2019-01-03T01:02:33.778Z: Autoscaling was automatically enabled for job 2019-01-02_17_02_33-9673317463912559731.
    Jan 03, 2019 1:02:50 AM org.apache.beam.runners.dataflow.util.MonitoringUtil$LoggingHandler
process
    INFO: 2019-01-03T01:02:38.007Z: Checking permissions granted to controller Service Account.
    Jan 03, 2019 1:02:50 AM org.apache.beam.runners.dataflow.util.MonitoringUtil$LoggingHandler
process
    INFO: 2019-01-03T01:02:43.080Z: Worker configuration: n1-standard-1 in us-central1-b.
    Jan 03, 2019 1:02:50 AM org.apache.beam.runners.dataflow.util.MonitoringUtil$LoggingHandler
process
    INFO: 2019-01-03T01:02:43.664Z: Expanding CoGroupByKey operations into optimizable parts.
    Jan 03, 2019 1:02:50 AM org.apache.beam.runners.dataflow.util.MonitoringUtil$LoggingHandler
process
    INFO: 2019-01-03T01:02:43.799Z: Expanding GroupByKey operations into optimizable parts.
    Jan 03, 2019 1:02:50 AM org.apache.beam.runners.dataflow.util.MonitoringUtil$LoggingHandler
process
    INFO: 2019-01-03T01:02:43.847Z: Lifting ValueCombiningMappingFns into MergeBucketsMappingFns
    Jan 03, 2019 1:02:50 AM org.apache.beam.runners.dataflow.util.MonitoringUtil$LoggingHandler
process
    INFO: 2019-01-03T01:02:44.145Z: Fusing adjacent ParDo, Read, Write, and Flatten operations
    Jan 03, 2019 1:02:50 AM org.apache.beam.runners.dataflow.util.MonitoringUtil$LoggingHandler
process
    INFO: 2019-01-03T01:02:44.209Z: Fusing consumer SpannerIO.Write/Write mutations to Cloud
Spanner/Read information schema into SpannerIO.Write/Write mutations to Cloud Spanner/Create
Seed/Read(CreateSource)
    Jan 03, 2019 1:02:50 AM org.apache.beam.runners.dataflow.util.MonitoringUtil$LoggingHandler
process
    INFO: 2019-01-03T01:02:44.297Z: Fusing consumer SpannerIO.Write/Write mutations to Cloud
Spanner/Schema View/Combine.GloballyAsSingletonView/Combine.globally(Singleton)/Combine.perKey(Singleton)/GroupByKey+SpannerIO.Write/Write
mutations to Cloud Spanner/Schema View/Combine.GloballyAsSingletonView/Combine.globally(Singleton)/Combine.perKey(Singleton)/Combine.GroupedValues/Partial
into SpannerIO.Write/Write mutations to Cloud Spanner/Schema View/Combine.GloballyAsSingletonView/Combine.globally(Singleton)/WithKeys/AddKeys/Map
    Jan 03, 2019 1:02:50 AM org.apache.beam.runners.dataflow.util.MonitoringUtil$LoggingHandler
process
    INFO: 2019-01-03T01:02:44.355Z: Fusing consumer SpannerIO.Write/Write mutations to Cloud
Spanner/Schema View/Combine.GloballyAsSingletonView/Combine.globally(Singleton)/Combine.perKey(Singleton)/Combine.GroupedValues
into SpannerIO.Write/Write mutations to Cloud Spanner/Schema View/Combine.GloballyAsSingletonView/Combine.globally(Singleton)/Combine.perKey(Singleton)/GroupByKey/Read
    Jan 03, 2019 1:02:50 AM org.apache.beam.runners.dataflow.util.MonitoringUtil$LoggingHandler
process
    INFO: 2019-01-03T01:02:44.415Z: Fusing consumer SpannerIO.Write/Write mutations to Cloud
Spanner/Schema View/Combine.GloballyAsSingletonView/Combine.globally(Singleton)/Combine.perKey(Singleton)/GroupByKey/Write
into SpannerIO.Write/Write mutations to Cloud Spanner/Schema View/Combine.GloballyAsSingletonView/Combine.globally(Singleton)/Combine.perKey(Singleton)/GroupByKey/Reify
    Jan 03, 2019 1:02:50 AM org.apache.beam.runners.dataflow.util.MonitoringUtil$LoggingHandler
process
    INFO: 2019-01-03T01:02:44.477Z: Fusing consumer SpannerIO.Write/Write mutations to Cloud
Spanner/Schema View/Combine.GloballyAsSingletonView/ParDo(IsmRecordForSingularValuePerWindow)
into SpannerIO.Write/Write mutations to Cloud Spanner/Schema View/Combine.GloballyAsSingletonView/BatchViewOverrides.GroupByWindowHashAsKeyAndWindowAsSortKey/BatchViewOverrides.GroupByKeyAndSortValuesOnly/Read
    Jan 03, 2019 1:02:50 AM org.apache.beam.runners.dataflow.util.MonitoringUtil$LoggingHandler
process
    INFO: 2019-01-03T01:02:44.542Z: Fusing consumer SpannerIO.Write/Write mutations to Cloud
Spanner/Schema View/Combine.GloballyAsSingletonView/Combine.globally(Singleton)/WithKeys/AddKeys/Map
into SpannerIO.Write/Write mutations to Cloud Spanner/Read information schema
    Jan 03, 2019 1:02:50 AM org.apache.beam.runners.dataflow.util.MonitoringUtil$LoggingHandler
process
    INFO: 2019-01-03T01:02:44.583Z: Fusing consumer SpannerIO.Write/Write mutations to Cloud
Spanner/Schema View/Combine.GloballyAsSingletonView/BatchViewOverrides.GroupByWindowHashAsKeyAndWindowAsSortKey/ParDo(UseWindowHashAsKeyAndWindowAsSortKey)
into SpannerIO.Write/Write mutations to Cloud Spanner/Schema View/Combine.GloballyAsSingletonView/Combine.globally(Singleton)/Values/Values/Map
    Jan 03, 2019 1:02:50 AM org.apache.beam.runners.dataflow.util.MonitoringUtil$LoggingHandler
process
    INFO: 2019-01-03T01:02:44.633Z: Fusing consumer SpannerIO.Write/Write mutations to Cloud
Spanner/Schema View/Combine.GloballyAsSingletonView/BatchViewOverrides.GroupByWindowHashAsKeyAndWindowAsSortKey/BatchViewOverrides.GroupByKeyAndSortValuesOnly/Write
into SpannerIO.Write/Write mutations to Cloud Spanner/Schema View/Combine.GloballyAsSingletonView/BatchViewOverrides.GroupByWindowHashAsKeyAndWindowAsSortKey/ParDo(UseWindowHashAsKeyAndWindowAsSortKey)
    Jan 03, 2019 1:02:50 AM org.apache.beam.runners.dataflow.util.MonitoringUtil$LoggingHandler
process
    INFO: 2019-01-03T01:02:44.721Z: Fusing consumer SpannerIO.Write/Write mutations to Cloud
Spanner/Schema View/Combine.GloballyAsSingletonView/Combine.globally(Singleton)/Combine.perKey(Singleton)/GroupByKey/Reify
into SpannerIO.Write/Write mutations to Cloud Spanner/Schema View/Combine.GloballyAsSingletonView/Combine.globally(Singleton)/Combine.perKey(Singleton)/GroupByKey+SpannerIO.Write/Write
mutations to Cloud Spanner/Schema View/Combine.GloballyAsSingletonView/Combine.globally(Singleton)/Combine.perKey(Singleton)/Combine.GroupedValues/Partial
    Jan 03, 2019 1:02:50 AM org.apache.beam.runners.dataflow.util.MonitoringUtil$LoggingHandler
process
    INFO: 2019-01-03T01:02:44.779Z: Fusing consumer SpannerIO.Write/Write mutations to Cloud
Spanner/Schema View/Combine.GloballyAsSingletonView/Combine.globally(Singleton)/Values/Values/Map
into SpannerIO.Write/Write mutations to Cloud Spanner/Schema View/Combine.GloballyAsSingletonView/Combine.globally(Singleton)/Combine.perKey(Singleton)/Combine.GroupedValues/Extract
    Jan 03, 2019 1:02:50 AM org.apache.beam.runners.dataflow.util.MonitoringUtil$LoggingHandler
process
    INFO: 2019-01-03T01:02:44.840Z: Fusing consumer SpannerIO.Write/Write mutations to Cloud
Spanner/Schema View/Combine.GloballyAsSingletonView/Combine.globally(Singleton)/Combine.perKey(Singleton)/Combine.GroupedValues/Extract
into SpannerIO.Write/Write mutations to Cloud Spanner/Schema View/Combine.GloballyAsSingletonView/Combine.globally(Singleton)/Combine.perKey(Singleton)/Combine.GroupedValues
    Jan 03, 2019 1:02:50 AM org.apache.beam.runners.dataflow.util.MonitoringUtil$LoggingHandler
process
    INFO: 2019-01-03T01:02:44.894Z: Unzipping flatten s18 for input s15.unbatchableMutations
    Jan 03, 2019 1:02:50 AM org.apache.beam.runners.dataflow.util.MonitoringUtil$LoggingHandler
process
    INFO: 2019-01-03T01:02:44.969Z: Fusing unzipped copy of SpannerIO.Write/Write mutations
to Cloud Spanner/Write mutations to Spanner, through flatten SpannerIO.Write/Write mutations
to Cloud Spanner/Merge, into producer SpannerIO.Write/Write mutations to Cloud Spanner/Filter
Unbatchable Mutations
    Jan 03, 2019 1:02:50 AM org.apache.beam.runners.dataflow.util.MonitoringUtil$LoggingHandler
process
    INFO: 2019-01-03T01:02:45.036Z: Fusing consumer SpannerIO.Write/Write mutations to Cloud
Spanner/Write mutations to Spanner into SpannerIO.Write/Write mutations to Cloud Spanner/Create
Batches
    Jan 03, 2019 1:02:50 AM org.apache.beam.runners.dataflow.util.MonitoringUtil$LoggingHandler
process
    INFO: 2019-01-03T01:02:45.101Z: Fusing consumer SpannerIO.Write/Write mutations to Cloud
Spanner/To Global Window/Window.Assign into SpannerIO.Write/To mutation group
    Jan 03, 2019 1:02:50 AM org.apache.beam.runners.dataflow.util.MonitoringUtil$LoggingHandler
process
    INFO: 2019-01-03T01:02:45.163Z: Fusing consumer SpannerIO.Write/To mutation group into
ParDo(GenerateMutations)
    Jan 03, 2019 1:02:50 AM org.apache.beam.runners.dataflow.util.MonitoringUtil$LoggingHandler
process
    INFO: 2019-01-03T01:02:45.227Z: Fusing consumer ParDo(GenerateMutations) into GenerateSequence/Read(BoundedCountingSource)
    Jan 03, 2019 1:02:50 AM org.apache.beam.runners.dataflow.util.MonitoringUtil$LoggingHandler
process
    INFO: 2019-01-03T01:02:45.284Z: Fusing consumer SpannerIO.Write/Write mutations to Cloud
Spanner/Create Batches into SpannerIO.Write/Write mutations to Cloud Spanner/Gather And Sort
    Jan 03, 2019 1:02:50 AM org.apache.beam.runners.dataflow.util.MonitoringUtil$LoggingHandler
process
    INFO: 2019-01-03T01:02:45.353Z: Fusing consumer SpannerIO.Write/Write mutations to Cloud
Spanner/Gather And Sort into SpannerIO.Write/Write mutations to Cloud Spanner/Filter Unbatchable
Mutations
    Jan 03, 2019 1:02:50 AM org.apache.beam.runners.dataflow.util.MonitoringUtil$LoggingHandler
process
    INFO: 2019-01-03T01:02:45.400Z: Fusing consumer SpannerIO.Write/Write mutations to Cloud
Spanner/Filter Unbatchable Mutations into SpannerIO.Write/Write mutations to Cloud Spanner/To
Global Window/Window.Assign
    Jan 03, 2019 1:02:50 AM org.apache.beam.runners.dataflow.util.MonitoringUtil$LoggingHandler
process
    INFO: 2019-01-03T01:02:46.248Z: Executing operation SpannerIO.Write/Write mutations to
Cloud Spanner/Schema View/Combine.GloballyAsSingletonView/BatchViewOverrides.GroupByWindowHashAsKeyAndWindowAsSortKey/BatchViewOverrides.GroupByKeyAndSortValuesOnly/Create
    Jan 03, 2019 1:02:50 AM org.apache.beam.runners.dataflow.util.MonitoringUtil$LoggingHandler
process
    INFO: 2019-01-03T01:02:46.316Z: Executing operation SpannerIO.Write/Write mutations to
Cloud Spanner/Schema View/Combine.GloballyAsSingletonView/Combine.globally(Singleton)/Combine.perKey(Singleton)/GroupByKey/Create
    Jan 03, 2019 1:02:50 AM org.apache.beam.runners.dataflow.util.MonitoringUtil$LoggingHandler
process
    INFO: 2019-01-03T01:02:46.402Z: Starting 1 workers in us-central1-b...
    Jan 03, 2019 1:02:50 AM org.apache.beam.runners.dataflow.util.MonitoringUtil$LoggingHandler
process
    INFO: 2019-01-03T01:02:47.221Z: Executing operation SpannerIO.Write/Write mutations to
Cloud Spanner/Create Seed/Read(CreateSource)+SpannerIO.Write/Write mutations to Cloud Spanner/Read
information schema+SpannerIO.Write/Write mutations to Cloud Spanner/Schema View/Combine.GloballyAsSingletonView/Combine.globally(Singleton)/WithKeys/AddKeys/Map+SpannerIO.Write/Write
mutations to Cloud Spanner/Schema View/Combine.GloballyAsSingletonView/Combine.globally(Singleton)/Combine.perKey(Singleton)/GroupByKey+SpannerIO.Write/Write
mutations to Cloud Spanner/Schema View/Combine.GloballyAsSingletonView/Combine.globally(Singleton)/Combine.perKey(Singleton)/Combine.GroupedValues/Partial+SpannerIO.Write/Write
mutations to Cloud Spanner/Schema View/Combine.GloballyAsSingletonView/Combine.globally(Singleton)/Combine.perKey(Singleton)/GroupByKey/Reify+SpannerIO.Write/Write
mutations to Cloud Spanner/Schema View/Combine.GloballyAsSingletonView/Combine.globally(Singleton)/Combine.perKey(Singleton)/GroupByKey/Write
    Jan 03, 2019 1:03:08 AM org.apache.beam.runners.dataflow.util.MonitoringUtil$LoggingHandler
process
    INFO: 2019-01-03T01:03:05.980Z: Autoscaling: Raised the number of workers to 0 based on
the rate of progress in the currently running step(s).
    Jan 03, 2019 1:04:02 AM org.apache.beam.runners.dataflow.util.MonitoringUtil$LoggingHandler
process
    INFO: 2019-01-03T01:04:02.465Z: Workers have started successfully.
    Jan 03, 2019 1:04:16 AM org.apache.beam.runners.dataflow.util.MonitoringUtil$LoggingHandler
process
    INFO: 2019-01-03T01:04:15.414Z: Autoscaling: Raised the number of workers to 1 based on
the rate of progress in the currently running step(s).
    Jan 03, 2019 1:04:16 AM org.apache.beam.runners.dataflow.util.MonitoringUtil$LoggingHandler
process
    INFO: 2019-01-03T01:04:15.496Z: Autoscaling: Would further reduce the number of workers
but reached the minimum number allowed for the job.
    Jan 03, 2019 1:04:28 AM org.apache.beam.runners.dataflow.util.MonitoringUtil$LoggingHandler
process
    INFO: 2019-01-03T01:04:27.531Z: Executing operation SpannerIO.Write/Write mutations to
Cloud Spanner/Schema View/Combine.GloballyAsSingletonView/Combine.globally(Singleton)/Combine.perKey(Singleton)/GroupByKey/Close
    Jan 03, 2019 1:04:28 AM org.apache.beam.runners.dataflow.util.MonitoringUtil$LoggingHandler
process
    INFO: 2019-01-03T01:04:27.967Z: Executing operation SpannerIO.Write/Write mutations to
Cloud Spanner/Schema View/Combine.GloballyAsSingletonView/Combine.globally(Singleton)/Combine.perKey(Singleton)/GroupByKey/Read+SpannerIO.Write/Write
mutations to Cloud Spanner/Schema View/Combine.GloballyAsSingletonView/Combine.globally(Singleton)/Combine.perKey(Singleton)/Combine.GroupedValues+SpannerIO.Write/Write
mutations to Cloud Spanner/Schema View/Combine.GloballyAsSingletonView/Combine.globally(Singleton)/Combine.perKey(Singleton)/Combine.GroupedValues/Extract+SpannerIO.Write/Write
mutations to Cloud Spanner/Schema View/Combine.GloballyAsSingletonView/Combine.globally(Singleton)/Values/Values/Map+SpannerIO.Write/Write
mutations to Cloud Spanner/Schema View/Combine.GloballyAsSingletonView/BatchViewOverrides.GroupByWindowHashAsKeyAndWindowAsSortKey/ParDo(UseWindowHashAsKeyAndWindowAsSortKey)+SpannerIO.Write/Write
mutations to Cloud Spanner/Schema View/Combine.GloballyAsSingletonView/BatchViewOverrides.GroupByWindowHashAsKeyAndWindowAsSortKey/BatchViewOverrides.GroupByKeyAndSortValuesOnly/Write
    Jan 03, 2019 1:04:34 AM org.apache.beam.runners.dataflow.util.MonitoringUtil$LoggingHandler
process
    INFO: 2019-01-03T01:04:33.721Z: Workers have started successfully.
    Jan 03, 2019 1:04:35 AM org.apache.beam.runners.dataflow.util.MonitoringUtil$LoggingHandler
process
    INFO: 2019-01-03T01:04:34.890Z: Executing operation SpannerIO.Write/Write mutations to
Cloud Spanner/Schema View/Combine.GloballyAsSingletonView/BatchViewOverrides.GroupByWindowHashAsKeyAndWindowAsSortKey/BatchViewOverrides.GroupByKeyAndSortValuesOnly/Close
    Jan 03, 2019 1:04:35 AM org.apache.beam.runners.dataflow.util.MonitoringUtil$LoggingHandler
process
    INFO: 2019-01-03T01:04:35.233Z: Executing operation SpannerIO.Write/Write mutations to
Cloud Spanner/Schema View/Combine.GloballyAsSingletonView/BatchViewOverrides.GroupByWindowHashAsKeyAndWindowAsSortKey/BatchViewOverrides.GroupByKeyAndSortValuesOnly/Read+SpannerIO.Write/Write
mutations to Cloud Spanner/Schema View/Combine.GloballyAsSingletonView/ParDo(IsmRecordForSingularValuePerWindow)
    Jan 03, 2019 1:04:44 AM org.apache.beam.runners.dataflow.util.MonitoringUtil$LoggingHandler
process
    INFO: 2019-01-03T01:04:43.828Z: Executing operation SpannerIO.Write/Write mutations to
Cloud Spanner/Schema View/Combine.GloballyAsSingletonView/CreateDataflowView
    Jan 03, 2019 1:04:44 AM org.apache.beam.runners.dataflow.util.MonitoringUtil$LoggingHandler
process
    INFO: 2019-01-03T01:04:44.357Z: Executing operation GenerateSequence/Read(BoundedCountingSource)+ParDo(GenerateMutations)+SpannerIO.Write/To
mutation group+SpannerIO.Write/Write mutations to Cloud Spanner/To Global Window/Window.Assign+SpannerIO.Write/Write
mutations to Cloud Spanner/Filter Unbatchable Mutations+SpannerIO.Write/Write mutations to
Cloud Spanner/Write mutations to Spanner+SpannerIO.Write/Write mutations to Cloud Spanner/Gather
And Sort+SpannerIO.Write/Write mutations to Cloud Spanner/Create Batches+SpannerIO.Write/Write
mutations to Cloud Spanner/Write mutations to Spanner
    Jan 03, 2019 1:04:55 AM org.apache.beam.runners.dataflow.util.MonitoringUtil$LoggingHandler
process
    INFO: 2019-01-03T01:04:55.066Z: Cleaning up.
    Jan 03, 2019 1:04:58 AM org.apache.beam.runners.dataflow.util.MonitoringUtil$LoggingHandler
process
    INFO: 2019-01-03T01:04:55.442Z: Stopping worker pool...
    Jan 03, 2019 1:07:18 AM org.apache.beam.runners.dataflow.util.MonitoringUtil$LoggingHandler
process
    INFO: 2019-01-03T01:07:18.256Z: Autoscaling: Resized worker pool from 1 to 0.
    Jan 03, 2019 1:07:20 AM org.apache.beam.runners.dataflow.util.MonitoringUtil$LoggingHandler
process
    INFO: 2019-01-03T01:07:18.321Z: Autoscaling: Would further reduce the number of workers
but reached the minimum number allowed for the job.
    Jan 03, 2019 1:07:20 AM org.apache.beam.runners.dataflow.util.MonitoringUtil$LoggingHandler
process
    INFO: 2019-01-03T01:07:18.417Z: Worker pool stopped.
    Jan 03, 2019 1:07:24 AM org.apache.beam.runners.dataflow.DataflowPipelineJob waitUntilFinish
    INFO: Job 2019-01-02_17_02_33-9673317463912559731 finished with status DONE.
    Jan 03, 2019 1:07:24 AM org.apache.beam.runners.dataflow.TestDataflowRunner checkForPAssertSuccess
    INFO: Success result for Dataflow job 2019-01-02_17_02_33-9673317463912559731. Found 0
success, 0 failures out of 0 expected assertions.
    Jan 03, 2019 1:07:25 AM org.apache.beam.runners.dataflow.DataflowPipelineJob waitUntilFinish
    INFO: Job 2019-01-02_17_02_33-9673317463912559731 finished with status DONE.

Gradle Test Executor 10 finished executing tests.

> Task :beam-runners-google-cloud-dataflow-java:googleCloudPlatformLegacyWorkerIntegrationTest
FAILED

24 tests completed, 1 failed
Finished generating test XML results (0.024 secs) into: <https://builds.apache.org/job/beam_PostCommit_Java/ws/src/runners/google-cloud-dataflow-java/build/test-results/googleCloudPlatformLegacyWorkerIntegrationTest>
Generating HTML test report...
Finished generating test html results (0.024 secs) into: <https://builds.apache.org/job/beam_PostCommit_Java/ws/src/runners/google-cloud-dataflow-java/build/reports/tests/googleCloudPlatformLegacyWorkerIntegrationTest>
:beam-runners-google-cloud-dataflow-java:googleCloudPlatformLegacyWorkerIntegrationTest (Thread[Task
worker for ':' Thread 7,5,main]) completed. Took 1 hrs 33 mins 32.875 secs.

FAILURE: Build failed with an exception.

* What went wrong:
Execution failed for task ':beam-runners-google-cloud-dataflow-java:googleCloudPlatformLegacyWorkerIntegrationTest'.
> There were failing tests. See the report at: file://<https://builds.apache.org/job/beam_PostCommit_Java/ws/src/runners/google-cloud-dataflow-java/build/reports/tests/googleCloudPlatformLegacyWorkerIntegrationTest/index.html>

* Try:
Run with --stacktrace option to get the stack trace. Run with --debug option to get more log
output. Run with --scan to get full insights.

* Get more help at https://help.gradle.org

Deprecated Gradle features were used in this build, making it incompatible with Gradle 5.0.
Use '--warning-mode all' to show the individual deprecation warnings.
See https://docs.gradle.org/4.10.2/userguide/command_line_interface.html#sec:command_line_warnings

BUILD FAILED in 1h 54m 19s
74 actionable tasks: 69 executed, 5 from cache

Publishing build scan...
https://gradle.com/s/tzcvwmefdkq54

Build step 'Invoke Gradle script' changed build result to FAILURE
Build step 'Invoke Gradle script' marked build as failure

---------------------------------------------------------------------
To unsubscribe, e-mail: builds-unsubscribe@beam.apache.org
For additional commands, e-mail: builds-help@beam.apache.org


Mime
View raw message