beam-builds mailing list archives

Site index · List index
Message view « Date » · « Thread »
Top « Date » · « Thread »
From Apache Jenkins Server <jenk...@builds.apache.org>
Subject Build failed in Jenkins: beam_PostCommit_Python_Verify #7005
Date Mon, 07 Jan 2019 00:49:22 GMT
See <https://builds.apache.org/job/beam_PostCommit_Python_Verify/7005/display/redirect>

------------------------------------------
[...truncated 374.21 KB...]
              }
            }, 
            "output_name": "out", 
            "user_name": "WriteUserScoreSums/Write/WriteImpl/FinalizeWrite/_UnpickledSideInput(PreFinalize.out.0).output"
          }
        ], 
        "parallel_input": {
          "@type": "OutputReference", 
          "output_name": "out", 
          "step_name": "s17"
        }, 
        "user_name": "WriteUserScoreSums/Write/WriteImpl/FinalizeWrite/_UnpickledSideInput(PreFinalize.out.0)",

        "windowing_strategy": "%0AD%22B%0A%1Dref_Coder_GlobalWindowCoder_1%12%21%0A%1F%0A%1D%0A%1Bbeam%3Acoder%3Aglobal_window%3Av1jT%0A%25%0A%23%0A%21beam%3Awindowfn%3Aglobal_windows%3Av0.1%10%01%1A%1Dref_Coder_GlobalWindowCoder_1%22%02%3A%00%28%010%018%01H%01"
      }
    }, 
    {
      "kind": "ParallelDo", 
      "name": "s21", 
      "properties": {
        "display_data": [
          {
            "key": "fn", 
            "label": "Transform Function", 
            "namespace": "apache_beam.transforms.core.CallableWrapperDoFn", 
            "type": "STRING", 
            "value": "_finalize_write"
          }, 
          {
            "key": "fn", 
            "label": "Transform Function", 
            "namespace": "apache_beam.transforms.core.ParDo", 
            "shortValue": "CallableWrapperDoFn", 
            "type": "STRING", 
            "value": "apache_beam.transforms.core.CallableWrapperDoFn"
          }
        ], 
        "non_parallel_inputs": {
          "side0-WriteUserScoreSums/Write/WriteImpl/FinalizeWrite": {
            "@type": "OutputReference", 
            "output_name": "out", 
            "step_name": "SideInput-s18"
          }, 
          "side1-WriteUserScoreSums/Write/WriteImpl/FinalizeWrite": {
            "@type": "OutputReference", 
            "output_name": "out", 
            "step_name": "SideInput-s19"
          }, 
          "side2-WriteUserScoreSums/Write/WriteImpl/FinalizeWrite": {
            "@type": "OutputReference", 
            "output_name": "out", 
            "step_name": "SideInput-s20"
          }
        }, 
        "output_info": [
          {
            "encoding": {
              "@type": "kind:windowed_value", 
              "component_encodings": [
                {
                  "@type": "FastPrimitivesCoder$eNprYEpOLEhMzkiNT0pNzNVLzk9JLSqGUlxuicUlAUWZuZklmWWpxc4gQa5CBs3GQsbaQqZQ/vi0xJycpMTk7Hiw+kJmPEYFZCZn56RCjWABGsFaW8iWVJykBwDlGS3/",

                  "component_encodings": [
                    {
                      "@type": "FastPrimitivesCoder$eNprYEpOLEhMzkiNT0pNzNVLzk9JLSqGUlxuicUlAUWZuZklmWWpxc4gQa5CBs3GQsbaQqZQ/vi0xJycpMTk7Hiw+kJmPEYFZCZn56RCjWABGsFaW8iWVJykBwDlGS3/",

                      "component_encodings": []
                    }, 
                    {
                      "@type": "FastPrimitivesCoder$eNprYEpOLEhMzkiNT0pNzNVLzk9JLSqGUlxuicUlAUWZuZklmWWpxc4gQa5CBs3GQsbaQqZQ/vi0xJycpMTk7Hiw+kJmPEYFZCZn56RCjWABGsFaW8iWVJykBwDlGS3/",

                      "component_encodings": []
                    }
                  ], 
                  "is_pair_like": true
                }, 
                {
                  "@type": "kind:global_window"
                }
              ], 
              "is_wrapper": true
            }, 
            "output_name": "out", 
            "user_name": "WriteUserScoreSums/Write/WriteImpl/FinalizeWrite.out"
          }
        ], 
        "parallel_input": {
          "@type": "OutputReference", 
          "output_name": "out", 
          "step_name": "s7"
        }, 
        "serialized_fn": "<string of 2420 bytes>", 
        "user_name": "WriteUserScoreSums/Write/WriteImpl/FinalizeWrite/FinalizeWrite"
      }
    }
  ], 
  "type": "JOB_TYPE_BATCH"
}
root: INFO: Create job: <Job
 createTime: u'2019-01-07T00:04:40.135573Z'
 currentStateTime: u'1970-01-01T00:00:00Z'
 id: u'2019-01-06_16_04_38-21777881041313801'
 location: u'us-central1'
 name: u'beamapp-jenkins-0107000431-913684'
 projectId: u'apache-beam-testing'
 stageStates: []
 startTime: u'2019-01-07T00:04:40.135573Z'
 steps: []
 tempFiles: []
 type: TypeValueValuesEnum(JOB_TYPE_BATCH, 1)>
root: INFO: Created job with id: [2019-01-06_16_04_38-21777881041313801]
root: INFO: To access the Dataflow monitoring console, please navigate to https://console.cloud.google.com/dataflow/jobsDetail/locations/us-central1/jobs/2019-01-06_16_04_38-21777881041313801?project=apache-beam-testing
root: INFO: Job 2019-01-06_16_04_38-21777881041313801 is in state JOB_STATE_RUNNING
root: INFO: 2019-01-07T00:04:38.752Z: JOB_MESSAGE_DETAILED: Autoscaling is enabled for job
2019-01-06_16_04_38-21777881041313801. The number of workers will be between 1 and 1000.
root: INFO: 2019-01-07T00:04:38.831Z: JOB_MESSAGE_DETAILED: Autoscaling was automatically
enabled for job 2019-01-06_16_04_38-21777881041313801.
root: INFO: 2019-01-07T00:04:42.494Z: JOB_MESSAGE_DETAILED: Checking permissions granted to
controller Service Account.
root: INFO: 2019-01-07T00:04:43.212Z: JOB_MESSAGE_BASIC: Worker configuration: n1-standard-1
in us-central1-b.
root: INFO: 2019-01-07T00:04:43.669Z: JOB_MESSAGE_DETAILED: Expanding CoGroupByKey operations
into optimizable parts.
root: INFO: 2019-01-07T00:04:43.709Z: JOB_MESSAGE_DEBUG: Combiner lifting skipped for step
WriteUserScoreSums/Write/WriteImpl/GroupByKey: GroupByKey not followed by a combiner.
root: INFO: 2019-01-07T00:04:43.752Z: JOB_MESSAGE_DETAILED: Expanding GroupByKey operations
into optimizable parts.
root: INFO: 2019-01-07T00:04:43.795Z: JOB_MESSAGE_DETAILED: Lifting ValueCombiningMappingFns
into MergeBucketsMappingFns
root: INFO: 2019-01-07T00:04:43.922Z: JOB_MESSAGE_DEBUG: Annotating graph with Autotuner information.
root: INFO: 2019-01-07T00:04:43.972Z: JOB_MESSAGE_DETAILED: Fusing adjacent ParDo, Read, Write,
and Flatten operations
root: INFO: 2019-01-07T00:04:44.008Z: JOB_MESSAGE_DETAILED: Fusing consumer UserScore/ExtractAndSumScore/CombinePerKey(sum)/GroupByKey/Reify
into UserScore/ExtractAndSumScore/CombinePerKey(sum)/GroupByKey+UserScore/ExtractAndSumScore/CombinePerKey(sum)/Combine/Partial
root: INFO: 2019-01-07T00:04:44.046Z: JOB_MESSAGE_DETAILED: Fusing consumer UserScore/ExtractAndSumScore/CombinePerKey(sum)/GroupByKey/Write
into UserScore/ExtractAndSumScore/CombinePerKey(sum)/GroupByKey/Reify
root: INFO: 2019-01-07T00:04:44.089Z: JOB_MESSAGE_DETAILED: Fusing consumer WriteUserScoreSums/Write/WriteImpl/GroupByKey/Write
into WriteUserScoreSums/Write/WriteImpl/GroupByKey/Reify
root: INFO: 2019-01-07T00:04:44.132Z: JOB_MESSAGE_DETAILED: Fusing consumer WriteUserScoreSums/Write/WriteImpl/GroupByKey/Reify
into WriteUserScoreSums/Write/WriteImpl/WindowInto(WindowIntoFn)
root: INFO: 2019-01-07T00:04:44.181Z: JOB_MESSAGE_DETAILED: Fusing consumer UserScore/ExtractAndSumScore/CombinePerKey(sum)/Combine/Extract
into UserScore/ExtractAndSumScore/CombinePerKey(sum)/Combine
root: INFO: 2019-01-07T00:04:44.223Z: JOB_MESSAGE_DETAILED: Fusing consumer WriteUserScoreSums/Write/WriteImpl/Extract
into WriteUserScoreSums/Write/WriteImpl/GroupByKey/GroupByWindow
root: INFO: 2019-01-07T00:04:44.264Z: JOB_MESSAGE_DETAILED: Fusing consumer WriteUserScoreSums/Write/WriteImpl/Pair
into WriteUserScoreSums/Write/WriteImpl/WriteBundles/WriteBundles
root: INFO: 2019-01-07T00:04:44.311Z: JOB_MESSAGE_DETAILED: Fusing consumer WriteUserScoreSums/Write/WriteImpl/WindowInto(WindowIntoFn)
into WriteUserScoreSums/Write/WriteImpl/Pair
root: INFO: 2019-01-07T00:04:44.357Z: JOB_MESSAGE_DETAILED: Fusing consumer UserScore/ParseGameEventFn
into ReadInputText/Read
root: INFO: 2019-01-07T00:04:44.403Z: JOB_MESSAGE_DETAILED: Fusing consumer UserScore/ExtractAndSumScore/CombinePerKey(sum)/GroupByKey+UserScore/ExtractAndSumScore/CombinePerKey(sum)/Combine/Partial
into UserScore/ExtractAndSumScore/Map(<lambda at user_score.py:111>)
root: INFO: 2019-01-07T00:04:44.455Z: JOB_MESSAGE_DETAILED: Fusing consumer WriteUserScoreSums/Write/WriteImpl/WriteBundles/WriteBundles
into FormatUserScoreSums
root: INFO: 2019-01-07T00:04:44.500Z: JOB_MESSAGE_DETAILED: Fusing consumer FormatUserScoreSums
into UserScore/ExtractAndSumScore/CombinePerKey(sum)/Combine/Extract
root: INFO: 2019-01-07T00:04:44.540Z: JOB_MESSAGE_DETAILED: Fusing consumer UserScore/ExtractAndSumScore/Map(<lambda
at user_score.py:111>) into UserScore/ParseGameEventFn
root: INFO: 2019-01-07T00:04:44.590Z: JOB_MESSAGE_DETAILED: Fusing consumer WriteUserScoreSums/Write/WriteImpl/GroupByKey/GroupByWindow
into WriteUserScoreSums/Write/WriteImpl/GroupByKey/Read
root: INFO: 2019-01-07T00:04:44.628Z: JOB_MESSAGE_DETAILED: Fusing consumer UserScore/ExtractAndSumScore/CombinePerKey(sum)/Combine
into UserScore/ExtractAndSumScore/CombinePerKey(sum)/GroupByKey/Read
root: INFO: 2019-01-07T00:04:44.674Z: JOB_MESSAGE_DETAILED: Fusing consumer WriteUserScoreSums/Write/WriteImpl/InitializeWrite
into WriteUserScoreSums/Write/WriteImpl/DoOnce/Read
root: INFO: 2019-01-07T00:04:44.717Z: JOB_MESSAGE_DEBUG: Workflow config is missing a default
resource spec.
root: INFO: 2019-01-07T00:04:44.757Z: JOB_MESSAGE_DEBUG: Adding StepResource setup and teardown
to workflow graph.
root: INFO: 2019-01-07T00:04:44.804Z: JOB_MESSAGE_DEBUG: Adding workflow start and stop steps.
root: INFO: 2019-01-07T00:04:44.846Z: JOB_MESSAGE_DEBUG: Assigning stage ids.
root: INFO: 2019-01-07T00:04:45.042Z: JOB_MESSAGE_DEBUG: Executing wait step start35
root: INFO: 2019-01-07T00:04:45.132Z: JOB_MESSAGE_BASIC: Executing operation WriteUserScoreSums/Write/WriteImpl/DoOnce/Read+WriteUserScoreSums/Write/WriteImpl/InitializeWrite
root: INFO: 2019-01-07T00:04:45.180Z: JOB_MESSAGE_BASIC: Executing operation WriteUserScoreSums/Write/WriteImpl/GroupByKey/Create
root: INFO: 2019-01-07T00:04:45.195Z: JOB_MESSAGE_DEBUG: Starting worker pool setup.
root: INFO: 2019-01-07T00:04:45.215Z: JOB_MESSAGE_BASIC: Executing operation UserScore/ExtractAndSumScore/CombinePerKey(sum)/GroupByKey/Create
root: INFO: 2019-01-07T00:04:45.254Z: JOB_MESSAGE_BASIC: Starting 1 workers in us-central1-b...
root: INFO: 2019-01-07T00:04:45.382Z: JOB_MESSAGE_DEBUG: Value "WriteUserScoreSums/Write/WriteImpl/GroupByKey/Session"
materialized.
root: INFO: 2019-01-07T00:04:45.421Z: JOB_MESSAGE_DEBUG: Value "UserScore/ExtractAndSumScore/CombinePerKey(sum)/GroupByKey/Session"
materialized.
root: INFO: 2019-01-07T00:04:45.515Z: JOB_MESSAGE_BASIC: Executing operation ReadInputText/Read+UserScore/ParseGameEventFn+UserScore/ExtractAndSumScore/Map(<lambda
at user_score.py:111>)+UserScore/ExtractAndSumScore/CombinePerKey(sum)/GroupByKey+UserScore/ExtractAndSumScore/CombinePerKey(sum)/Combine/Partial+UserScore/ExtractAndSumScore/CombinePerKey(sum)/GroupByKey/Reify+UserScore/ExtractAndSumScore/CombinePerKey(sum)/GroupByKey/Write
root: INFO: 2019-01-07T00:04:55.071Z: JOB_MESSAGE_DETAILED: Autoscaling: Raised the number
of workers to 0 based on the rate of progress in the currently running step(s).
root: INFO: 2019-01-07T00:05:00.953Z: JOB_MESSAGE_BASIC: Autoscaling: Resizing worker pool
from 1 to 5.
root: INFO: 2019-01-07T00:05:18.978Z: JOB_MESSAGE_DETAILED: Autoscaling: Raised the number
of workers to 1 based on the rate of progress in the currently running step(s).
root: INFO: 2019-01-07T00:05:19.027Z: JOB_MESSAGE_DETAILED: Resized worker pool to 1, though
goal was 5.  This could be a quota issue.
root: INFO: 2019-01-07T00:05:42.234Z: JOB_MESSAGE_DETAILED: Autoscaling: Raised the number
of workers to 2 based on the rate of progress in the currently running step(s).
root: INFO: 2019-01-07T00:05:42.273Z: JOB_MESSAGE_DETAILED: Resized worker pool to 2, though
goal was 5.  This could be a quota issue.
root: INFO: 2019-01-07T00:05:48.311Z: JOB_MESSAGE_DETAILED: Autoscaling: Raised the number
of workers to 5 based on the rate of progress in the currently running step(s).
root: INFO: 2019-01-07T00:06:09.479Z: JOB_MESSAGE_DETAILED: Workers have started successfully.
root: INFO: 2019-01-07T00:06:09.532Z: JOB_MESSAGE_DETAILED: Workers have started successfully.
root: INFO: 2019-01-07T00:09:20.656Z: JOB_MESSAGE_BASIC: Autoscaling: Resizing worker pool
from 5 to 7.
root: INFO: 2019-01-07T00:09:48.573Z: JOB_MESSAGE_BASIC: Autoscaling: Resizing worker pool
from 7 to 9.
root: INFO: 2019-01-07T00:09:49.029Z: JOB_MESSAGE_DETAILED: Autoscaling: Raised the number
of workers to 7 based on the rate of progress in the currently running step(s).
root: INFO: 2019-01-07T00:09:49.081Z: JOB_MESSAGE_DETAILED: Resized worker pool to 7, though
goal was 9.  This could be a quota issue.
root: INFO: 2019-01-07T00:10:12.312Z: JOB_MESSAGE_DETAILED: Autoscaling: Raised the number
of workers to 9 based on the rate of progress in the currently running step(s).
root: INFO: 2019-01-07T00:10:12.355Z: JOB_MESSAGE_DETAILED: Resized worker pool to 9, though
goal was 11.  This could be a quota issue.
root: INFO: 2019-01-07T00:10:20.562Z: JOB_MESSAGE_BASIC: Autoscaling: Resizing worker pool
from 9 to 11.
root: INFO: 2019-01-07T00:10:48.605Z: JOB_MESSAGE_BASIC: Autoscaling: Resizing worker pool
from 11 to 14.
root: INFO: 2019-01-07T00:10:49.024Z: JOB_MESSAGE_DETAILED: Autoscaling: Raised the number
of workers to 11 based on the rate of progress in the currently running step(s).
root: INFO: 2019-01-07T00:10:49.068Z: JOB_MESSAGE_DETAILED: Resized worker pool to 11, though
goal was 14.  This could be a quota issue.
root: INFO: 2019-01-07T00:11:12.328Z: JOB_MESSAGE_DETAILED: Autoscaling: Raised the number
of workers to 13 based on the rate of progress in the currently running step(s).
root: INFO: 2019-01-07T00:11:12.368Z: JOB_MESSAGE_DETAILED: Resized worker pool to 13, though
goal was 17.  This could be a quota issue.
root: INFO: 2019-01-07T00:11:21.247Z: JOB_MESSAGE_BASIC: Autoscaling: Resizing worker pool
from 14 to 17.
root: INFO: 2019-01-07T00:11:22.140Z: JOB_MESSAGE_DETAILED: Autoscaling: Raised the number
of workers to 14 based on the rate of progress in the currently running step(s).
root: INFO: 2019-01-07T00:11:22.184Z: JOB_MESSAGE_DETAILED: Resized worker pool to 14, though
goal was 17.  This could be a quota issue.
root: INFO: 2019-01-07T00:11:35.280Z: JOB_MESSAGE_ERROR: A setup error was detected in beamapp-jenkins-010700043-01061604-hwp7-harness-5j22.
Please refer to the worker-startup log for detailed information.
root: INFO: 2019-01-07T00:11:35.962Z: JOB_MESSAGE_ERROR: A setup error was detected in beamapp-jenkins-010700043-01061604-hwp7-harness-5j22.
Please refer to the worker-startup log for detailed information.
root: INFO: 2019-01-07T00:11:49.719Z: JOB_MESSAGE_ERROR: A setup error was detected in beamapp-jenkins-010700043-01061604-hwp7-harness-5j22.
Please refer to the worker-startup log for detailed information.
root: INFO: 2019-01-07T00:11:50.470Z: JOB_MESSAGE_DETAILED: Autoscaling: Raised the number
of workers to 16 based on the rate of progress in the currently running step(s).
root: INFO: 2019-01-07T00:11:50.512Z: JOB_MESSAGE_DETAILED: Resized worker pool to 16, though
goal was 17.  This could be a quota issue.
root: INFO: 2019-01-07T00:12:01.266Z: JOB_MESSAGE_DETAILED: Autoscaling: Raised the number
of workers to 17 based on the rate of progress in the currently running step(s).
root: INFO: 2019-01-07T00:12:21.732Z: JOB_MESSAGE_ERROR: A setup error was detected in beamapp-jenkins-010700043-01061604-hwp7-harness-5j22.
Please refer to the worker-startup log for detailed information.
root: INFO: 2019-01-07T00:12:21.786Z: JOB_MESSAGE_DEBUG: Executing failure step failure34
root: INFO: 2019-01-07T00:12:21.831Z: JOB_MESSAGE_ERROR: Workflow failed. Causes: S06:ReadInputText/Read+UserScore/ParseGameEventFn+UserScore/ExtractAndSumScore/Map(<lambda
at user_score.py:111>)+UserScore/ExtractAndSumScore/CombinePerKey(sum)/GroupByKey+UserScore/ExtractAndSumScore/CombinePerKey(sum)/Combine/Partial+UserScore/ExtractAndSumScore/CombinePerKey(sum)/GroupByKey/Reify+UserScore/ExtractAndSumScore/CombinePerKey(sum)/GroupByKey/Write
failed., A work item was attempted 4 times without success. Each time the worker eventually
lost contact with the service. The work item was attempted on: 
  beamapp-jenkins-010700043-01061604-hwp7-harness-5j22,
  beamapp-jenkins-010700043-01061604-hwp7-harness-5j22,
  beamapp-jenkins-010700043-01061604-hwp7-harness-5j22,
  beamapp-jenkins-010700043-01061604-hwp7-harness-5j22
root: INFO: 2019-01-07T00:12:21.995Z: JOB_MESSAGE_DETAILED: Cleaning up.
root: INFO: 2019-01-07T00:12:22.061Z: JOB_MESSAGE_DEBUG: Starting worker pool teardown.
root: INFO: 2019-01-07T00:12:22.104Z: JOB_MESSAGE_BASIC: Stopping worker pool...
root: INFO: 2019-01-07T00:14:31.449Z: JOB_MESSAGE_DETAILED: Autoscaling: Reduced the number
of workers to 0 based on the rate of progress in the currently running step(s).
root: INFO: 2019-01-07T00:14:31.503Z: JOB_MESSAGE_BASIC: Worker pool stopped.
root: INFO: 2019-01-07T00:14:31.564Z: JOB_MESSAGE_DEBUG: Tearing down pending resources...
root: INFO: Job 2019-01-06_16_04_38-21777881041313801 is in state JOB_STATE_FAILED
--------------------- >> end captured logging << ---------------------

----------------------------------------------------------------------
XML: <https://builds.apache.org/job/beam_PostCommit_Python_Verify/ws/src/sdks/python/nosetests.xml>
----------------------------------------------------------------------
Ran 25 tests in 2690.707s

FAILED (errors=1)
Found: https://console.cloud.google.com/dataflow/jobsDetail/locations/us-central1/jobs/2019-01-06_16_04_38-11189501735736610342?project=apache-beam-testing.
Found: https://console.cloud.google.com/dataflow/jobsDetail/locations/us-central1/jobs/2019-01-06_16_11_17-11181924784874477748?project=apache-beam-testing.
Found: https://console.cloud.google.com/dataflow/jobsDetail/locations/us-central1/jobs/2019-01-06_16_17_31-2009595741674269969?project=apache-beam-testing.
Found: https://console.cloud.google.com/dataflow/jobsDetail/locations/us-central1/jobs/2019-01-06_16_23_15-71500462462694821?project=apache-beam-testing.
Found: https://console.cloud.google.com/dataflow/jobsDetail/locations/us-central1/jobs/2019-01-06_16_29_33-10019211774845092890?project=apache-beam-testing.
Found: https://console.cloud.google.com/dataflow/jobsDetail/locations/us-central1/jobs/2019-01-06_16_36_00-11299291340368736076?project=apache-beam-testing.
Found: https://console.cloud.google.com/dataflow/jobsDetail/locations/us-central1/jobs/2019-01-06_16_41_43-4850342599324709627?project=apache-beam-testing.
Found: https://console.cloud.google.com/dataflow/jobsDetail/locations/us-central1/jobs/2019-01-06_16_04_40-835258801246969563?project=apache-beam-testing.
Found: https://console.cloud.google.com/dataflow/jobsDetail/locations/us-central1/jobs/2019-01-06_16_04_38-15178925652744445817?project=apache-beam-testing.
Found: https://console.cloud.google.com/dataflow/jobsDetail/locations/us-central1/jobs/2019-01-06_16_04_39-11632034271085809610?project=apache-beam-testing.
Found: https://console.cloud.google.com/dataflow/jobsDetail/locations/us-central1/jobs/2019-01-06_16_16_57-2948078822766327547?project=apache-beam-testing.
Found: https://console.cloud.google.com/dataflow/jobsDetail/locations/us-central1/jobs/2019-01-06_16_04_38-21777881041313801?project=apache-beam-testing.
Found: https://console.cloud.google.com/dataflow/jobsDetail/locations/us-central1/jobs/2019-01-06_16_14_46-11741596029024076961?project=apache-beam-testing.
Found: https://console.cloud.google.com/dataflow/jobsDetail/locations/us-central1/jobs/2019-01-06_16_20_10-611204491503983764?project=apache-beam-testing.
Found: https://console.cloud.google.com/dataflow/jobsDetail/locations/us-central1/jobs/2019-01-06_16_26_19-17092289158582559403?project=apache-beam-testing.
Found: https://console.cloud.google.com/dataflow/jobsDetail/locations/us-central1/jobs/2019-01-06_16_04_37-4741499714291614656?project=apache-beam-testing.
Found: https://console.cloud.google.com/dataflow/jobsDetail/locations/us-central1/jobs/2019-01-06_16_10_58-11582982985911425454?project=apache-beam-testing.
Found: https://console.cloud.google.com/dataflow/jobsDetail/locations/us-central1/jobs/2019-01-06_16_18_18-14215460258942600412?project=apache-beam-testing.
Found: https://console.cloud.google.com/dataflow/jobsDetail/locations/us-central1/jobs/2019-01-06_16_24_57-12258452289032832552?project=apache-beam-testing.
Found: https://console.cloud.google.com/dataflow/jobsDetail/locations/us-central1/jobs/2019-01-06_16_04_38-12718010845967775888?project=apache-beam-testing.
Found: https://console.cloud.google.com/dataflow/jobsDetail/locations/us-central1/jobs/2019-01-06_16_11_32-3095487944387048969?project=apache-beam-testing.
Found: https://console.cloud.google.com/dataflow/jobsDetail/locations/us-central1/jobs/2019-01-06_16_18_47-7075093663826426067?project=apache-beam-testing.
Found: https://console.cloud.google.com/dataflow/jobsDetail/locations/us-central1/jobs/2019-01-06_16_04_38-11753554805061505225?project=apache-beam-testing.
Found: https://console.cloud.google.com/dataflow/jobsDetail/locations/us-central1/jobs/2019-01-06_16_12_17-11917182018615819033?project=apache-beam-testing.

> Task :beam-sdks-python:postCommitIT FAILED

FAILURE: Build failed with an exception.

* Where:
Build file '<https://builds.apache.org/job/beam_PostCommit_Python_Verify/ws/src/sdks/python/build.gradle'>
line: 276

* What went wrong:
Execution failed for task ':beam-sdks-python:postCommitIT'.
> Process 'command 'sh'' finished with non-zero exit value 1

* Try:
Run with --stacktrace option to get the stack trace. Run with --info or --debug option to
get more log output. Run with --scan to get full insights.

* Get more help at https://help.gradle.org

BUILD FAILED in 49m 12s
6 actionable tasks: 6 executed

Publishing build scan...
https://gradle.com/s/endgkhlti6nfe

Build step 'Invoke Gradle script' changed build result to FAILURE
Build step 'Invoke Gradle script' marked build as failure

---------------------------------------------------------------------
To unsubscribe, e-mail: builds-unsubscribe@beam.apache.org
For additional commands, e-mail: builds-help@beam.apache.org


Mime
View raw message