beam-builds mailing list archives

Site index · List index
Message view « Date » · « Thread »
Top « Date » · « Thread »
From Apache Jenkins Server <jenk...@builds.apache.org>
Subject Build failed in Jenkins: beam_PostCommit_Py_VR_Dataflow #2168
Date Wed, 02 Jan 2019 19:17:17 GMT
See <https://builds.apache.org/job/beam_PostCommit_Py_VR_Dataflow/2168/display/redirect?page=changes>

Changes:

[chamikara] Updates release validating to run LeaderBoard example using Dataflow

[robbe.sneyders] Python 3 port io.range_trackers

[robbe.sneyders] Add io.restriction_trackers_test to Python 3 test suite

[scott] [BEAM-6056] Source vendored grpc dependency from Maven central

------------------------------------------
[...truncated 308.33 KB...]
    self._fp.write(sfp.getvalue())
MemoryError: out of memory
-------------------- >> begin captured logging << --------------------
root: DEBUG: Connecting using Google Application Default Credentials.
root: INFO: Starting GCS upload to gs://temp-storage-for-end-to-end-tests/staging-it/beamapp-jenkins-0102190201-588843.1546455721.589037/pipeline.pb...
oauth2client.transport: INFO: Attempting refresh to obtain initial access_token
oauth2client.transport: INFO: Attempting refresh to obtain initial access_token
root: INFO: Completed GCS upload to gs://temp-storage-for-end-to-end-tests/staging-it/beamapp-jenkins-0102190201-588843.1546455721.589037/pipeline.pb
in 0 seconds.
root: INFO: Starting GCS upload to gs://temp-storage-for-end-to-end-tests/staging-it/beamapp-jenkins-0102190201-588843.1546455721.589037/requirements.txt...
root: INFO: Completed GCS upload to gs://temp-storage-for-end-to-end-tests/staging-it/beamapp-jenkins-0102190201-588843.1546455721.589037/requirements.txt
in 0 seconds.
root: INFO: Executing command: ['<https://builds.apache.org/job/beam_PostCommit_Py_VR_Dataflow/ws/src/build/gradleenv/1327086738/bin/python',>
'-m', 'pip', 'download', '--dest', '/tmp/dataflow-requirements-cache', '-r', 'postcommit_requirements.txt',
'--exists-action', 'i', '--no-binary', ':all:']
root: INFO: Starting GCS upload to gs://temp-storage-for-end-to-end-tests/staging-it/beamapp-jenkins-0102190201-588843.1546455721.589037/pbr-4.2.0.tar.gz...
root: INFO: Completed GCS upload to gs://temp-storage-for-end-to-end-tests/staging-it/beamapp-jenkins-0102190201-588843.1546455721.589037/pbr-4.2.0.tar.gz
in 0 seconds.
root: INFO: Starting GCS upload to gs://temp-storage-for-end-to-end-tests/staging-it/beamapp-jenkins-0102190201-588843.1546455721.589037/setuptools-40.0.0.zip...
root: INFO: Completed GCS upload to gs://temp-storage-for-end-to-end-tests/staging-it/beamapp-jenkins-0102190201-588843.1546455721.589037/setuptools-40.0.0.zip
in 0 seconds.
root: INFO: Starting GCS upload to gs://temp-storage-for-end-to-end-tests/staging-it/beamapp-jenkins-0102190201-588843.1546455721.589037/pbr-4.3.0.tar.gz...
root: INFO: Completed GCS upload to gs://temp-storage-for-end-to-end-tests/staging-it/beamapp-jenkins-0102190201-588843.1546455721.589037/pbr-4.3.0.tar.gz
in 0 seconds.
root: INFO: Starting GCS upload to gs://temp-storage-for-end-to-end-tests/staging-it/beamapp-jenkins-0102190201-588843.1546455721.589037/setuptools-40.3.0.zip...
root: INFO: Completed GCS upload to gs://temp-storage-for-end-to-end-tests/staging-it/beamapp-jenkins-0102190201-588843.1546455721.589037/setuptools-40.3.0.zip
in 0 seconds.
root: INFO: Starting GCS upload to gs://temp-storage-for-end-to-end-tests/staging-it/beamapp-jenkins-0102190201-588843.1546455721.589037/setuptools-39.1.0.zip...
root: INFO: Completed GCS upload to gs://temp-storage-for-end-to-end-tests/staging-it/beamapp-jenkins-0102190201-588843.1546455721.589037/setuptools-39.1.0.zip
in 0 seconds.
root: INFO: Starting GCS upload to gs://temp-storage-for-end-to-end-tests/staging-it/beamapp-jenkins-0102190201-588843.1546455721.589037/PyHamcrest-1.9.0.tar.gz...
root: INFO: Completed GCS upload to gs://temp-storage-for-end-to-end-tests/staging-it/beamapp-jenkins-0102190201-588843.1546455721.589037/PyHamcrest-1.9.0.tar.gz
in 0 seconds.
root: INFO: Starting GCS upload to gs://temp-storage-for-end-to-end-tests/staging-it/beamapp-jenkins-0102190201-588843.1546455721.589037/setuptools-40.4.2.zip...
root: INFO: Completed GCS upload to gs://temp-storage-for-end-to-end-tests/staging-it/beamapp-jenkins-0102190201-588843.1546455721.589037/setuptools-40.4.2.zip
in 0 seconds.
root: INFO: Starting GCS upload to gs://temp-storage-for-end-to-end-tests/staging-it/beamapp-jenkins-0102190201-588843.1546455721.589037/pbr-5.1.1.tar.gz...
root: INFO: Completed GCS upload to gs://temp-storage-for-end-to-end-tests/staging-it/beamapp-jenkins-0102190201-588843.1546455721.589037/pbr-5.1.1.tar.gz
in 0 seconds.
root: INFO: Starting GCS upload to gs://temp-storage-for-end-to-end-tests/staging-it/beamapp-jenkins-0102190201-588843.1546455721.589037/setuptools-40.5.0.zip...
root: INFO: Completed GCS upload to gs://temp-storage-for-end-to-end-tests/staging-it/beamapp-jenkins-0102190201-588843.1546455721.589037/setuptools-40.5.0.zip
in 0 seconds.
root: INFO: Starting GCS upload to gs://temp-storage-for-end-to-end-tests/staging-it/beamapp-jenkins-0102190201-588843.1546455721.589037/pbr-4.0.4.tar.gz...
root: INFO: Completed GCS upload to gs://temp-storage-for-end-to-end-tests/staging-it/beamapp-jenkins-0102190201-588843.1546455721.589037/pbr-4.0.4.tar.gz
in 0 seconds.
root: INFO: Starting GCS upload to gs://temp-storage-for-end-to-end-tests/staging-it/beamapp-jenkins-0102190201-588843.1546455721.589037/setuptools-40.4.1.zip...
root: INFO: Completed GCS upload to gs://temp-storage-for-end-to-end-tests/staging-it/beamapp-jenkins-0102190201-588843.1546455721.589037/setuptools-40.4.1.zip
in 0 seconds.
root: INFO: Starting GCS upload to gs://temp-storage-for-end-to-end-tests/staging-it/beamapp-jenkins-0102190201-588843.1546455721.589037/setuptools-40.6.1.zip...
root: INFO: Completed GCS upload to gs://temp-storage-for-end-to-end-tests/staging-it/beamapp-jenkins-0102190201-588843.1546455721.589037/setuptools-40.6.1.zip
in 0 seconds.
root: INFO: Starting GCS upload to gs://temp-storage-for-end-to-end-tests/staging-it/beamapp-jenkins-0102190201-588843.1546455721.589037/pbr-5.1.0.tar.gz...
root: INFO: Completed GCS upload to gs://temp-storage-for-end-to-end-tests/staging-it/beamapp-jenkins-0102190201-588843.1546455721.589037/pbr-5.1.0.tar.gz
in 0 seconds.
root: INFO: Starting GCS upload to gs://temp-storage-for-end-to-end-tests/staging-it/beamapp-jenkins-0102190201-588843.1546455721.589037/setuptools-40.1.0.zip...
root: INFO: Completed GCS upload to gs://temp-storage-for-end-to-end-tests/staging-it/beamapp-jenkins-0102190201-588843.1546455721.589037/setuptools-40.1.0.zip
in 0 seconds.
root: INFO: Starting GCS upload to gs://temp-storage-for-end-to-end-tests/staging-it/beamapp-jenkins-0102190201-588843.1546455721.589037/pbr-4.0.3.tar.gz...
root: INFO: Completed GCS upload to gs://temp-storage-for-end-to-end-tests/staging-it/beamapp-jenkins-0102190201-588843.1546455721.589037/pbr-4.0.3.tar.gz
in 0 seconds.
root: INFO: Starting GCS upload to gs://temp-storage-for-end-to-end-tests/staging-it/beamapp-jenkins-0102190201-588843.1546455721.589037/pbr-4.1.1.tar.gz...
root: INFO: Completed GCS upload to gs://temp-storage-for-end-to-end-tests/staging-it/beamapp-jenkins-0102190201-588843.1546455721.589037/pbr-4.1.1.tar.gz
in 0 seconds.
root: INFO: Starting GCS upload to gs://temp-storage-for-end-to-end-tests/staging-it/beamapp-jenkins-0102190201-588843.1546455721.589037/setuptools-39.2.0.zip...
root: INFO: Completed GCS upload to gs://temp-storage-for-end-to-end-tests/staging-it/beamapp-jenkins-0102190201-588843.1546455721.589037/setuptools-39.2.0.zip
in 0 seconds.
root: INFO: Starting GCS upload to gs://temp-storage-for-end-to-end-tests/staging-it/beamapp-jenkins-0102190201-588843.1546455721.589037/mock-2.0.0.tar.gz...
root: INFO: Completed GCS upload to gs://temp-storage-for-end-to-end-tests/staging-it/beamapp-jenkins-0102190201-588843.1546455721.589037/mock-2.0.0.tar.gz
in 0 seconds.
root: INFO: Starting GCS upload to gs://temp-storage-for-end-to-end-tests/staging-it/beamapp-jenkins-0102190201-588843.1546455721.589037/pbr-5.0.0.tar.gz...
root: INFO: Completed GCS upload to gs://temp-storage-for-end-to-end-tests/staging-it/beamapp-jenkins-0102190201-588843.1546455721.589037/pbr-5.0.0.tar.gz
in 0 seconds.
root: INFO: Starting GCS upload to gs://temp-storage-for-end-to-end-tests/staging-it/beamapp-jenkins-0102190201-588843.1546455721.589037/setuptools-40.6.0.zip...
root: INFO: Completed GCS upload to gs://temp-storage-for-end-to-end-tests/staging-it/beamapp-jenkins-0102190201-588843.1546455721.589037/setuptools-40.6.0.zip
in 0 seconds.
root: INFO: Starting GCS upload to gs://temp-storage-for-end-to-end-tests/staging-it/beamapp-jenkins-0102190201-588843.1546455721.589037/setuptools-40.2.0.zip...
root: INFO: Completed GCS upload to gs://temp-storage-for-end-to-end-tests/staging-it/beamapp-jenkins-0102190201-588843.1546455721.589037/setuptools-40.2.0.zip
in 0 seconds.
root: INFO: Starting GCS upload to gs://temp-storage-for-end-to-end-tests/staging-it/beamapp-jenkins-0102190201-588843.1546455721.589037/six-1.12.0.tar.gz...
root: INFO: Completed GCS upload to gs://temp-storage-for-end-to-end-tests/staging-it/beamapp-jenkins-0102190201-588843.1546455721.589037/six-1.12.0.tar.gz
in 0 seconds.
root: INFO: Starting GCS upload to gs://temp-storage-for-end-to-end-tests/staging-it/beamapp-jenkins-0102190201-588843.1546455721.589037/six-1.11.0.tar.gz...
root: INFO: Completed GCS upload to gs://temp-storage-for-end-to-end-tests/staging-it/beamapp-jenkins-0102190201-588843.1546455721.589037/six-1.11.0.tar.gz
in 0 seconds.
root: INFO: Starting GCS upload to gs://temp-storage-for-end-to-end-tests/staging-it/beamapp-jenkins-0102190201-588843.1546455721.589037/setuptools-40.6.2.zip...
root: INFO: Completed GCS upload to gs://temp-storage-for-end-to-end-tests/staging-it/beamapp-jenkins-0102190201-588843.1546455721.589037/setuptools-40.6.2.zip
in 0 seconds.
root: INFO: Starting GCS upload to gs://temp-storage-for-end-to-end-tests/staging-it/beamapp-jenkins-0102190201-588843.1546455721.589037/setuptools-40.4.3.zip...
root: INFO: Completed GCS upload to gs://temp-storage-for-end-to-end-tests/staging-it/beamapp-jenkins-0102190201-588843.1546455721.589037/setuptools-40.4.3.zip
in 0 seconds.
root: INFO: Starting GCS upload to gs://temp-storage-for-end-to-end-tests/staging-it/beamapp-jenkins-0102190201-588843.1546455721.589037/setuptools-40.6.3.zip...
root: INFO: Completed GCS upload to gs://temp-storage-for-end-to-end-tests/staging-it/beamapp-jenkins-0102190201-588843.1546455721.589037/setuptools-40.6.3.zip
in 0 seconds.
root: INFO: Starting GCS upload to gs://temp-storage-for-end-to-end-tests/staging-it/beamapp-jenkins-0102190201-588843.1546455721.589037/funcsigs-1.0.2.tar.gz...
root: INFO: Completed GCS upload to gs://temp-storage-for-end-to-end-tests/staging-it/beamapp-jenkins-0102190201-588843.1546455721.589037/funcsigs-1.0.2.tar.gz
in 0 seconds.
root: INFO: Starting GCS upload to gs://temp-storage-for-end-to-end-tests/staging-it/beamapp-jenkins-0102190201-588843.1546455721.589037/pbr-4.1.0.tar.gz...
root: INFO: Completed GCS upload to gs://temp-storage-for-end-to-end-tests/staging-it/beamapp-jenkins-0102190201-588843.1546455721.589037/pbr-4.1.0.tar.gz
in 0 seconds.
root: INFO: Copying Beam SDK "build/apache-beam.tar.gz" to staging location.
root: INFO: Starting GCS upload to gs://temp-storage-for-end-to-end-tests/staging-it/beamapp-jenkins-0102190201-588843.1546455721.589037/dataflow_python_sdk.tar...
root: INFO: Completed GCS upload to gs://temp-storage-for-end-to-end-tests/staging-it/beamapp-jenkins-0102190201-588843.1546455721.589037/dataflow_python_sdk.tar
in 0 seconds.
root: INFO: Starting GCS upload to gs://temp-storage-for-end-to-end-tests/staging-it/beamapp-jenkins-0102190201-588843.1546455721.589037/dataflow-worker.jar...
--------------------- >> end captured logging << ---------------------

======================================================================
ERROR: test_undeclared_outputs (apache_beam.transforms.ptransform_test.PTransformTest)
----------------------------------------------------------------------
Traceback (most recent call last):
  File "<https://builds.apache.org/job/beam_PostCommit_Py_VR_Dataflow/ws/src/sdks/python/apache_beam/transforms/ptransform_test.py",>
line 271, in test_undeclared_outputs
    pipeline.run()
  File "<https://builds.apache.org/job/beam_PostCommit_Py_VR_Dataflow/ws/src/sdks/python/apache_beam/testing/test_pipeline.py",>
line 107, in run
    else test_runner_api))
  File "<https://builds.apache.org/job/beam_PostCommit_Py_VR_Dataflow/ws/src/sdks/python/apache_beam/pipeline.py",>
line 405, in run
    self._options).run(False)
  File "<https://builds.apache.org/job/beam_PostCommit_Py_VR_Dataflow/ws/src/sdks/python/apache_beam/pipeline.py",>
line 418, in run
    return self.runner.run_pipeline(self, self._options)
  File "<https://builds.apache.org/job/beam_PostCommit_Py_VR_Dataflow/ws/src/sdks/python/apache_beam/runners/dataflow/test_dataflow_runner.py",>
line 53, in run_pipeline
    pipeline, options)
  File "<https://builds.apache.org/job/beam_PostCommit_Py_VR_Dataflow/ws/src/sdks/python/apache_beam/runners/dataflow/dataflow_runner.py",>
line 394, in run_pipeline
    self.dataflow_client.create_job(self.job), self)
  File "<https://builds.apache.org/job/beam_PostCommit_Py_VR_Dataflow/ws/src/sdks/python/apache_beam/utils/retry.py",>
line 184, in wrapper
    return fun(*args, **kwargs)
  File "<https://builds.apache.org/job/beam_PostCommit_Py_VR_Dataflow/ws/src/sdks/python/apache_beam/runners/dataflow/internal/apiclient.py",>
line 504, in create_job
    self.create_job_description(job)
  File "<https://builds.apache.org/job/beam_PostCommit_Py_VR_Dataflow/ws/src/sdks/python/apache_beam/runners/dataflow/internal/apiclient.py",>
line 533, in create_job_description
    resources = self._stage_resources(job.options)
  File "<https://builds.apache.org/job/beam_PostCommit_Py_VR_Dataflow/ws/src/sdks/python/apache_beam/runners/dataflow/internal/apiclient.py",>
line 464, in _stage_resources
    staging_location=google_cloud_options.staging_location)
  File "<https://builds.apache.org/job/beam_PostCommit_Py_VR_Dataflow/ws/src/sdks/python/apache_beam/runners/portability/stager.py",>
line 270, in stage_job_resources
    self.stage_artifact(dataflow_worker_jar, staged_path)
  File "<https://builds.apache.org/job/beam_PostCommit_Py_VR_Dataflow/ws/src/sdks/python/apache_beam/runners/dataflow/internal/apiclient.py",>
line 791, in stage_artifact
    artifact_name)
  File "<https://builds.apache.org/job/beam_PostCommit_Py_VR_Dataflow/ws/src/sdks/python/apache_beam/utils/retry.py",>
line 184, in wrapper
    return fun(*args, **kwargs)
  File "<https://builds.apache.org/job/beam_PostCommit_Py_VR_Dataflow/ws/src/sdks/python/apache_beam/runners/dataflow/internal/apiclient.py",>
line 451, in _gcs_file_copy
    self.stage_file(to_folder, to_name, f)
  File "<https://builds.apache.org/job/beam_PostCommit_Py_VR_Dataflow/ws/src/sdks/python/apache_beam/runners/dataflow/internal/apiclient.py",>
line 485, in stage_file
    response = self._storage_client.objects.Insert(request, upload=upload)
  File "<https://builds.apache.org/job/beam_PostCommit_Py_VR_Dataflow/ws/src/sdks/python/apache_beam/io/gcp/internal/clients/storage/storage_v1_client.py",>
line 1154, in Insert
    upload=upload, upload_config=upload_config)
  File "<https://builds.apache.org/job/beam_PostCommit_Py_VR_Dataflow/ws/src/build/gradleenv/1327086738/local/lib/python2.7/site-packages/apitools/base/py/base_api.py",>
line 703, in _RunMethod
    download)
  File "<https://builds.apache.org/job/beam_PostCommit_Py_VR_Dataflow/ws/src/build/gradleenv/1327086738/local/lib/python2.7/site-packages/apitools/base/py/base_api.py",>
line 679, in PrepareHttpRequest
    upload.ConfigureRequest(upload_config, http_request, url_builder)
  File "<https://builds.apache.org/job/beam_PostCommit_Py_VR_Dataflow/ws/src/build/gradleenv/1327086738/local/lib/python2.7/site-packages/apitools/base/py/transfer.py",>
line 731, in ConfigureRequest
    self.__ConfigureMultipartRequest(http_request)
  File "<https://builds.apache.org/job/beam_PostCommit_Py_VR_Dataflow/ws/src/build/gradleenv/1327086738/local/lib/python2.7/site-packages/apitools/base/py/transfer.py",>
line 791, in __ConfigureMultipartRequest
    g.flatten(msg_root, unixfrom=False)
  File "/usr/lib/python2.7/email/generator.py", line 83, in flatten
    self._write(msg)
  File "/usr/lib/python2.7/email/generator.py", line 108, in _write
    self._dispatch(msg)
  File "/usr/lib/python2.7/email/generator.py", line 134, in _dispatch
    meth(msg)
  File "/usr/lib/python2.7/email/generator.py", line 203, in _handle_multipart
    g.flatten(part, unixfrom=False)
  File "/usr/lib/python2.7/email/generator.py", line 83, in flatten
    self._write(msg)
  File "/usr/lib/python2.7/email/generator.py", line 118, in _write
    self._fp.write(sfp.getvalue())
MemoryError: out of memory
-------------------- >> begin captured logging << --------------------
root: DEBUG: Connecting using Google Application Default Credentials.
root: INFO: Starting GCS upload to gs://temp-storage-for-end-to-end-tests/staging-it/beamapp-jenkins-0102190201-644346.1546455721.644528/pipeline.pb...
oauth2client.transport: INFO: Attempting refresh to obtain initial access_token
oauth2client.transport: INFO: Attempting refresh to obtain initial access_token
root: INFO: Completed GCS upload to gs://temp-storage-for-end-to-end-tests/staging-it/beamapp-jenkins-0102190201-644346.1546455721.644528/pipeline.pb
in 0 seconds.
root: INFO: Starting GCS upload to gs://temp-storage-for-end-to-end-tests/staging-it/beamapp-jenkins-0102190201-644346.1546455721.644528/requirements.txt...
root: INFO: Completed GCS upload to gs://temp-storage-for-end-to-end-tests/staging-it/beamapp-jenkins-0102190201-644346.1546455721.644528/requirements.txt
in 0 seconds.
root: INFO: Executing command: ['<https://builds.apache.org/job/beam_PostCommit_Py_VR_Dataflow/ws/src/build/gradleenv/1327086738/bin/python',>
'-m', 'pip', 'download', '--dest', '/tmp/dataflow-requirements-cache', '-r', 'postcommit_requirements.txt',
'--exists-action', 'i', '--no-binary', ':all:']
root: INFO: Starting GCS upload to gs://temp-storage-for-end-to-end-tests/staging-it/beamapp-jenkins-0102190201-644346.1546455721.644528/pbr-4.2.0.tar.gz...
root: INFO: Completed GCS upload to gs://temp-storage-for-end-to-end-tests/staging-it/beamapp-jenkins-0102190201-644346.1546455721.644528/pbr-4.2.0.tar.gz
in 0 seconds.
root: INFO: Starting GCS upload to gs://temp-storage-for-end-to-end-tests/staging-it/beamapp-jenkins-0102190201-644346.1546455721.644528/setuptools-40.0.0.zip...
root: INFO: Completed GCS upload to gs://temp-storage-for-end-to-end-tests/staging-it/beamapp-jenkins-0102190201-644346.1546455721.644528/setuptools-40.0.0.zip
in 0 seconds.
root: INFO: Starting GCS upload to gs://temp-storage-for-end-to-end-tests/staging-it/beamapp-jenkins-0102190201-644346.1546455721.644528/pbr-4.3.0.tar.gz...
root: INFO: Completed GCS upload to gs://temp-storage-for-end-to-end-tests/staging-it/beamapp-jenkins-0102190201-644346.1546455721.644528/pbr-4.3.0.tar.gz
in 0 seconds.
root: INFO: Starting GCS upload to gs://temp-storage-for-end-to-end-tests/staging-it/beamapp-jenkins-0102190201-644346.1546455721.644528/setuptools-40.3.0.zip...
root: INFO: Completed GCS upload to gs://temp-storage-for-end-to-end-tests/staging-it/beamapp-jenkins-0102190201-644346.1546455721.644528/setuptools-40.3.0.zip
in 0 seconds.
root: INFO: Starting GCS upload to gs://temp-storage-for-end-to-end-tests/staging-it/beamapp-jenkins-0102190201-644346.1546455721.644528/setuptools-39.1.0.zip...
root: INFO: Completed GCS upload to gs://temp-storage-for-end-to-end-tests/staging-it/beamapp-jenkins-0102190201-644346.1546455721.644528/setuptools-39.1.0.zip
in 0 seconds.
root: INFO: Starting GCS upload to gs://temp-storage-for-end-to-end-tests/staging-it/beamapp-jenkins-0102190201-644346.1546455721.644528/PyHamcrest-1.9.0.tar.gz...
root: INFO: Completed GCS upload to gs://temp-storage-for-end-to-end-tests/staging-it/beamapp-jenkins-0102190201-644346.1546455721.644528/PyHamcrest-1.9.0.tar.gz
in 0 seconds.
root: INFO: Starting GCS upload to gs://temp-storage-for-end-to-end-tests/staging-it/beamapp-jenkins-0102190201-644346.1546455721.644528/setuptools-40.4.2.zip...
root: INFO: Completed GCS upload to gs://temp-storage-for-end-to-end-tests/staging-it/beamapp-jenkins-0102190201-644346.1546455721.644528/setuptools-40.4.2.zip
in 0 seconds.
root: INFO: Starting GCS upload to gs://temp-storage-for-end-to-end-tests/staging-it/beamapp-jenkins-0102190201-644346.1546455721.644528/pbr-5.1.1.tar.gz...
root: INFO: Completed GCS upload to gs://temp-storage-for-end-to-end-tests/staging-it/beamapp-jenkins-0102190201-644346.1546455721.644528/pbr-5.1.1.tar.gz
in 0 seconds.
root: INFO: Starting GCS upload to gs://temp-storage-for-end-to-end-tests/staging-it/beamapp-jenkins-0102190201-644346.1546455721.644528/setuptools-40.5.0.zip...
root: INFO: Completed GCS upload to gs://temp-storage-for-end-to-end-tests/staging-it/beamapp-jenkins-0102190201-644346.1546455721.644528/setuptools-40.5.0.zip
in 0 seconds.
root: INFO: Starting GCS upload to gs://temp-storage-for-end-to-end-tests/staging-it/beamapp-jenkins-0102190201-644346.1546455721.644528/pbr-4.0.4.tar.gz...
root: INFO: Completed GCS upload to gs://temp-storage-for-end-to-end-tests/staging-it/beamapp-jenkins-0102190201-644346.1546455721.644528/pbr-4.0.4.tar.gz
in 0 seconds.
root: INFO: Starting GCS upload to gs://temp-storage-for-end-to-end-tests/staging-it/beamapp-jenkins-0102190201-644346.1546455721.644528/setuptools-40.4.1.zip...
root: INFO: Completed GCS upload to gs://temp-storage-for-end-to-end-tests/staging-it/beamapp-jenkins-0102190201-644346.1546455721.644528/setuptools-40.4.1.zip
in 0 seconds.
root: INFO: Starting GCS upload to gs://temp-storage-for-end-to-end-tests/staging-it/beamapp-jenkins-0102190201-644346.1546455721.644528/setuptools-40.6.1.zip...
root: INFO: Completed GCS upload to gs://temp-storage-for-end-to-end-tests/staging-it/beamapp-jenkins-0102190201-644346.1546455721.644528/setuptools-40.6.1.zip
in 0 seconds.
root: INFO: Starting GCS upload to gs://temp-storage-for-end-to-end-tests/staging-it/beamapp-jenkins-0102190201-644346.1546455721.644528/pbr-5.1.0.tar.gz...
root: INFO: Completed GCS upload to gs://temp-storage-for-end-to-end-tests/staging-it/beamapp-jenkins-0102190201-644346.1546455721.644528/pbr-5.1.0.tar.gz
in 0 seconds.
root: INFO: Starting GCS upload to gs://temp-storage-for-end-to-end-tests/staging-it/beamapp-jenkins-0102190201-644346.1546455721.644528/setuptools-40.1.0.zip...
root: INFO: Completed GCS upload to gs://temp-storage-for-end-to-end-tests/staging-it/beamapp-jenkins-0102190201-644346.1546455721.644528/setuptools-40.1.0.zip
in 0 seconds.
root: INFO: Starting GCS upload to gs://temp-storage-for-end-to-end-tests/staging-it/beamapp-jenkins-0102190201-644346.1546455721.644528/pbr-4.0.3.tar.gz...
root: INFO: Completed GCS upload to gs://temp-storage-for-end-to-end-tests/staging-it/beamapp-jenkins-0102190201-644346.1546455721.644528/pbr-4.0.3.tar.gz
in 0 seconds.
root: INFO: Starting GCS upload to gs://temp-storage-for-end-to-end-tests/staging-it/beamapp-jenkins-0102190201-644346.1546455721.644528/pbr-4.1.1.tar.gz...
root: INFO: Completed GCS upload to gs://temp-storage-for-end-to-end-tests/staging-it/beamapp-jenkins-0102190201-644346.1546455721.644528/pbr-4.1.1.tar.gz
in 0 seconds.
root: INFO: Starting GCS upload to gs://temp-storage-for-end-to-end-tests/staging-it/beamapp-jenkins-0102190201-644346.1546455721.644528/setuptools-39.2.0.zip...
root: INFO: Completed GCS upload to gs://temp-storage-for-end-to-end-tests/staging-it/beamapp-jenkins-0102190201-644346.1546455721.644528/setuptools-39.2.0.zip
in 0 seconds.
root: INFO: Starting GCS upload to gs://temp-storage-for-end-to-end-tests/staging-it/beamapp-jenkins-0102190201-644346.1546455721.644528/mock-2.0.0.tar.gz...
root: INFO: Completed GCS upload to gs://temp-storage-for-end-to-end-tests/staging-it/beamapp-jenkins-0102190201-644346.1546455721.644528/mock-2.0.0.tar.gz
in 0 seconds.
root: INFO: Starting GCS upload to gs://temp-storage-for-end-to-end-tests/staging-it/beamapp-jenkins-0102190201-644346.1546455721.644528/pbr-5.0.0.tar.gz...
root: INFO: Completed GCS upload to gs://temp-storage-for-end-to-end-tests/staging-it/beamapp-jenkins-0102190201-644346.1546455721.644528/pbr-5.0.0.tar.gz
in 0 seconds.
root: INFO: Starting GCS upload to gs://temp-storage-for-end-to-end-tests/staging-it/beamapp-jenkins-0102190201-644346.1546455721.644528/setuptools-40.6.0.zip...
root: INFO: Completed GCS upload to gs://temp-storage-for-end-to-end-tests/staging-it/beamapp-jenkins-0102190201-644346.1546455721.644528/setuptools-40.6.0.zip
in 0 seconds.
root: INFO: Starting GCS upload to gs://temp-storage-for-end-to-end-tests/staging-it/beamapp-jenkins-0102190201-644346.1546455721.644528/setuptools-40.2.0.zip...
root: INFO: Completed GCS upload to gs://temp-storage-for-end-to-end-tests/staging-it/beamapp-jenkins-0102190201-644346.1546455721.644528/setuptools-40.2.0.zip
in 0 seconds.
root: INFO: Starting GCS upload to gs://temp-storage-for-end-to-end-tests/staging-it/beamapp-jenkins-0102190201-644346.1546455721.644528/six-1.12.0.tar.gz...
root: INFO: Completed GCS upload to gs://temp-storage-for-end-to-end-tests/staging-it/beamapp-jenkins-0102190201-644346.1546455721.644528/six-1.12.0.tar.gz
in 0 seconds.
root: INFO: Starting GCS upload to gs://temp-storage-for-end-to-end-tests/staging-it/beamapp-jenkins-0102190201-644346.1546455721.644528/six-1.11.0.tar.gz...
root: INFO: Completed GCS upload to gs://temp-storage-for-end-to-end-tests/staging-it/beamapp-jenkins-0102190201-644346.1546455721.644528/six-1.11.0.tar.gz
in 0 seconds.
root: INFO: Starting GCS upload to gs://temp-storage-for-end-to-end-tests/staging-it/beamapp-jenkins-0102190201-644346.1546455721.644528/setuptools-40.6.2.zip...
root: INFO: Completed GCS upload to gs://temp-storage-for-end-to-end-tests/staging-it/beamapp-jenkins-0102190201-644346.1546455721.644528/setuptools-40.6.2.zip
in 0 seconds.
root: INFO: Starting GCS upload to gs://temp-storage-for-end-to-end-tests/staging-it/beamapp-jenkins-0102190201-644346.1546455721.644528/setuptools-40.4.3.zip...
root: INFO: Completed GCS upload to gs://temp-storage-for-end-to-end-tests/staging-it/beamapp-jenkins-0102190201-644346.1546455721.644528/setuptools-40.4.3.zip
in 0 seconds.
root: INFO: Starting GCS upload to gs://temp-storage-for-end-to-end-tests/staging-it/beamapp-jenkins-0102190201-644346.1546455721.644528/setuptools-40.6.3.zip...
root: INFO: Completed GCS upload to gs://temp-storage-for-end-to-end-tests/staging-it/beamapp-jenkins-0102190201-644346.1546455721.644528/setuptools-40.6.3.zip
in 0 seconds.
root: INFO: Starting GCS upload to gs://temp-storage-for-end-to-end-tests/staging-it/beamapp-jenkins-0102190201-644346.1546455721.644528/funcsigs-1.0.2.tar.gz...
root: INFO: Completed GCS upload to gs://temp-storage-for-end-to-end-tests/staging-it/beamapp-jenkins-0102190201-644346.1546455721.644528/funcsigs-1.0.2.tar.gz
in 0 seconds.
root: INFO: Starting GCS upload to gs://temp-storage-for-end-to-end-tests/staging-it/beamapp-jenkins-0102190201-644346.1546455721.644528/pbr-4.1.0.tar.gz...
root: INFO: Completed GCS upload to gs://temp-storage-for-end-to-end-tests/staging-it/beamapp-jenkins-0102190201-644346.1546455721.644528/pbr-4.1.0.tar.gz
in 0 seconds.
root: INFO: Copying Beam SDK "build/apache-beam.tar.gz" to staging location.
root: INFO: Starting GCS upload to gs://temp-storage-for-end-to-end-tests/staging-it/beamapp-jenkins-0102190201-644346.1546455721.644528/dataflow_python_sdk.tar...
root: INFO: Completed GCS upload to gs://temp-storage-for-end-to-end-tests/staging-it/beamapp-jenkins-0102190201-644346.1546455721.644528/dataflow_python_sdk.tar
in 0 seconds.
root: INFO: Starting GCS upload to gs://temp-storage-for-end-to-end-tests/staging-it/beamapp-jenkins-0102190201-644346.1546455721.644528/dataflow-worker.jar...
--------------------- >> end captured logging << ---------------------

----------------------------------------------------------------------
XML: <https://builds.apache.org/job/beam_PostCommit_Py_VR_Dataflow/ws/src/sdks/python/nosetests.xml>
----------------------------------------------------------------------
Ran 14 tests in 919.287s

FAILED (errors=2)
Found: https://console.cloud.google.com/dataflow/jobsDetail/locations/us-central1/jobs/2019-01-02_11_02_18-79260945343550987?project=apache-beam-testing.
Found: https://console.cloud.google.com/dataflow/jobsDetail/locations/us-central1/jobs/2019-01-02_11_02_41-4834391166081122979?project=apache-beam-testing.
Found: https://console.cloud.google.com/dataflow/jobsDetail/locations/us-central1/jobs/2019-01-02_11_02_19-1025496238804084036?project=apache-beam-testing.
Found: https://console.cloud.google.com/dataflow/jobsDetail/locations/us-central1/jobs/2019-01-02_11_09_49-14347062360331719334?project=apache-beam-testing.
Found: https://console.cloud.google.com/dataflow/jobsDetail/locations/us-central1/jobs/2019-01-02_11_02_18-15028002679211089801?project=apache-beam-testing.
Found: https://console.cloud.google.com/dataflow/jobsDetail/locations/us-central1/jobs/2019-01-02_11_09_54-10006684984422905645?project=apache-beam-testing.
Found: https://console.cloud.google.com/dataflow/jobsDetail/locations/us-central1/jobs/2019-01-02_11_02_41-12876959272891025097?project=apache-beam-testing.
Found: https://console.cloud.google.com/dataflow/jobsDetail/locations/us-central1/jobs/2019-01-02_11_02_18-13076146860827451915?project=apache-beam-testing.
Found: https://console.cloud.google.com/dataflow/jobsDetail/locations/us-central1/jobs/2019-01-02_11_02_18-16872818607457525960?project=apache-beam-testing.
Found: https://console.cloud.google.com/dataflow/jobsDetail/locations/us-central1/jobs/2019-01-02_11_09_43-4975417966279772509?project=apache-beam-testing.
Found: https://console.cloud.google.com/dataflow/jobsDetail/locations/us-central1/jobs/2019-01-02_11_02_19-2454743172850810184?project=apache-beam-testing.
Found: https://console.cloud.google.com/dataflow/jobsDetail/locations/us-central1/jobs/2019-01-02_11_09_49-5939873877706917930?project=apache-beam-testing.

> Task :beam-sdks-python:validatesRunnerStreamingTests FAILED
:beam-sdks-python:validatesRunnerStreamingTests (Thread[Task worker for ':' Thread 10,5,main])
completed. Took 15 mins 23.328 secs.

FAILURE: Build failed with an exception.

* Where:
Build file '<https://builds.apache.org/job/beam_PostCommit_Py_VR_Dataflow/ws/src/sdks/python/build.gradle'>
line: 306

* What went wrong:
Execution failed for task ':beam-sdks-python:validatesRunnerStreamingTests'.
> Process 'command 'sh'' finished with non-zero exit value 1

* Try:
Run with --stacktrace option to get the stack trace. Run with --debug option to get more log
output. Run with --scan to get full insights.

* Get more help at https://help.gradle.org

Deprecated Gradle features were used in this build, making it incompatible with Gradle 5.0.
Use '--warning-mode all' to show the individual deprecation warnings.
See https://docs.gradle.org/4.10.2/userguide/command_line_interface.html#sec:command_line_warnings

BUILD FAILED in 32m 31s
60 actionable tasks: 60 executed

Publishing build scan...
https://gradle.com/s/63bvmbaorraey

Build step 'Invoke Gradle script' changed build result to FAILURE
Build step 'Invoke Gradle script' marked build as failure

---------------------------------------------------------------------
To unsubscribe, e-mail: builds-unsubscribe@beam.apache.org
For additional commands, e-mail: builds-help@beam.apache.org


Mime
View raw message