beam-builds mailing list archives

Site index · List index
Message view « Date » · « Thread »
Top « Date » · « Thread »
From Apache Jenkins Server <jenk...@builds.apache.org>
Subject Build failed in Jenkins: beam_PerformanceTests_Compressed_TextIOIT_HDFS #1108
Date Sun, 06 Jan 2019 12:31:24 GMT
See <https://builds.apache.org/job/beam_PerformanceTests_Compressed_TextIOIT_HDFS/1108/display/redirect?page=changes>

Changes:

[tweise] [BEAM-6009] Modify Github template and README to include Flink PVR for

------------------------------------------
[...truncated 267.25 KB...]
    Jan 06, 2019 12:25:05 PM org.apache.beam.runners.dataflow.DataflowPipelineTranslator$Translator
addStep
    INFO: Adding Read all files/TextIO.ReadFiles/Read all via FileBasedSource/Reshuffle/Values/Values/Map
as step s33
    Jan 06, 2019 12:25:05 PM org.apache.beam.runners.dataflow.DataflowPipelineTranslator$Translator
addStep
    INFO: Adding Read all files/TextIO.ReadFiles/Read all via FileBasedSource/Read ranges
as step s34
    Jan 06, 2019 12:25:05 PM org.apache.beam.runners.dataflow.DataflowPipelineTranslator$Translator
addStep
    INFO: Adding Calculate hashcode/WithKeys/AddKeys/Map as step s35
    Jan 06, 2019 12:25:05 PM org.apache.beam.runners.dataflow.DataflowPipelineTranslator$Translator
addStep
    INFO: Adding Calculate hashcode/Combine.perKey(Hashing)/GroupByKey as step s36
    Jan 06, 2019 12:25:05 PM org.apache.beam.runners.dataflow.DataflowPipelineTranslator$Translator
addStep
    INFO: Adding Calculate hashcode/Combine.perKey(Hashing)/Combine.GroupedValues as step
s37
    Jan 06, 2019 12:25:05 PM org.apache.beam.runners.dataflow.DataflowPipelineTranslator$Translator
addStep
    INFO: Adding Calculate hashcode/Values/Values/Map as step s38
    Jan 06, 2019 12:25:05 PM org.apache.beam.runners.dataflow.DataflowPipelineTranslator$Translator
addStep
    INFO: Adding Calculate hashcode/View.AsIterable/ParDo(ToIsmRecordForGlobalWindow) as step
s39
    Jan 06, 2019 12:25:05 PM org.apache.beam.runners.dataflow.DataflowPipelineTranslator$Translator
addStep
    INFO: Adding Calculate hashcode/View.AsIterable/CreateDataflowView as step s40
    Jan 06, 2019 12:25:05 PM org.apache.beam.runners.dataflow.DataflowPipelineTranslator$Translator
addStep
    INFO: Adding Calculate hashcode/CreateVoid/Read(CreateSource) as step s41
    Jan 06, 2019 12:25:05 PM org.apache.beam.runners.dataflow.DataflowPipelineTranslator$Translator
addStep
    INFO: Adding Calculate hashcode/ProduceDefault as step s42
    Jan 06, 2019 12:25:05 PM org.apache.beam.runners.dataflow.DataflowPipelineTranslator$Translator
addStep
    INFO: Adding Calculate hashcode/Flatten.PCollections as step s43
    Jan 06, 2019 12:25:05 PM org.apache.beam.runners.dataflow.DataflowPipelineTranslator$Translator
addStep
    INFO: Adding PAssert$0/CreateActual/FilterActuals/Window.Assign as step s44
    Jan 06, 2019 12:25:05 PM org.apache.beam.runners.dataflow.DataflowPipelineTranslator$Translator
addStep
    INFO: Adding PAssert$0/CreateActual/GatherPanes/Reify.Window/ParDo(Anonymous) as step
s45
    Jan 06, 2019 12:25:05 PM org.apache.beam.runners.dataflow.DataflowPipelineTranslator$Translator
addStep
    INFO: Adding PAssert$0/CreateActual/GatherPanes/WithKeys/AddKeys/Map as step s46
    Jan 06, 2019 12:25:05 PM org.apache.beam.runners.dataflow.DataflowPipelineTranslator$Translator
addStep
    INFO: Adding PAssert$0/CreateActual/GatherPanes/Window.Into()/Window.Assign as step s47
    Jan 06, 2019 12:25:05 PM org.apache.beam.runners.dataflow.DataflowPipelineTranslator$Translator
addStep
    INFO: Adding PAssert$0/CreateActual/GatherPanes/GroupByKey as step s48
    Jan 06, 2019 12:25:05 PM org.apache.beam.runners.dataflow.DataflowPipelineTranslator$Translator
addStep
    INFO: Adding PAssert$0/CreateActual/GatherPanes/Values/Values/Map as step s49
    Jan 06, 2019 12:25:05 PM org.apache.beam.runners.dataflow.DataflowPipelineTranslator$Translator
addStep
    INFO: Adding PAssert$0/CreateActual/ExtractPane/Map as step s50
    Jan 06, 2019 12:25:05 PM org.apache.beam.runners.dataflow.DataflowPipelineTranslator$Translator
addStep
    INFO: Adding PAssert$0/CreateActual/Flatten.Iterables/FlattenIterables/FlatMap as step
s51
    Jan 06, 2019 12:25:05 PM org.apache.beam.runners.dataflow.DataflowPipelineTranslator$Translator
addStep
    INFO: Adding PAssert$0/CreateActual/RewindowActuals/Window.Assign as step s52
    Jan 06, 2019 12:25:05 PM org.apache.beam.runners.dataflow.DataflowPipelineTranslator$Translator
addStep
    INFO: Adding PAssert$0/CreateActual/ParDo(Anonymous) as step s53
    Jan 06, 2019 12:25:05 PM org.apache.beam.runners.dataflow.DataflowPipelineTranslator$Translator
addStep
    INFO: Adding PAssert$0/CreateActual/View.AsSingleton/Combine.GloballyAsSingletonView/Combine.globally(Singleton)/WithKeys/AddKeys/Map
as step s54
    Jan 06, 2019 12:25:05 PM org.apache.beam.runners.dataflow.DataflowPipelineTranslator$Translator
addStep
    INFO: Adding PAssert$0/CreateActual/View.AsSingleton/Combine.GloballyAsSingletonView/Combine.globally(Singleton)/Combine.perKey(Singleton)/GroupByKey
as step s55
    Jan 06, 2019 12:25:05 PM org.apache.beam.runners.dataflow.DataflowPipelineTranslator$Translator
addStep
    INFO: Adding PAssert$0/CreateActual/View.AsSingleton/Combine.GloballyAsSingletonView/Combine.globally(Singleton)/Combine.perKey(Singleton)/Combine.GroupedValues
as step s56
    Jan 06, 2019 12:25:05 PM org.apache.beam.runners.dataflow.DataflowPipelineTranslator$Translator
addStep
    INFO: Adding PAssert$0/CreateActual/View.AsSingleton/Combine.GloballyAsSingletonView/Combine.globally(Singleton)/Values/Values/Map
as step s57
    Jan 06, 2019 12:25:05 PM org.apache.beam.runners.dataflow.DataflowPipelineTranslator$Translator
addStep
    INFO: Adding PAssert$0/CreateActual/View.AsSingleton/Combine.GloballyAsSingletonView/BatchViewOverrides.GroupByWindowHashAsKeyAndWindowAsSortKey/ParDo(UseWindowHashAsKeyAndWindowAsSortKey)
as step s58
    Jan 06, 2019 12:25:05 PM org.apache.beam.runners.dataflow.DataflowPipelineTranslator$Translator
addStep
    INFO: Adding PAssert$0/CreateActual/View.AsSingleton/Combine.GloballyAsSingletonView/BatchViewOverrides.GroupByWindowHashAsKeyAndWindowAsSortKey/BatchViewOverrides.GroupByKeyAndSortValuesOnly
as step s59
    Jan 06, 2019 12:25:05 PM org.apache.beam.runners.dataflow.DataflowPipelineTranslator$Translator
addStep
    INFO: Adding PAssert$0/CreateActual/View.AsSingleton/Combine.GloballyAsSingletonView/ParDo(IsmRecordForSingularValuePerWindow)
as step s60
    Jan 06, 2019 12:25:05 PM org.apache.beam.runners.dataflow.DataflowPipelineTranslator$Translator
addStep
    INFO: Adding PAssert$0/CreateActual/View.AsSingleton/Combine.GloballyAsSingletonView/CreateDataflowView
as step s61
    Jan 06, 2019 12:25:05 PM org.apache.beam.runners.dataflow.DataflowPipelineTranslator$Translator
addStep
    INFO: Adding PAssert$0/Create.Values/Read(CreateSource) as step s62
    Jan 06, 2019 12:25:05 PM org.apache.beam.runners.dataflow.DataflowPipelineTranslator$Translator
addStep
    INFO: Adding PAssert$0/WindowToken/Window.Assign as step s63
    Jan 06, 2019 12:25:05 PM org.apache.beam.runners.dataflow.DataflowPipelineTranslator$Translator
addStep
    INFO: Adding PAssert$0/RunChecks as step s64
    Jan 06, 2019 12:25:05 PM org.apache.beam.runners.dataflow.DataflowPipelineTranslator$Translator
addStep
    INFO: Adding PAssert$0/VerifyAssertions/ParDo(DefaultConclude) as step s65
    Jan 06, 2019 12:25:05 PM org.apache.beam.runners.dataflow.DataflowPipelineTranslator$Translator
addStep
    INFO: Adding View.AsSingleton/Combine.GloballyAsSingletonView/Combine.globally(Singleton)/WithKeys/AddKeys/Map
as step s66
    Jan 06, 2019 12:25:05 PM org.apache.beam.runners.dataflow.DataflowPipelineTranslator$Translator
addStep
    INFO: Adding View.AsSingleton/Combine.GloballyAsSingletonView/Combine.globally(Singleton)/Combine.perKey(Singleton)/GroupByKey
as step s67
    Jan 06, 2019 12:25:05 PM org.apache.beam.runners.dataflow.DataflowPipelineTranslator$Translator
addStep
    INFO: Adding View.AsSingleton/Combine.GloballyAsSingletonView/Combine.globally(Singleton)/Combine.perKey(Singleton)/Combine.GroupedValues
as step s68
    Jan 06, 2019 12:25:05 PM org.apache.beam.runners.dataflow.DataflowPipelineTranslator$Translator
addStep
    INFO: Adding View.AsSingleton/Combine.GloballyAsSingletonView/Combine.globally(Singleton)/Values/Values/Map
as step s69
    Jan 06, 2019 12:25:05 PM org.apache.beam.runners.dataflow.DataflowPipelineTranslator$Translator
addStep
    INFO: Adding View.AsSingleton/Combine.GloballyAsSingletonView/BatchViewOverrides.GroupByWindowHashAsKeyAndWindowAsSortKey/ParDo(UseWindowHashAsKeyAndWindowAsSortKey)
as step s70
    Jan 06, 2019 12:25:05 PM org.apache.beam.runners.dataflow.DataflowPipelineTranslator$Translator
addStep
    INFO: Adding View.AsSingleton/Combine.GloballyAsSingletonView/BatchViewOverrides.GroupByWindowHashAsKeyAndWindowAsSortKey/BatchViewOverrides.GroupByKeyAndSortValuesOnly
as step s71
    Jan 06, 2019 12:25:05 PM org.apache.beam.runners.dataflow.DataflowPipelineTranslator$Translator
addStep
    INFO: Adding View.AsSingleton/Combine.GloballyAsSingletonView/ParDo(IsmRecordForSingularValuePerWindow)
as step s72
    Jan 06, 2019 12:25:05 PM org.apache.beam.runners.dataflow.DataflowPipelineTranslator$Translator
addStep
    INFO: Adding View.AsSingleton/Combine.GloballyAsSingletonView/CreateDataflowView as step
s73
    Jan 06, 2019 12:25:05 PM org.apache.beam.runners.dataflow.DataflowPipelineTranslator$Translator
addStep
    INFO: Adding Delete test files as step s74
    Jan 06, 2019 12:25:05 PM org.apache.beam.runners.dataflow.DataflowRunner run
    INFO: Staging pipeline description to gs://temp-storage-for-perf-tests/textioit0writethenreadall-jenkins-0106122457-ac79d286/output/results/staging/
    Jan 06, 2019 12:25:05 PM org.apache.beam.runners.dataflow.util.PackageUtil tryStagePackage
    INFO: Uploading <196514 bytes, hash ztz_U7zDt7g7ReTBUnjjdw> to gs://temp-storage-for-perf-tests/textioit0writethenreadall-jenkins-0106122457-ac79d286/output/results/staging/pipeline-ztz_U7zDt7g7ReTBUnjjdw.pb

org.apache.beam.sdk.io.text.TextIOIT > writeThenReadAll STANDARD_OUT
    Dataflow SDK version: 2.10.0-SNAPSHOT

org.apache.beam.sdk.io.text.TextIOIT > writeThenReadAll STANDARD_ERROR
    Jan 06, 2019 12:25:06 PM org.apache.beam.runners.dataflow.DataflowRunner run
    INFO: To access the Dataflow monitoring console, please navigate to https://console.cloud.google.com/dataflow/jobsDetail/locations/us-central1/jobs/2019-01-06_04_25_05-11525591814966012831?project=apache-beam-testing

org.apache.beam.sdk.io.text.TextIOIT > writeThenReadAll STANDARD_OUT
    Submitted job: 2019-01-06_04_25_05-11525591814966012831

org.apache.beam.sdk.io.text.TextIOIT > writeThenReadAll STANDARD_ERROR
    Jan 06, 2019 12:25:06 PM org.apache.beam.runners.dataflow.DataflowRunner run
    INFO: To cancel the job using the 'gcloud' tool, run:
    > gcloud dataflow jobs --project=apache-beam-testing cancel --region=us-central1 2019-01-06_04_25_05-11525591814966012831
    Jan 06, 2019 12:25:06 PM org.apache.beam.runners.dataflow.TestDataflowRunner run
    INFO: Running Dataflow job 2019-01-06_04_25_05-11525591814966012831 with 1 expected assertions.
    Jan 06, 2019 12:29:23 PM org.apache.beam.runners.dataflow.DataflowPipelineJob waitUntilFinish
    WARNING: No terminal state was returned. State value UNKNOWN
    Jan 06, 2019 12:29:23 PM org.apache.beam.runners.dataflow.TestDataflowRunner checkForPAssertSuccess
    WARNING: Metrics not present for Dataflow job 2019-01-06_04_25_05-11525591814966012831.
    Jan 06, 2019 12:29:23 PM org.apache.beam.runners.dataflow.TestDataflowRunner run
    WARNING: Dataflow job 2019-01-06_04_25_05-11525591814966012831 did not output a success
or failure metric.

Gradle Test Executor 1 finished executing tests.

> Task :beam-sdks-java-io-file-based-io-tests:integrationTest FAILED

org.apache.beam.sdk.io.text.TextIOIT > writeThenReadAll FAILED
    java.lang.RuntimeException: Dataflow job 2019-01-06_04_25_05-11525591814966012831 terminated
in state UNKNOWN but did not return a failure reason.
        at org.apache.beam.runners.dataflow.TestDataflowRunner.run(TestDataflowRunner.java:134)
        at org.apache.beam.runners.dataflow.TestDataflowRunner.run(TestDataflowRunner.java:90)
        at org.apache.beam.runners.dataflow.TestDataflowRunner.run(TestDataflowRunner.java:55)
        at org.apache.beam.sdk.Pipeline.run(Pipeline.java:313)
        at org.apache.beam.sdk.testing.TestPipeline.run(TestPipeline.java:350)
        at org.apache.beam.sdk.testing.TestPipeline.run(TestPipeline.java:331)
        at org.apache.beam.sdk.io.text.TextIOIT.writeThenReadAll(TextIOIT.java:128)
Finished generating test XML results (0.022 secs) into: <https://builds.apache.org/job/beam_PerformanceTests_Compressed_TextIOIT_HDFS/ws/src/sdks/java/io/file-based-io-tests/build/test-results/integrationTest>
Generating HTML test report...
Finished generating test html results (0.032 secs) into: <https://builds.apache.org/job/beam_PerformanceTests_Compressed_TextIOIT_HDFS/ws/src/sdks/java/io/file-based-io-tests/build/reports/tests/integrationTest>
:beam-sdks-java-io-file-based-io-tests:integrationTest (Thread[Task worker for ':' Thread
6,5,main]) completed. Took 4 mins 30.079 secs.

Deprecated Gradle features were used in this build, making it incompatible with Gradle 5.0.
Use '--warning-mode all' to show the individual deprecation warnings.
See https://docs.gradle.org/4.10.3/userguide/command_line_interface.html#sec:command_line_warnings
92 actionable tasks: 1 executed, 91 up-to-date

Publishing build scan...
https://gradle.com/s/fmaq6zb4hylvu


STDERR: 
1 test completed, 1 failed

FAILURE: Build failed with an exception.

* What went wrong:
Execution failed for task ':beam-sdks-java-io-file-based-io-tests:integrationTest'.
> There were failing tests. See the report at: file://<https://builds.apache.org/job/beam_PerformanceTests_Compressed_TextIOIT_HDFS/ws/src/sdks/java/io/file-based-io-tests/build/reports/tests/integrationTest/index.html>

* Try:
Run with --debug option to get more log output. Run with --scan to get full insights.

* Exception is:
org.gradle.api.tasks.TaskExecutionException: Execution failed for task ':beam-sdks-java-io-file-based-io-tests:integrationTest'.
	at org.gradle.api.internal.tasks.execution.ExecuteActionsTaskExecuter.executeActions(ExecuteActionsTaskExecuter.java:110)
	at org.gradle.api.internal.tasks.execution.ExecuteActionsTaskExecuter.execute(ExecuteActionsTaskExecuter.java:77)
	at org.gradle.api.internal.tasks.execution.OutputDirectoryCreatingTaskExecuter.execute(OutputDirectoryCreatingTaskExecuter.java:51)
	at org.gradle.api.internal.tasks.execution.SkipCachedTaskExecuter.execute(SkipCachedTaskExecuter.java:105)
	at org.gradle.api.internal.tasks.execution.SkipUpToDateTaskExecuter.execute(SkipUpToDateTaskExecuter.java:59)
	at org.gradle.api.internal.tasks.execution.ResolveTaskOutputCachingStateExecuter.execute(ResolveTaskOutputCachingStateExecuter.java:54)
	at org.gradle.api.internal.tasks.execution.ResolveBuildCacheKeyExecuter.execute(ResolveBuildCacheKeyExecuter.java:79)
	at org.gradle.api.internal.tasks.execution.ValidatingTaskExecuter.execute(ValidatingTaskExecuter.java:59)
	at org.gradle.api.internal.tasks.execution.SkipEmptySourceFilesTaskExecuter.execute(SkipEmptySourceFilesTaskExecuter.java:101)
	at org.gradle.api.internal.tasks.execution.FinalizeInputFilePropertiesTaskExecuter.execute(FinalizeInputFilePropertiesTaskExecuter.java:44)
	at org.gradle.api.internal.tasks.execution.CleanupStaleOutputsExecuter.execute(CleanupStaleOutputsExecuter.java:91)
	at org.gradle.api.internal.tasks.execution.ResolveTaskArtifactStateTaskExecuter.execute(ResolveTaskArtifactStateTaskExecuter.java:62)
	at org.gradle.api.internal.tasks.execution.SkipTaskWithNoActionsExecuter.execute(SkipTaskWithNoActionsExecuter.java:59)
	at org.gradle.api.internal.tasks.execution.SkipOnlyIfTaskExecuter.execute(SkipOnlyIfTaskExecuter.java:54)
	at org.gradle.api.internal.tasks.execution.ExecuteAtMostOnceTaskExecuter.execute(ExecuteAtMostOnceTaskExecuter.java:43)
	at org.gradle.api.internal.tasks.execution.CatchExceptionTaskExecuter.execute(CatchExceptionTaskExecuter.java:34)
	at org.gradle.api.internal.tasks.execution.EventFiringTaskExecuter$1.run(EventFiringTaskExecuter.java:51)
	at org.gradle.internal.operations.DefaultBuildOperationExecutor$RunnableBuildOperationWorker.execute(DefaultBuildOperationExecutor.java:301)
	at org.gradle.internal.operations.DefaultBuildOperationExecutor$RunnableBuildOperationWorker.execute(DefaultBuildOperationExecutor.java:293)
	at org.gradle.internal.operations.DefaultBuildOperationExecutor.execute(DefaultBuildOperationExecutor.java:175)
	at org.gradle.internal.operations.DefaultBuildOperationExecutor.run(DefaultBuildOperationExecutor.java:91)
	at org.gradle.internal.operations.DelegatingBuildOperationExecutor.run(DelegatingBuildOperationExecutor.java:31)
	at org.gradle.api.internal.tasks.execution.EventFiringTaskExecuter.execute(EventFiringTaskExecuter.java:46)
	at org.gradle.execution.taskgraph.LocalTaskInfoExecutor.execute(LocalTaskInfoExecutor.java:42)
	at org.gradle.execution.taskgraph.DefaultTaskExecutionGraph$BuildOperationAwareWorkItemExecutor.execute(DefaultTaskExecutionGraph.java:277)
	at org.gradle.execution.taskgraph.DefaultTaskExecutionGraph$BuildOperationAwareWorkItemExecutor.execute(DefaultTaskExecutionGraph.java:262)
	at org.gradle.execution.taskgraph.DefaultTaskPlanExecutor$ExecutorWorker$1.execute(DefaultTaskPlanExecutor.java:135)
	at org.gradle.execution.taskgraph.DefaultTaskPlanExecutor$ExecutorWorker$1.execute(DefaultTaskPlanExecutor.java:130)
	at org.gradle.execution.taskgraph.DefaultTaskPlanExecutor$ExecutorWorker.execute(DefaultTaskPlanExecutor.java:200)
	at org.gradle.execution.taskgraph.DefaultTaskPlanExecutor$ExecutorWorker.executeWithWork(DefaultTaskPlanExecutor.java:191)
	at org.gradle.execution.taskgraph.DefaultTaskPlanExecutor$ExecutorWorker.run(DefaultTaskPlanExecutor.java:130)
	at org.gradle.internal.concurrent.ExecutorPolicy$CatchAndRecordFailures.onExecute(ExecutorPolicy.java:63)
	at org.gradle.internal.concurrent.ManagedExecutorImpl$1.run(ManagedExecutorImpl.java:46)
	at org.gradle.internal.concurrent.ThreadFactoryImpl$ManagedThreadRunnable.run(ThreadFactoryImpl.java:55)
Caused by: org.gradle.api.GradleException: There were failing tests. See the report at: file://<https://builds.apache.org/job/beam_PerformanceTests_Compressed_TextIOIT_HDFS/ws/src/sdks/java/io/file-based-io-tests/build/reports/tests/integrationTest/index.html>
	at org.gradle.api.tasks.testing.AbstractTestTask.handleTestFailures(AbstractTestTask.java:612)
	at org.gradle.api.tasks.testing.AbstractTestTask.executeTests(AbstractTestTask.java:484)
	at org.gradle.api.tasks.testing.Test.executeTests(Test.java:603)
	at org.gradle.internal.reflect.JavaMethod.invoke(JavaMethod.java:73)
	at org.gradle.api.internal.project.taskfactory.StandardTaskAction.doExecute(StandardTaskAction.java:46)
	at org.gradle.api.internal.project.taskfactory.StandardTaskAction.execute(StandardTaskAction.java:39)
	at org.gradle.api.internal.project.taskfactory.StandardTaskAction.execute(StandardTaskAction.java:26)
	at org.gradle.api.internal.AbstractTask$TaskActionWrapper.execute(AbstractTask.java:801)
	at org.gradle.api.internal.AbstractTask$TaskActionWrapper.execute(AbstractTask.java:768)
	at org.gradle.api.internal.tasks.execution.ExecuteActionsTaskExecuter$1.run(ExecuteActionsTaskExecuter.java:131)
	at org.gradle.internal.operations.DefaultBuildOperationExecutor$RunnableBuildOperationWorker.execute(DefaultBuildOperationExecutor.java:301)
	at org.gradle.internal.operations.DefaultBuildOperationExecutor$RunnableBuildOperationWorker.execute(DefaultBuildOperationExecutor.java:293)
	at org.gradle.internal.operations.DefaultBuildOperationExecutor.execute(DefaultBuildOperationExecutor.java:175)
	at org.gradle.internal.operations.DefaultBuildOperationExecutor.run(DefaultBuildOperationExecutor.java:91)
	at org.gradle.internal.operations.DelegatingBuildOperationExecutor.run(DelegatingBuildOperationExecutor.java:31)
	at org.gradle.api.internal.tasks.execution.ExecuteActionsTaskExecuter.executeAction(ExecuteActionsTaskExecuter.java:120)
	at org.gradle.api.internal.tasks.execution.ExecuteActionsTaskExecuter.executeActions(ExecuteActionsTaskExecuter.java:99)
	... 33 more


* Get more help at https://help.gradle.org

BUILD FAILED in 4m 44s

2019-01-06 12:29:24,785 7b435b43 MainThread beam_integration_benchmark(1/1) ERROR    Error
during benchmark beam_integration_benchmark
Traceback (most recent call last):
  File "<https://builds.apache.org/job/beam_PerformanceTests_Compressed_TextIOIT_HDFS/ws/PerfKitBenchmarker/perfkitbenchmarker/pkb.py",>
line 719, in RunBenchmark
    DoRunPhase(spec, collector, detailed_timer)
  File "<https://builds.apache.org/job/beam_PerformanceTests_Compressed_TextIOIT_HDFS/ws/PerfKitBenchmarker/perfkitbenchmarker/pkb.py",>
line 580, in DoRunPhase
    samples = spec.BenchmarkRun(spec)
  File "<https://builds.apache.org/job/beam_PerformanceTests_Compressed_TextIOIT_HDFS/ws/PerfKitBenchmarker/perfkitbenchmarker/linux_benchmarks/beam_integration_benchmark.py",>
line 160, in Run
    job_type=job_type)
  File "<https://builds.apache.org/job/beam_PerformanceTests_Compressed_TextIOIT_HDFS/ws/PerfKitBenchmarker/perfkitbenchmarker/providers/gcp/gcp_dpb_dataflow.py",>
line 90, in SubmitJob
    assert retcode == 0, "Integration Test Failed."
AssertionError: Integration Test Failed.
2019-01-06 12:29:24,787 7b435b43 MainThread beam_integration_benchmark(1/1) INFO     Cleaning
up benchmark beam_integration_benchmark
2019-01-06 12:29:24,787 7b435b43 MainThread beam_integration_benchmark(1/1) INFO     Running:
kubectl --kubeconfig=<https://builds.apache.org/job/beam_PerformanceTests_Compressed_TextIOIT_HDFS/ws/config-beam-performancetests-compressed-textioit-hdfs-1108>
delete -f <https://builds.apache.org/job/beam_PerformanceTests_Compressed_TextIOIT_HDFS/ws/src/.test-infra/kubernetes/hadoop/LargeITCluster/hdfs-multi-datanode-cluster.yml>
--ignore-not-found
2019-01-06 12:31:23,743 7b435b43 MainThread beam_integration_benchmark(1/1) ERROR    Exception
running benchmark
Traceback (most recent call last):
  File "<https://builds.apache.org/job/beam_PerformanceTests_Compressed_TextIOIT_HDFS/ws/PerfKitBenchmarker/perfkitbenchmarker/pkb.py",>
line 860, in RunBenchmarkTask
    RunBenchmark(spec, collector)
  File "<https://builds.apache.org/job/beam_PerformanceTests_Compressed_TextIOIT_HDFS/ws/PerfKitBenchmarker/perfkitbenchmarker/pkb.py",>
line 719, in RunBenchmark
    DoRunPhase(spec, collector, detailed_timer)
  File "<https://builds.apache.org/job/beam_PerformanceTests_Compressed_TextIOIT_HDFS/ws/PerfKitBenchmarker/perfkitbenchmarker/pkb.py",>
line 580, in DoRunPhase
    samples = spec.BenchmarkRun(spec)
  File "<https://builds.apache.org/job/beam_PerformanceTests_Compressed_TextIOIT_HDFS/ws/PerfKitBenchmarker/perfkitbenchmarker/linux_benchmarks/beam_integration_benchmark.py",>
line 160, in Run
    job_type=job_type)
  File "<https://builds.apache.org/job/beam_PerformanceTests_Compressed_TextIOIT_HDFS/ws/PerfKitBenchmarker/perfkitbenchmarker/providers/gcp/gcp_dpb_dataflow.py",>
line 90, in SubmitJob
    assert retcode == 0, "Integration Test Failed."
AssertionError: Integration Test Failed.
2019-01-06 12:31:23,744 7b435b43 MainThread beam_integration_benchmark(1/1) ERROR    Benchmark
1/1 beam_integration_benchmark (UID: beam_integration_benchmark0) failed. Execution will continue.
2019-01-06 12:31:23,745 7b435b43 MainThread beam_integration_benchmark(1/1) INFO     Benchmark
run statuses:
---------------------------------------------------------------------------------
Name                        UID                          Status  Failed Substatus
---------------------------------------------------------------------------------
beam_integration_benchmark  beam_integration_benchmark0  FAILED                  
---------------------------------------------------------------------------------
Success rate: 0.00% (0/1)
2019-01-06 12:31:23,745 7b435b43 MainThread beam_integration_benchmark(1/1) INFO     Complete
logs can be found at: <https://builds.apache.org/job/beam_PerformanceTests_Compressed_TextIOIT_HDFS/ws/runs/7b435b43/pkb.log>
2019-01-06 12:31:23,745 7b435b43 MainThread beam_integration_benchmark(1/1) INFO     Completion
statuses can be found at: <https://builds.apache.org/job/beam_PerformanceTests_Compressed_TextIOIT_HDFS/ws/runs/7b435b43/completion_statuses.json>
Build step 'Execute shell' marked build as failure

---------------------------------------------------------------------
To unsubscribe, e-mail: builds-unsubscribe@beam.apache.org
For additional commands, e-mail: builds-help@beam.apache.org


Mime
View raw message