beam-builds mailing list archives

Site index · List index
Message view « Date » · « Thread »
Top « Date » · « Thread »
From Apache Jenkins Server <jenk...@builds.apache.org>
Subject Build failed in Jenkins: beam_PostCommit_Java_PVR_Flink_Batch #321
Date Thu, 03 Jan 2019 01:21:11 GMT
See <https://builds.apache.org/job/beam_PostCommit_Java_PVR_Flink_Batch/321/display/redirect?page=changes>

Changes:

[ehudm] [BEAM-5959] Add performance testing for writing many files

------------------------------------------
[...truncated 50.24 MB...]

org.apache.beam.sdk.transforms.ViewTest > testMapSideInput STANDARD_ERROR
    [CHAIN MapPartition (MapPartition at [4]CreateMainInput/Read(CreateSource)/{ParDo(SplitBoundedSource),
Reshuffle.ViaRandomKey}) -> FlatMap (FlatMap at ExtractOutput[0]) -> Map (Key Extractor)
-> GroupCombine (GroupCombine at GroupCombine: CreateMainInput/Read(CreateSource)/Reshuffle.ViaRandomKey/Reshuffle/GroupByKey)
-> Map (Key Extractor) (12/16)] INFO org.apache.beam.runners.fnexecution.environment.DockerEnvironmentFactory
- Still waiting for startup of environment jenkins-docker-apache.bintray.io/beam/java for
worker id 1

org.apache.beam.sdk.values.PCollectionTupleTest > testComposePCollectionTuple STANDARD_ERROR
    [CHAIN MapPartition (MapPartition at [4]PAssert$20/GroupGlobally/Create.Values/Read(CreateSource)/{ParDo(SplitBoundedSource),
Reshuffle.ViaRandomKey}) -> FlatMap (FlatMap at ExtractOutput[0]) -> Map (Key Extractor)
-> GroupCombine (GroupCombine at GroupCombine: PAssert$20/GroupGlobally/Create.Values/Read(CreateSource)/Reshuffle.ViaRandomKey/Reshuffle/GroupByKey)
-> Map (Key Extractor) (5/16)] INFO org.apache.beam.runners.fnexecution.environment.DockerEnvironmentFactory
- Still waiting for startup of environment jenkins-docker-apache.bintray.io/beam/java for
worker id 1

org.apache.beam.sdk.transforms.ViewTest > testMapSideInput STANDARD_ERROR
    [CHAIN MapPartition (MapPartition at [4]CreateMainInput/Read(CreateSource)/{ParDo(SplitBoundedSource),
Reshuffle.ViaRandomKey}) -> FlatMap (FlatMap at ExtractOutput[0]) -> Map (Key Extractor)
-> GroupCombine (GroupCombine at GroupCombine: CreateMainInput/Read(CreateSource)/Reshuffle.ViaRandomKey/Reshuffle/GroupByKey)
-> Map (Key Extractor) (12/16)] INFO org.apache.beam.runners.fnexecution.environment.DockerEnvironmentFactory
- Still waiting for startup of environment jenkins-docker-apache.bintray.io/beam/java for
worker id 1

org.apache.beam.sdk.values.PCollectionTupleTest > testComposePCollectionTuple STANDARD_ERROR
    [CHAIN MapPartition (MapPartition at [4]PAssert$20/GroupGlobally/Create.Values/Read(CreateSource)/{ParDo(SplitBoundedSource),
Reshuffle.ViaRandomKey}) -> FlatMap (FlatMap at ExtractOutput[0]) -> Map (Key Extractor)
-> GroupCombine (GroupCombine at GroupCombine: PAssert$20/GroupGlobally/Create.Values/Read(CreateSource)/Reshuffle.ViaRandomKey/Reshuffle/GroupByKey)
-> Map (Key Extractor) (5/16)] INFO org.apache.beam.runners.fnexecution.environment.DockerEnvironmentFactory
- Still waiting for startup of environment jenkins-docker-apache.bintray.io/beam/java for
worker id 1

org.apache.beam.sdk.transforms.ViewTest > testMapSideInput STANDARD_ERROR
    [CHAIN MapPartition (MapPartition at [4]CreateMainInput/Read(CreateSource)/{ParDo(SplitBoundedSource),
Reshuffle.ViaRandomKey}) -> FlatMap (FlatMap at ExtractOutput[0]) -> Map (Key Extractor)
-> GroupCombine (GroupCombine at GroupCombine: CreateMainInput/Read(CreateSource)/Reshuffle.ViaRandomKey/Reshuffle/GroupByKey)
-> Map (Key Extractor) (12/16)] INFO org.apache.beam.runners.fnexecution.environment.DockerEnvironmentFactory
- Still waiting for startup of environment jenkins-docker-apache.bintray.io/beam/java for
worker id 1

org.apache.beam.sdk.values.PCollectionTupleTest > testComposePCollectionTuple STANDARD_ERROR
    [CHAIN MapPartition (MapPartition at [4]PAssert$20/GroupGlobally/Create.Values/Read(CreateSource)/{ParDo(SplitBoundedSource),
Reshuffle.ViaRandomKey}) -> FlatMap (FlatMap at ExtractOutput[0]) -> Map (Key Extractor)
-> GroupCombine (GroupCombine at GroupCombine: PAssert$20/GroupGlobally/Create.Values/Read(CreateSource)/Reshuffle.ViaRandomKey/Reshuffle/GroupByKey)
-> Map (Key Extractor) (5/16)] INFO org.apache.beam.runners.fnexecution.environment.DockerEnvironmentFactory
- Still waiting for startup of environment jenkins-docker-apache.bintray.io/beam/java for
worker id 1

org.apache.beam.sdk.transforms.ViewTest > testMapSideInput STANDARD_ERROR
    [CHAIN MapPartition (MapPartition at [4]CreateMainInput/Read(CreateSource)/{ParDo(SplitBoundedSource),
Reshuffle.ViaRandomKey}) -> FlatMap (FlatMap at ExtractOutput[0]) -> Map (Key Extractor)
-> GroupCombine (GroupCombine at GroupCombine: CreateMainInput/Read(CreateSource)/Reshuffle.ViaRandomKey/Reshuffle/GroupByKey)
-> Map (Key Extractor) (12/16)] INFO org.apache.beam.runners.fnexecution.environment.DockerEnvironmentFactory
- Still waiting for startup of environment jenkins-docker-apache.bintray.io/beam/java for
worker id 1

org.apache.beam.sdk.values.PCollectionTupleTest > testComposePCollectionTuple STANDARD_ERROR
    [CHAIN MapPartition (MapPartition at [4]PAssert$20/GroupGlobally/Create.Values/Read(CreateSource)/{ParDo(SplitBoundedSource),
Reshuffle.ViaRandomKey}) -> FlatMap (FlatMap at ExtractOutput[0]) -> Map (Key Extractor)
-> GroupCombine (GroupCombine at GroupCombine: PAssert$20/GroupGlobally/Create.Values/Read(CreateSource)/Reshuffle.ViaRandomKey/Reshuffle/GroupByKey)
-> Map (Key Extractor) (5/16)] INFO org.apache.beam.runners.fnexecution.environment.DockerEnvironmentFactory
- Still waiting for startup of environment jenkins-docker-apache.bintray.io/beam/java for
worker id 1

org.apache.beam.sdk.transforms.ViewTest > testMapSideInput STANDARD_ERROR
    [CHAIN MapPartition (MapPartition at [4]CreateMainInput/Read(CreateSource)/{ParDo(SplitBoundedSource),
Reshuffle.ViaRandomKey}) -> FlatMap (FlatMap at ExtractOutput[0]) -> Map (Key Extractor)
-> GroupCombine (GroupCombine at GroupCombine: CreateMainInput/Read(CreateSource)/Reshuffle.ViaRandomKey/Reshuffle/GroupByKey)
-> Map (Key Extractor) (12/16)] INFO org.apache.beam.runners.fnexecution.environment.DockerEnvironmentFactory
- Still waiting for startup of environment jenkins-docker-apache.bintray.io/beam/java for
worker id 1

org.apache.beam.sdk.values.PCollectionTupleTest > testComposePCollectionTuple STANDARD_ERROR
    [CHAIN MapPartition (MapPartition at [4]PAssert$20/GroupGlobally/Create.Values/Read(CreateSource)/{ParDo(SplitBoundedSource),
Reshuffle.ViaRandomKey}) -> FlatMap (FlatMap at ExtractOutput[0]) -> Map (Key Extractor)
-> GroupCombine (GroupCombine at GroupCombine: PAssert$20/GroupGlobally/Create.Values/Read(CreateSource)/Reshuffle.ViaRandomKey/Reshuffle/GroupByKey)
-> Map (Key Extractor) (5/16)] INFO org.apache.beam.runners.fnexecution.environment.DockerEnvironmentFactory
- Still waiting for startup of environment jenkins-docker-apache.bintray.io/beam/java for
worker id 1

org.apache.beam.sdk.transforms.ViewTest > testMapSideInput STANDARD_ERROR
    [CHAIN MapPartition (MapPartition at [4]CreateMainInput/Read(CreateSource)/{ParDo(SplitBoundedSource),
Reshuffle.ViaRandomKey}) -> FlatMap (FlatMap at ExtractOutput[0]) -> Map (Key Extractor)
-> GroupCombine (GroupCombine at GroupCombine: CreateMainInput/Read(CreateSource)/Reshuffle.ViaRandomKey/Reshuffle/GroupByKey)
-> Map (Key Extractor) (12/16)] INFO org.apache.beam.runners.fnexecution.environment.DockerEnvironmentFactory
- Still waiting for startup of environment jenkins-docker-apache.bintray.io/beam/java for
worker id 1

org.apache.beam.sdk.values.PCollectionTupleTest > testComposePCollectionTuple STANDARD_ERROR
    [CHAIN MapPartition (MapPartition at [4]PAssert$20/GroupGlobally/Create.Values/Read(CreateSource)/{ParDo(SplitBoundedSource),
Reshuffle.ViaRandomKey}) -> FlatMap (FlatMap at ExtractOutput[0]) -> Map (Key Extractor)
-> GroupCombine (GroupCombine at GroupCombine: PAssert$20/GroupGlobally/Create.Values/Read(CreateSource)/Reshuffle.ViaRandomKey/Reshuffle/GroupByKey)
-> Map (Key Extractor) (5/16)] INFO org.apache.beam.runners.fnexecution.environment.DockerEnvironmentFactory
- Still waiting for startup of environment jenkins-docker-apache.bintray.io/beam/java for
worker id 1

org.apache.beam.sdk.transforms.ViewTest > testMapSideInput STANDARD_ERROR
    [CHAIN MapPartition (MapPartition at [4]CreateMainInput/Read(CreateSource)/{ParDo(SplitBoundedSource),
Reshuffle.ViaRandomKey}) -> FlatMap (FlatMap at ExtractOutput[0]) -> Map (Key Extractor)
-> GroupCombine (GroupCombine at GroupCombine: CreateMainInput/Read(CreateSource)/Reshuffle.ViaRandomKey/Reshuffle/GroupByKey)
-> Map (Key Extractor) (12/16)] INFO org.apache.beam.runners.fnexecution.environment.DockerEnvironmentFactory
- Still waiting for startup of environment jenkins-docker-apache.bintray.io/beam/java for
worker id 1

org.apache.beam.sdk.values.PCollectionTupleTest > testComposePCollectionTuple STANDARD_ERROR
    [CHAIN MapPartition (MapPartition at [4]PAssert$20/GroupGlobally/Create.Values/Read(CreateSource)/{ParDo(SplitBoundedSource),
Reshuffle.ViaRandomKey}) -> FlatMap (FlatMap at ExtractOutput[0]) -> Map (Key Extractor)
-> GroupCombine (GroupCombine at GroupCombine: PAssert$20/GroupGlobally/Create.Values/Read(CreateSource)/Reshuffle.ViaRandomKey/Reshuffle/GroupByKey)
-> Map (Key Extractor) (5/16)] INFO org.apache.beam.runners.fnexecution.environment.DockerEnvironmentFactory
- Still waiting for startup of environment jenkins-docker-apache.bintray.io/beam/java for
worker id 1

org.apache.beam.sdk.transforms.ViewTest > testMapSideInput STANDARD_ERROR
    [CHAIN MapPartition (MapPartition at [4]CreateMainInput/Read(CreateSource)/{ParDo(SplitBoundedSource),
Reshuffle.ViaRandomKey}) -> FlatMap (FlatMap at ExtractOutput[0]) -> Map (Key Extractor)
-> GroupCombine (GroupCombine at GroupCombine: CreateMainInput/Read(CreateSource)/Reshuffle.ViaRandomKey/Reshuffle/GroupByKey)
-> Map (Key Extractor) (12/16)] INFO org.apache.beam.runners.fnexecution.environment.DockerEnvironmentFactory
- Still waiting for startup of environment jenkins-docker-apache.bintray.io/beam/java for
worker id 1

org.apache.beam.sdk.values.PCollectionTupleTest > testComposePCollectionTuple STANDARD_ERROR
    [CHAIN MapPartition (MapPartition at [4]PAssert$20/GroupGlobally/Create.Values/Read(CreateSource)/{ParDo(SplitBoundedSource),
Reshuffle.ViaRandomKey}) -> FlatMap (FlatMap at ExtractOutput[0]) -> Map (Key Extractor)
-> GroupCombine (GroupCombine at GroupCombine: PAssert$20/GroupGlobally/Create.Values/Read(CreateSource)/Reshuffle.ViaRandomKey/Reshuffle/GroupByKey)
-> Map (Key Extractor) (5/16)] INFO org.apache.beam.runners.fnexecution.environment.DockerEnvironmentFactory
- Still waiting for startup of environment jenkins-docker-apache.bintray.io/beam/java for
worker id 1

org.apache.beam.sdk.transforms.ViewTest > testMapSideInput STANDARD_ERROR
    [CHAIN MapPartition (MapPartition at [4]CreateMainInput/Read(CreateSource)/{ParDo(SplitBoundedSource),
Reshuffle.ViaRandomKey}) -> FlatMap (FlatMap at ExtractOutput[0]) -> Map (Key Extractor)
-> GroupCombine (GroupCombine at GroupCombine: CreateMainInput/Read(CreateSource)/Reshuffle.ViaRandomKey/Reshuffle/GroupByKey)
-> Map (Key Extractor) (12/16)] INFO org.apache.beam.runners.fnexecution.environment.DockerEnvironmentFactory
- Still waiting for startup of environment jenkins-docker-apache.bintray.io/beam/java for
worker id 1

org.apache.beam.sdk.values.PCollectionTupleTest > testComposePCollectionTuple STANDARD_ERROR
    [CHAIN MapPartition (MapPartition at [4]PAssert$20/GroupGlobally/Create.Values/Read(CreateSource)/{ParDo(SplitBoundedSource),
Reshuffle.ViaRandomKey}) -> FlatMap (FlatMap at ExtractOutput[0]) -> Map (Key Extractor)
-> GroupCombine (GroupCombine at GroupCombine: PAssert$20/GroupGlobally/Create.Values/Read(CreateSource)/Reshuffle.ViaRandomKey/Reshuffle/GroupByKey)
-> Map (Key Extractor) (5/16)] INFO org.apache.beam.runners.fnexecution.environment.DockerEnvironmentFactory
- Still waiting for startup of environment jenkins-docker-apache.bintray.io/beam/java for
worker id 1

org.apache.beam.sdk.transforms.ViewTest > testMapSideInput STANDARD_ERROR
    [CHAIN MapPartition (MapPartition at [4]CreateMainInput/Read(CreateSource)/{ParDo(SplitBoundedSource),
Reshuffle.ViaRandomKey}) -> FlatMap (FlatMap at ExtractOutput[0]) -> Map (Key Extractor)
-> GroupCombine (GroupCombine at GroupCombine: CreateMainInput/Read(CreateSource)/Reshuffle.ViaRandomKey/Reshuffle/GroupByKey)
-> Map (Key Extractor) (12/16)] INFO org.apache.beam.runners.fnexecution.environment.DockerEnvironmentFactory
- Still waiting for startup of environment jenkins-docker-apache.bintray.io/beam/java for
worker id 1

org.apache.beam.sdk.values.PCollectionTupleTest > testComposePCollectionTuple STANDARD_ERROR
    [CHAIN MapPartition (MapPartition at [4]PAssert$20/GroupGlobally/Create.Values/Read(CreateSource)/{ParDo(SplitBoundedSource),
Reshuffle.ViaRandomKey}) -> FlatMap (FlatMap at ExtractOutput[0]) -> Map (Key Extractor)
-> GroupCombine (GroupCombine at GroupCombine: PAssert$20/GroupGlobally/Create.Values/Read(CreateSource)/Reshuffle.ViaRandomKey/Reshuffle/GroupByKey)
-> Map (Key Extractor) (5/16)] INFO org.apache.beam.runners.fnexecution.environment.DockerEnvironmentFactory
- Still waiting for startup of environment jenkins-docker-apache.bintray.io/beam/java for
worker id 1

org.apache.beam.sdk.transforms.ViewTest > testMapSideInput STANDARD_ERROR
    [CHAIN MapPartition (MapPartition at [4]CreateMainInput/Read(CreateSource)/{ParDo(SplitBoundedSource),
Reshuffle.ViaRandomKey}) -> FlatMap (FlatMap at ExtractOutput[0]) -> Map (Key Extractor)
-> GroupCombine (GroupCombine at GroupCombine: CreateMainInput/Read(CreateSource)/Reshuffle.ViaRandomKey/Reshuffle/GroupByKey)
-> Map (Key Extractor) (12/16)] INFO org.apache.beam.runners.fnexecution.environment.DockerEnvironmentFactory
- Still waiting for startup of environment jenkins-docker-apache.bintray.io/beam/java for
worker id 1

org.apache.beam.sdk.values.PCollectionTupleTest > testComposePCollectionTuple STANDARD_ERROR
    [CHAIN MapPartition (MapPartition at [4]PAssert$20/GroupGlobally/Create.Values/Read(CreateSource)/{ParDo(SplitBoundedSource),
Reshuffle.ViaRandomKey}) -> FlatMap (FlatMap at ExtractOutput[0]) -> Map (Key Extractor)
-> GroupCombine (GroupCombine at GroupCombine: PAssert$20/GroupGlobally/Create.Values/Read(CreateSource)/Reshuffle.ViaRandomKey/Reshuffle/GroupByKey)
-> Map (Key Extractor) (5/16)] INFO org.apache.beam.runners.fnexecution.environment.DockerEnvironmentFactory
- Still waiting for startup of environment jenkins-docker-apache.bintray.io/beam/java for
worker id 1

org.apache.beam.sdk.transforms.ViewTest > testMapSideInput STANDARD_ERROR
    [CHAIN MapPartition (MapPartition at [4]CreateMainInput/Read(CreateSource)/{ParDo(SplitBoundedSource),
Reshuffle.ViaRandomKey}) -> FlatMap (FlatMap at ExtractOutput[0]) -> Map (Key Extractor)
-> GroupCombine (GroupCombine at GroupCombine: CreateMainInput/Read(CreateSource)/Reshuffle.ViaRandomKey/Reshuffle/GroupByKey)
-> Map (Key Extractor) (12/16)] INFO org.apache.beam.runners.fnexecution.environment.DockerEnvironmentFactory
- Still waiting for startup of environment jenkins-docker-apache.bintray.io/beam/java for
worker id 1

org.apache.beam.sdk.values.PCollectionTupleTest > testComposePCollectionTuple STANDARD_ERROR
    [CHAIN MapPartition (MapPartition at [4]PAssert$20/GroupGlobally/Create.Values/Read(CreateSource)/{ParDo(SplitBoundedSource),
Reshuffle.ViaRandomKey}) -> FlatMap (FlatMap at ExtractOutput[0]) -> Map (Key Extractor)
-> GroupCombine (GroupCombine at GroupCombine: PAssert$20/GroupGlobally/Create.Values/Read(CreateSource)/Reshuffle.ViaRandomKey/Reshuffle/GroupByKey)
-> Map (Key Extractor) (5/16)] INFO org.apache.beam.runners.fnexecution.environment.DockerEnvironmentFactory
- Still waiting for startup of environment jenkins-docker-apache.bintray.io/beam/java for
worker id 1

org.apache.beam.sdk.transforms.ViewTest > testMapSideInput STANDARD_ERROR
    [CHAIN MapPartition (MapPartition at [4]CreateMainInput/Read(CreateSource)/{ParDo(SplitBoundedSource),
Reshuffle.ViaRandomKey}) -> FlatMap (FlatMap at ExtractOutput[0]) -> Map (Key Extractor)
-> GroupCombine (GroupCombine at GroupCombine: CreateMainInput/Read(CreateSource)/Reshuffle.ViaRandomKey/Reshuffle/GroupByKey)
-> Map (Key Extractor) (12/16)] INFO org.apache.beam.runners.fnexecution.environment.DockerEnvironmentFactory
- Still waiting for startup of environment jenkins-docker-apache.bintray.io/beam/java for
worker id 1

org.apache.beam.sdk.values.PCollectionTupleTest > testComposePCollectionTuple STANDARD_ERROR
    [CHAIN MapPartition (MapPartition at [4]PAssert$20/GroupGlobally/Create.Values/Read(CreateSource)/{ParDo(SplitBoundedSource),
Reshuffle.ViaRandomKey}) -> FlatMap (FlatMap at ExtractOutput[0]) -> Map (Key Extractor)
-> GroupCombine (GroupCombine at GroupCombine: PAssert$20/GroupGlobally/Create.Values/Read(CreateSource)/Reshuffle.ViaRandomKey/Reshuffle/GroupByKey)
-> Map (Key Extractor) (5/16)] INFO org.apache.beam.runners.fnexecution.environment.DockerEnvironmentFactory
- Still waiting for startup of environment jenkins-docker-apache.bintray.io/beam/java for
worker id 1

org.apache.beam.sdk.transforms.ViewTest > testMapSideInput STANDARD_ERROR
    [CHAIN MapPartition (MapPartition at [4]CreateMainInput/Read(CreateSource)/{ParDo(SplitBoundedSource),
Reshuffle.ViaRandomKey}) -> FlatMap (FlatMap at ExtractOutput[0]) -> Map (Key Extractor)
-> GroupCombine (GroupCombine at GroupCombine: CreateMainInput/Read(CreateSource)/Reshuffle.ViaRandomKey/Reshuffle/GroupByKey)
-> Map (Key Extractor) (12/16)] INFO org.apache.beam.runners.fnexecution.environment.DockerEnvironmentFactory
- Still waiting for startup of environment jenkins-docker-apache.bintray.io/beam/java for
worker id 1

org.apache.beam.sdk.values.PCollectionTupleTest > testComposePCollectionTuple STANDARD_ERROR
    [CHAIN MapPartition (MapPartition at [4]PAssert$20/GroupGlobally/Create.Values/Read(CreateSource)/{ParDo(SplitBoundedSource),
Reshuffle.ViaRandomKey}) -> FlatMap (FlatMap at ExtractOutput[0]) -> Map (Key Extractor)
-> GroupCombine (GroupCombine at GroupCombine: PAssert$20/GroupGlobally/Create.Values/Read(CreateSource)/Reshuffle.ViaRandomKey/Reshuffle/GroupByKey)
-> Map (Key Extractor) (5/16)] INFO org.apache.beam.runners.fnexecution.environment.DockerEnvironmentFactory
- Still waiting for startup of environment jenkins-docker-apache.bintray.io/beam/java for
worker id 1

org.apache.beam.sdk.transforms.ViewTest > testMapSideInput STANDARD_ERROR
    [CHAIN MapPartition (MapPartition at [4]CreateMainInput/Read(CreateSource)/{ParDo(SplitBoundedSource),
Reshuffle.ViaRandomKey}) -> FlatMap (FlatMap at ExtractOutput[0]) -> Map (Key Extractor)
-> GroupCombine (GroupCombine at GroupCombine: CreateMainInput/Read(CreateSource)/Reshuffle.ViaRandomKey/Reshuffle/GroupByKey)
-> Map (Key Extractor) (12/16)] INFO org.apache.beam.runners.fnexecution.environment.DockerEnvironmentFactory
- Still waiting for startup of environment jenkins-docker-apache.bintray.io/beam/java for
worker id 1

org.apache.beam.sdk.values.PCollectionTupleTest > testComposePCollectionTuple STANDARD_ERROR
    [CHAIN MapPartition (MapPartition at [4]PAssert$20/GroupGlobally/Create.Values/Read(CreateSource)/{ParDo(SplitBoundedSource),
Reshuffle.ViaRandomKey}) -> FlatMap (FlatMap at ExtractOutput[0]) -> Map (Key Extractor)
-> GroupCombine (GroupCombine at GroupCombine: PAssert$20/GroupGlobally/Create.Values/Read(CreateSource)/Reshuffle.ViaRandomKey/Reshuffle/GroupByKey)
-> Map (Key Extractor) (5/16)] INFO org.apache.beam.runners.fnexecution.environment.DockerEnvironmentFactory
- Still waiting for startup of environment jenkins-docker-apache.bintray.io/beam/java for
worker id 1

org.apache.beam.sdk.transforms.ViewTest > testMapSideInput STANDARD_ERROR
    [CHAIN MapPartition (MapPartition at [4]CreateMainInput/Read(CreateSource)/{ParDo(SplitBoundedSource),
Reshuffle.ViaRandomKey}) -> FlatMap (FlatMap at ExtractOutput[0]) -> Map (Key Extractor)
-> GroupCombine (GroupCombine at GroupCombine: CreateMainInput/Read(CreateSource)/Reshuffle.ViaRandomKey/Reshuffle/GroupByKey)
-> Map (Key Extractor) (12/16)] INFO org.apache.beam.runners.fnexecution.environment.DockerEnvironmentFactory
- Still waiting for startup of environment jenkins-docker-apache.bintray.io/beam/java for
worker id 1

org.apache.beam.sdk.values.PCollectionTupleTest > testComposePCollectionTuple STANDARD_ERROR
    [CHAIN MapPartition (MapPartition at [4]PAssert$20/GroupGlobally/Create.Values/Read(CreateSource)/{ParDo(SplitBoundedSource),
Reshuffle.ViaRandomKey}) -> FlatMap (FlatMap at ExtractOutput[0]) -> Map (Key Extractor)
-> GroupCombine (GroupCombine at GroupCombine: PAssert$20/GroupGlobally/Create.Values/Read(CreateSource)/Reshuffle.ViaRandomKey/Reshuffle/GroupByKey)
-> Map (Key Extractor) (5/16)] INFO org.apache.beam.runners.fnexecution.environment.DockerEnvironmentFactory
- Still waiting for startup of environment jenkins-docker-apache.bintray.io/beam/java for
worker id 1
    [CHAIN MapPartition (MapPartition at [4]PAssert$20/GroupGlobally/Create.Values/Read(CreateSource)/{ParDo(SplitBoundedSource),
Reshuffle.ViaRandomKey}) -> FlatMap (FlatMap at ExtractOutput[0]) -> Map (Key Extractor)
-> GroupCombine (GroupCombine at GroupCombine: PAssert$20/GroupGlobally/Create.Values/Read(CreateSource)/Reshuffle.ViaRandomKey/Reshuffle/GroupByKey)
-> Map (Key Extractor) (5/16)] INFO org.apache.beam.runners.fnexecution.environment.DockerEnvironmentFactory
- Still waiting for startup of environment jenkins-docker-apache.bintray.io/beam/java for
worker id 1

org.apache.beam.sdk.transforms.ViewTest > testMapSideInput STANDARD_ERROR
    [CHAIN MapPartition (MapPartition at [4]CreateMainInput/Read(CreateSource)/{ParDo(SplitBoundedSource),
Reshuffle.ViaRandomKey}) -> FlatMap (FlatMap at ExtractOutput[0]) -> Map (Key Extractor)
-> GroupCombine (GroupCombine at GroupCombine: CreateMainInput/Read(CreateSource)/Reshuffle.ViaRandomKey/Reshuffle/GroupByKey)
-> Map (Key Extractor) (12/16)] INFO org.apache.beam.runners.fnexecution.environment.DockerEnvironmentFactory
- Still waiting for startup of environment jenkins-docker-apache.bintray.io/beam/java for
worker id 1

org.apache.beam.sdk.values.PCollectionTupleTest > testComposePCollectionTuple STANDARD_ERROR
    [CHAIN MapPartition (MapPartition at [4]PAssert$20/GroupGlobally/Create.Values/Read(CreateSource)/{ParDo(SplitBoundedSource),
Reshuffle.ViaRandomKey}) -> FlatMap (FlatMap at ExtractOutput[0]) -> Map (Key Extractor)
-> GroupCombine (GroupCombine at GroupCombine: PAssert$20/GroupGlobally/Create.Values/Read(CreateSource)/Reshuffle.ViaRandomKey/Reshuffle/GroupByKey)
-> Map (Key Extractor) (5/16)] INFO org.apache.beam.runners.fnexecution.environment.DockerEnvironmentFactory
- Still waiting for startup of environment jenkins-docker-apache.bintray.io/beam/java for
worker id 1

org.apache.beam.sdk.transforms.ViewTest > testMapSideInput STANDARD_ERROR
    [CHAIN MapPartition (MapPartition at [4]CreateMainInput/Read(CreateSource)/{ParDo(SplitBoundedSource),
Reshuffle.ViaRandomKey}) -> FlatMap (FlatMap at ExtractOutput[0]) -> Map (Key Extractor)
-> GroupCombine (GroupCombine at GroupCombine: CreateMainInput/Read(CreateSource)/Reshuffle.ViaRandomKey/Reshuffle/GroupByKey)
-> Map (Key Extractor) (12/16)] INFO org.apache.beam.runners.fnexecution.environment.DockerEnvironmentFactory
- Still waiting for startup of environment jenkins-docker-apache.bintray.io/beam/java for
worker id 1

org.apache.beam.sdk.values.PCollectionTupleTest > testComposePCollectionTuple STANDARD_ERROR
    [CHAIN MapPartition (MapPartition at [4]PAssert$20/GroupGlobally/Create.Values/Read(CreateSource)/{ParDo(SplitBoundedSource),
Reshuffle.ViaRandomKey}) -> FlatMap (FlatMap at ExtractOutput[0]) -> Map (Key Extractor)
-> GroupCombine (GroupCombine at GroupCombine: PAssert$20/GroupGlobally/Create.Values/Read(CreateSource)/Reshuffle.ViaRandomKey/Reshuffle/GroupByKey)
-> Map (Key Extractor) (5/16)] INFO org.apache.beam.runners.fnexecution.environment.DockerEnvironmentFactory
- Still waiting for startup of environment jenkins-docker-apache.bintray.io/beam/java for
worker id 1

org.apache.beam.sdk.transforms.ViewTest > testMapSideInput STANDARD_ERROR
    [CHAIN MapPartition (MapPartition at [4]CreateMainInput/Read(CreateSource)/{ParDo(SplitBoundedSource),
Reshuffle.ViaRandomKey}) -> FlatMap (FlatMap at ExtractOutput[0]) -> Map (Key Extractor)
-> GroupCombine (GroupCombine at GroupCombine: CreateMainInput/Read(CreateSource)/Reshuffle.ViaRandomKey/Reshuffle/GroupByKey)
-> Map (Key Extractor) (12/16)] INFO org.apache.beam.runners.fnexecution.environment.DockerEnvironmentFactory
- Still waiting for startup of environment jenkins-docker-apache.bintray.io/beam/java for
worker id 1

org.apache.beam.sdk.values.PCollectionTupleTest > testComposePCollectionTuple STANDARD_ERROR
    [CHAIN MapPartition (MapPartition at [4]PAssert$20/GroupGlobally/Create.Values/Read(CreateSource)/{ParDo(SplitBoundedSource),
Reshuffle.ViaRandomKey}) -> FlatMap (FlatMap at ExtractOutput[0]) -> Map (Key Extractor)
-> GroupCombine (GroupCombine at GroupCombine: PAssert$20/GroupGlobally/Create.Values/Read(CreateSource)/Reshuffle.ViaRandomKey/Reshuffle/GroupByKey)
-> Map (Key Extractor) (5/16)] INFO org.apache.beam.runners.fnexecution.environment.DockerEnvironmentFactory
- Still waiting for startup of environment jenkins-docker-apache.bintray.io/beam/java for
worker id 1

org.apache.beam.sdk.transforms.ViewTest > testMapSideInput STANDARD_ERROR
    [CHAIN MapPartition (MapPartition at [4]CreateMainInput/Read(CreateSource)/{ParDo(SplitBoundedSource),
Reshuffle.ViaRandomKey}) -> FlatMap (FlatMap at ExtractOutput[0]) -> Map (Key Extractor)
-> GroupCombine (GroupCombine at GroupCombine: CreateMainInput/Read(CreateSource)/Reshuffle.ViaRandomKey/Reshuffle/GroupByKey)
-> Map (Key Extractor) (12/16)] INFO org.apache.beam.runners.fnexecution.environment.DockerEnvironmentFactory
- Still waiting for startup of environment jenkins-docker-apache.bintray.io/beam/java for
worker id 1

org.apache.beam.sdk.values.PCollectionTupleTest > testComposePCollectionTuple STANDARD_ERROR
    [CHAIN MapPartition (MapPartition at [4]PAssert$20/GroupGlobally/Create.Values/Read(CreateSource)/{ParDo(SplitBoundedSource),
Reshuffle.ViaRandomKey}) -> FlatMap (FlatMap at ExtractOutput[0]) -> Map (Key Extractor)
-> GroupCombine (GroupCombine at GroupCombine: PAssert$20/GroupGlobally/Create.Values/Read(CreateSource)/Reshuffle.ViaRandomKey/Reshuffle/GroupByKey)
-> Map (Key Extractor) (5/16)] INFO org.apache.beam.runners.fnexecution.environment.DockerEnvironmentFactory
- Still waiting for startup of environment jenkins-docker-apache.bintray.io/beam/java for
worker id 1

org.apache.beam.sdk.transforms.ViewTest > testMapSideInput STANDARD_ERROR
    [CHAIN MapPartition (MapPartition at [4]CreateMainInput/Read(CreateSource)/{ParDo(SplitBoundedSource),
Reshuffle.ViaRandomKey}) -> FlatMap (FlatMap at ExtractOutput[0]) -> Map (Key Extractor)
-> GroupCombine (GroupCombine at GroupCombine: CreateMainInput/Read(CreateSource)/Reshuffle.ViaRandomKey/Reshuffle/GroupByKey)
-> Map (Key Extractor) (12/16)] INFO org.apache.beam.runners.fnexecution.environment.DockerEnvironmentFactory
- Still waiting for startup of environment jenkins-docker-apache.bintray.io/beam/java for
worker id 1

org.apache.beam.sdk.values.PCollectionTupleTest > testComposePCollectionTuple STANDARD_ERROR
    [CHAIN MapPartition (MapPartition at [4]PAssert$20/GroupGlobally/Create.Values/Read(CreateSource)/{ParDo(SplitBoundedSource),
Reshuffle.ViaRandomKey}) -> FlatMap (FlatMap at ExtractOutput[0]) -> Map (Key Extractor)
-> GroupCombine (GroupCombine at GroupCombine: PAssert$20/GroupGlobally/Create.Values/Read(CreateSource)/Reshuffle.ViaRandomKey/Reshuffle/GroupByKey)
-> Map (Key Extractor) (5/16)] INFO org.apache.beam.runners.fnexecution.environment.DockerEnvironmentFactory
- Still waiting for startup of environment jenkins-docker-apache.bintray.io/beam/java for
worker id 1

org.apache.beam.sdk.transforms.ViewTest > testMapSideInput STANDARD_ERROR
    [CHAIN MapPartition (MapPartition at [4]CreateMainInput/Read(CreateSource)/{ParDo(SplitBoundedSource),
Reshuffle.ViaRandomKey}) -> FlatMap (FlatMap at ExtractOutput[0]) -> Map (Key Extractor)
-> GroupCombine (GroupCombine at GroupCombine: CreateMainInput/Read(CreateSource)/Reshuffle.ViaRandomKey/Reshuffle/GroupByKey)
-> Map (Key Extractor) (12/16)] INFO org.apache.beam.runners.fnexecution.environment.DockerEnvironmentFactory
- Still waiting for startup of environment jenkins-docker-apache.bintray.io/beam/java for
worker id 1

org.apache.beam.sdk.values.PCollectionTupleTest > testComposePCollectionTuple STANDARD_ERROR
    [CHAIN MapPartition (MapPartition at [4]PAssert$20/GroupGlobally/Create.Values/Read(CreateSource)/{ParDo(SplitBoundedSource),
Reshuffle.ViaRandomKey}) -> FlatMap (FlatMap at ExtractOutput[0]) -> Map (Key Extractor)
-> GroupCombine (GroupCombine at GroupCombine: PAssert$20/GroupGlobally/Create.Values/Read(CreateSource)/Reshuffle.ViaRandomKey/Reshuffle/GroupByKey)
-> Map (Key Extractor) (5/16)] INFO org.apache.beam.runners.fnexecution.environment.DockerEnvironmentFactory
- Still waiting for startup of environment jenkins-docker-apache.bintray.io/beam/java for
worker id 1

org.apache.beam.sdk.transforms.ViewTest > testMapSideInput STANDARD_ERROR
    [CHAIN MapPartition (MapPartition at [4]CreateMainInput/Read(CreateSource)/{ParDo(SplitBoundedSource),
Reshuffle.ViaRandomKey}) -> FlatMap (FlatMap at ExtractOutput[0]) -> Map (Key Extractor)
-> GroupCombine (GroupCombine at GroupCombine: CreateMainInput/Read(CreateSource)/Reshuffle.ViaRandomKey/Reshuffle/GroupByKey)
-> Map (Key Extractor) (12/16)] INFO org.apache.beam.runners.fnexecution.environment.DockerEnvironmentFactory
- Still waiting for startup of environment jenkins-docker-apache.bintray.io/beam/java for
worker id 1

org.apache.beam.sdk.values.PCollectionTupleTest > testComposePCollectionTuple STANDARD_ERROR
    [CHAIN MapPartition (MapPartition at [4]PAssert$20/GroupGlobally/Create.Values/Read(CreateSource)/{ParDo(SplitBoundedSource),
Reshuffle.ViaRandomKey}) -> FlatMap (FlatMap at ExtractOutput[0]) -> Map (Key Extractor)
-> GroupCombine (GroupCombine at GroupCombine: PAssert$20/GroupGlobally/Create.Values/Read(CreateSource)/Reshuffle.ViaRandomKey/Reshuffle/GroupByKey)
-> Map (Key Extractor) (5/16)] INFO org.apache.beam.runners.fnexecution.environment.DockerEnvironmentFactory
- Still waiting for startup of environment jenkins-docker-apache.bintray.io/beam/java for
worker id 1

org.apache.beam.sdk.transforms.ViewTest > testMapSideInput STANDARD_ERROR
    [CHAIN MapPartition (MapPartition at [4]CreateMainInput/Read(CreateSource)/{ParDo(SplitBoundedSource),
Reshuffle.ViaRandomKey}) -> FlatMap (FlatMap at ExtractOutput[0]) -> Map (Key Extractor)
-> GroupCombine (GroupCombine at GroupCombine: CreateMainInput/Read(CreateSource)/Reshuffle.ViaRandomKey/Reshuffle/GroupByKey)
-> Map (Key Extractor) (12/16)] INFO org.apache.beam.runners.fnexecution.environment.DockerEnvironmentFactory
- Still waiting for startup of environment jenkins-docker-apache.bintray.io/beam/java for
worker id 1

org.apache.beam.sdk.values.PCollectionTupleTest > testComposePCollectionTuple STANDARD_ERROR
    [CHAIN MapPartition (MapPartition at [4]PAssert$20/GroupGlobally/Create.Values/Read(CreateSource)/{ParDo(SplitBoundedSource),
Reshuffle.ViaRandomKey}) -> FlatMap (FlatMap at ExtractOutput[0]) -> Map (Key Extractor)
-> GroupCombine (GroupCombine at GroupCombine: PAssert$20/GroupGlobally/Create.Values/Read(CreateSource)/Reshuffle.ViaRandomKey/Reshuffle/GroupByKey)
-> Map (Key Extractor) (5/16)] INFO org.apache.beam.runners.fnexecution.environment.DockerEnvironmentFactory
- Still waiting for startup of environment jenkins-docker-apache.bintray.io/beam/java for
worker id 1

org.apache.beam.sdk.transforms.ViewTest > testMapSideInput STANDARD_ERROR
    [CHAIN MapPartition (MapPartition at [4]CreateMainInput/Read(CreateSource)/{ParDo(SplitBoundedSource),
Reshuffle.ViaRandomKey}) -> FlatMap (FlatMap at ExtractOutput[0]) -> Map (Key Extractor)
-> GroupCombine (GroupCombine at GroupCombine: CreateMainInput/Read(CreateSource)/Reshuffle.ViaRandomKey/Reshuffle/GroupByKey)
-> Map (Key Extractor) (12/16)] INFO org.apache.beam.runners.fnexecution.environment.DockerEnvironmentFactory
- Still waiting for startup of environment jenkins-docker-apache.bintray.io/beam/java for
worker id 1

org.apache.beam.sdk.values.PCollectionTupleTest > testComposePCollectionTuple STANDARD_ERROR
    [CHAIN MapPartition (MapPartition at [4]PAssert$20/GroupGlobally/Create.Values/Read(CreateSource)/{ParDo(SplitBoundedSource),
Reshuffle.ViaRandomKey}) -> FlatMap (FlatMap at ExtractOutput[0]) -> Map (Key Extractor)
-> GroupCombine (GroupCombine at GroupCombine: PAssert$20/GroupGlobally/Create.Values/Read(CreateSource)/Reshuffle.ViaRandomKey/Reshuffle/GroupByKey)
-> Map (Key Extractor) (5/16)] INFO org.apache.beam.runners.fnexecution.environment.DockerEnvironmentFactory
- Still waiting for startup of environment jenkins-docker-apache.bintray.io/beam/java for
worker id 1

org.apache.beam.sdk.transforms.ViewTest > testMapSideInput STANDARD_ERROR
    [CHAIN MapPartition (MapPartition at [4]CreateMainInput/Read(CreateSource)/{ParDo(SplitBoundedSource),
Reshuffle.ViaRandomKey}) -> FlatMap (FlatMap at ExtractOutput[0]) -> Map (Key Extractor)
-> GroupCombine (GroupCombine at GroupCombine: CreateMainInput/Read(CreateSource)/Reshuffle.ViaRandomKey/Reshuffle/GroupByKey)
-> Map (Key Extractor) (12/16)] INFO org.apache.beam.runners.fnexecution.environment.DockerEnvironmentFactory
- Still waiting for startup of environment jenkins-docker-apache.bintray.io/beam/java for
worker id 1

org.apache.beam.sdk.values.PCollectionTupleTest > testComposePCollectionTuple STANDARD_ERROR
    [CHAIN MapPartition (MapPartition at [4]PAssert$20/GroupGlobally/Create.Values/Read(CreateSource)/{ParDo(SplitBoundedSource),
Reshuffle.ViaRandomKey}) -> FlatMap (FlatMap at ExtractOutput[0]) -> Map (Key Extractor)
-> GroupCombine (GroupCombine at GroupCombine: PAssert$20/GroupGlobally/Create.Values/Read(CreateSource)/Reshuffle.ViaRandomKey/Reshuffle/GroupByKey)
-> Map (Key Extractor) (5/16)] INFO org.apache.beam.runners.fnexecution.environment.DockerEnvironmentFactory
- Still waiting for startup of environment jenkins-docker-apache.bintray.io/beam/java for
worker id 1

org.apache.beam.sdk.transforms.ViewTest > testMapSideInput STANDARD_ERROR
    [CHAIN MapPartition (MapPartition at [4]CreateMainInput/Read(CreateSource)/{ParDo(SplitBoundedSource),
Reshuffle.ViaRandomKey}) -> FlatMap (FlatMap at ExtractOutput[0]) -> Map (Key Extractor)
-> GroupCombine (GroupCombine at GroupCombine: CreateMainInput/Read(CreateSource)/Reshuffle.ViaRandomKey/Reshuffle/GroupByKey)
-> Map (Key Extractor) (12/16)] INFO org.apache.beam.runners.fnexecution.environment.DockerEnvironmentFactory
- Still waiting for startup of environment jenkins-docker-apache.bintray.io/beam/java for
worker id 1

org.apache.beam.sdk.values.PCollectionTupleTest > testComposePCollectionTuple STANDARD_ERROR
    [CHAIN MapPartition (MapPartition at [4]PAssert$20/GroupGlobally/Create.Values/Read(CreateSource)/{ParDo(SplitBoundedSource),
Reshuffle.ViaRandomKey}) -> FlatMap (FlatMap at ExtractOutput[0]) -> Map (Key Extractor)
-> GroupCombine (GroupCombine at GroupCombine: PAssert$20/GroupGlobally/Create.Values/Read(CreateSource)/Reshuffle.ViaRandomKey/Reshuffle/GroupByKey)
-> Map (Key Extractor) (5/16)] INFO org.apache.beam.runners.fnexecution.environment.DockerEnvironmentFactory
- Still waiting for startup of environment jenkins-docker-apache.bintray.io/beam/java for
worker id 1

org.apache.beam.sdk.transforms.ViewTest > testMapSideInput STANDARD_ERROR
    [CHAIN MapPartition (MapPartition at [4]CreateMainInput/Read(CreateSource)/{ParDo(SplitBoundedSource),
Reshuffle.ViaRandomKey}) -> FlatMap (FlatMap at ExtractOutput[0]) -> Map (Key Extractor)
-> GroupCombine (GroupCombine at GroupCombine: CreateMainInput/Read(CreateSource)/Reshuffle.ViaRandomKey/Reshuffle/GroupByKey)
-> Map (Key Extractor) (12/16)] INFO org.apache.beam.runners.fnexecution.environment.DockerEnvironmentFactory
- Still waiting for startup of environment jenkins-docker-apache.bintray.io/beam/java for
worker id 1

org.apache.beam.sdk.values.PCollectionTupleTest > testComposePCollectionTuple STANDARD_ERROR
    [CHAIN MapPartition (MapPartition at [4]PAssert$20/GroupGlobally/Create.Values/Read(CreateSource)/{ParDo(SplitBoundedSource),
Reshuffle.ViaRandomKey}) -> FlatMap (FlatMap at ExtractOutput[0]) -> Map (Key Extractor)
-> GroupCombine (GroupCombine at GroupCombine: PAssert$20/GroupGlobally/Create.Values/Read(CreateSource)/Reshuffle.ViaRandomKey/Reshuffle/GroupByKey)
-> Map (Key Extractor) (5/16)] INFO org.apache.beam.runners.fnexecution.environment.DockerEnvironmentFactory
- Still waiting for startup of environment jenkins-docker-apache.bintray.io/beam/java for
worker id 1

org.apache.beam.sdk.transforms.ViewTest > testMapSideInput STANDARD_ERROR
    [CHAIN MapPartition (MapPartition at [4]CreateMainInput/Read(CreateSource)/{ParDo(SplitBoundedSource),
Reshuffle.ViaRandomKey}) -> FlatMap (FlatMap at ExtractOutput[0]) -> Map (Key Extractor)
-> GroupCombine (GroupCombine at GroupCombine: CreateMainInput/Read(CreateSource)/Reshuffle.ViaRandomKey/Reshuffle/GroupByKey)
-> Map (Key Extractor) (12/16)] INFO org.apache.beam.runners.fnexecution.environment.DockerEnvironmentFactory
- Still waiting for startup of environment jenkins-docker-apache.bintray.io/beam/java for
worker id 1
    [CHAIN MapPartition (MapPartition at [4]CreateMainInput/Read(CreateSource)/{ParDo(SplitBoundedSource),
Reshuffle.ViaRandomKey}) -> FlatMap (FlatMap at ExtractOutput[0]) -> Map (Key Extractor)
-> GroupCombine (GroupCombine at GroupCombine: CreateMainInput/Read(CreateSource)/Reshuffle.ViaRandomKey/Reshuffle/GroupByKey)
-> Map (Key Extractor) (12/16)] INFO org.apache.beam.runners.fnexecution.environment.DockerEnvironmentFactory
- Still waiting for startup of environment jenkins-docker-apache.bintray.io/beam/java for
worker id 1

org.apache.beam.sdk.values.PCollectionTupleTest > testComposePCollectionTuple STANDARD_ERROR
    [CHAIN MapPartition (MapPartition at [4]PAssert$20/GroupGlobally/Create.Values/Read(CreateSource)/{ParDo(SplitBoundedSource),
Reshuffle.ViaRandomKey}) -> FlatMap (FlatMap at ExtractOutput[0]) -> Map (Key Extractor)
-> GroupCombine (GroupCombine at GroupCombine: PAssert$20/GroupGlobally/Create.Values/Read(CreateSource)/Reshuffle.ViaRandomKey/Reshuffle/GroupByKey)
-> Map (Key Extractor) (5/16)] INFO org.apache.beam.runners.fnexecution.environment.DockerEnvironmentFactory
- Still waiting for startup of environment jenkins-docker-apache.bintray.io/beam/java for
worker id 1
#
Java HotSpot(TM) 64-Bit Server VM warning: INFO: os::commit_memory(0x00007fa3c43b3000, 12288,
0) failed; error='Cannot allocate memory' (errno=12)
Java HotSpot(TM) 64-Bit Server VM warning: INFO: os::commit_memory(0x00007f7c198db000, 12288,
0) failed; error='Cannot allocate memory' (errno=12)
#
# There is insufficient memory for the Java Runtime Environment to continue.
# There is insufficient memory for the Java Runtime Environment to continue.
# Native memory allocation (mmap) failed to map 12288 bytes for committing reserved memory.
# Native memory allocation (mmap) failed to map 12288 bytes for committing reserved memory.
# An error report file with more information is saved as:
# <https://builds.apache.org/job/beam_PostCommit_Java_PVR_Flink_Batch/ws/src/runners/flink/job-server/hs_err_pid7116.log>
# An error report file with more information is saved as:
# <https://builds.apache.org/job/beam_PostCommit_Java_PVR_Flink_Batch/ws/src/runners/flink/job-server/hs_err_pid7117.log>
Could not stop org.gradle.internal.actor.internal.DefaultActorFactory$NonBlockingActor@3346096c.
org.gradle.internal.dispatch.DispatchException: Could not dispatch message [MethodInvocation
method: stop()].
	at org.gradle.internal.dispatch.ExceptionTrackingFailureHandler.dispatchFailed(ExceptionTrackingFailureHandler.java:34)
	at org.gradle.internal.dispatch.FailureHandlingDispatch.dispatch(FailureHandlingDispatch.java:31)
	at org.gradle.internal.dispatch.AsyncDispatch.dispatchMessages(AsyncDispatch.java:133)
	at org.gradle.internal.dispatch.AsyncDispatch.access$000(AsyncDispatch.java:34)
	at org.gradle.internal.dispatch.AsyncDispatch$1.run(AsyncDispatch.java:73)
	at org.gradle.internal.operations.CurrentBuildOperationPreservingRunnable.run(CurrentBuildOperationPreservingRunnable.java:42)
	at org.gradle.internal.concurrent.ExecutorPolicy$CatchAndRecordFailures.onExecute(ExecutorPolicy.java:63)
	at org.gradle.internal.concurrent.ManagedExecutorImpl$1.run(ManagedExecutorImpl.java:46)
	at java.util.concurrent.ThreadPoolExecutor.runWorker(ThreadPoolExecutor.java:1149)
	at java.util.concurrent.ThreadPoolExecutor$Worker.run(ThreadPoolExecutor.java:624)
	at org.gradle.internal.concurrent.ThreadFactoryImpl$ManagedThreadRunnable.run(ThreadFactoryImpl.java:55)
	at java.lang.Thread.run(Thread.java:748)
Caused by: org.gradle.process.internal.ExecException: Process 'Gradle Test Executor 1' finished
with non-zero exit value 1
This problem might be caused by incorrect test process configuration.
Please refer to the test execution section in the user guide at https://docs.gradle.org/4.10.2/userguide/java_plugin.html#sec:test_execution
	at org.gradle.api.internal.tasks.testing.worker.ForkingTestClassProcessor.stop(ForkingTestClassProcessor.java:155)
	at org.gradle.api.internal.tasks.testing.processors.RestartEveryNTestClassProcessor.endBatch(RestartEveryNTestClassProcessor.java:77)
	at org.gradle.api.internal.tasks.testing.processors.RestartEveryNTestClassProcessor.stop(RestartEveryNTestClassProcessor.java:62)
	at sun.reflect.NativeMethodAccessorImpl.invoke0(Native Method)
	at sun.reflect.NativeMethodAccessorImpl.invoke(NativeMethodAccessorImpl.java:62)
	at sun.reflect.DelegatingMethodAccessorImpl.invoke(DelegatingMethodAccessorImpl.java:43)
	at java.lang.reflect.Method.invoke(Method.java:498)
	at org.gradle.internal.dispatch.ReflectionDispatch.dispatch(ReflectionDispatch.java:35)
	at org.gradle.internal.dispatch.ReflectionDispatch.dispatch(ReflectionDispatch.java:24)
	at org.gradle.internal.dispatch.FailureHandlingDispatch.dispatch(FailureHandlingDispatch.java:29)
	... 10 more

org.apache.beam.sdk.transforms.ViewTest > testMapSideInput SKIPPED

org.apache.beam.sdk.values.PCollectionTupleTest > testComposePCollectionTuple SKIPPED

> Task :beam-runners-flink_2.11-job-server:validatesPortableRunnerBatch FAILED
:beam-runners-flink_2.11-job-server:validatesPortableRunnerBatch (Thread[Task worker for ':'
Thread 2,5,main]) completed. Took 1 hrs 31 mins 45.297 secs.

FAILURE: Build failed with an exception.

* What went wrong:
Execution failed for task ':beam-runners-flink_2.11-job-server:validatesPortableRunnerBatch'.
> Process 'Gradle Test Executor 2' finished with non-zero exit value 1
  This problem might be caused by incorrect test process configuration.
  Please refer to the test execution section in the user guide at https://docs.gradle.org/4.10.2/userguide/java_plugin.html#sec:test_execution

* Try:
Run with --stacktrace option to get the stack trace. Run with --debug option to get more log
output. Run with --scan to get full insights.

* Get more help at https://help.gradle.org

Deprecated Gradle features were used in this build, making it incompatible with Gradle 5.0.
Use '--warning-mode all' to show the individual deprecation warnings.
See https://docs.gradle.org/4.10.2/userguide/command_line_interface.html#sec:command_line_warnings

BUILD FAILED in 1h 35m 17s
75 actionable tasks: 70 executed, 4 from cache, 1 up-to-date

Publishing build scan...
https://gradle.com/s/7m4nzzn5ujg7k

Build step 'Invoke Gradle script' changed build result to FAILURE
Build step 'Invoke Gradle script' marked build as failure

---------------------------------------------------------------------
To unsubscribe, e-mail: builds-unsubscribe@beam.apache.org
For additional commands, e-mail: builds-help@beam.apache.org


Mime
View raw message