beam-builds mailing list archives

Site index · List index
Message view « Date » · « Thread »
Top « Date » · « Thread »
From Apache Jenkins Server <jenk...@builds.apache.org>
Subject Build failed in Jenkins: beam_PostCommit_Python_Verify #6970
Date Wed, 02 Jan 2019 20:30:27 GMT
See <https://builds.apache.org/job/beam_PostCommit_Python_Verify/6970/display/redirect?page=changes>

Changes:

[chamikara] Updates release validating to run LeaderBoard example using Dataflow

------------------------------------------
[...truncated 367.06 KB...]
                      "@type": "FastPrimitivesCoder$eNprYEpOLEhMzkiNT0pNzNVLzk9JLSqGUlxuicUlAUWZuZklmWWpxc4gQa5CBs3GQsbaQqZQ/vi0xJycpMTk7Hiw+kJmPEYFZCZn56RCjWABGsFaW8iWVJykBwDlGS3/",

                      "component_encodings": [], 
                      "pipeline_proto_coder_id": "ref_Coder_FastPrimitivesCoder_3"
                    }, 
                    {
                      "@type": "FastPrimitivesCoder$eNprYEpOLEhMzkiNT0pNzNVLzk9JLSqGUlxuicUlAUWZuZklmWWpxc4gQa5CBs3GQsbaQqZQ/vi0xJycpMTk7Hiw+kJmPEYFZCZn56RCjWABGsFaW8iWVJykBwDlGS3/",

                      "component_encodings": [], 
                      "pipeline_proto_coder_id": "ref_Coder_FastPrimitivesCoder_3"
                    }
                  ], 
                  "is_pair_like": true, 
                  "pipeline_proto_coder_id": "ref_Coder_FastPrimitivesCoder_3"
                }, 
                {
                  "@type": "kind:global_window"
                }
              ], 
              "is_wrapper": true
            }, 
            "output_name": "out", 
            "user_name": "ReadFromPubSub/Map(_from_proto_str).out"
          }
        ], 
        "parallel_input": {
          "@type": "OutputReference", 
          "output_name": "out", 
          "step_name": "s1"
        }, 
        "serialized_fn": "ref_AppliedPTransform_ReadFromPubSub/Map(_from_proto_str)_4", 
        "user_name": "ReadFromPubSub/Map(_from_proto_str)"
      }
    }, 
    {
      "kind": "ParallelDo", 
      "name": "s3", 
      "properties": {
        "display_data": [
          {
            "key": "fn", 
            "label": "Transform Function", 
            "namespace": "apache_beam.transforms.core.CallableWrapperDoFn", 
            "type": "STRING", 
            "value": "add_attribute"
          }, 
          {
            "key": "fn", 
            "label": "Transform Function", 
            "namespace": "apache_beam.transforms.core.ParDo", 
            "shortValue": "CallableWrapperDoFn", 
            "type": "STRING", 
            "value": "apache_beam.transforms.core.CallableWrapperDoFn"
          }
        ], 
        "non_parallel_inputs": {}, 
        "output_info": [
          {
            "encoding": {
              "@type": "kind:windowed_value", 
              "component_encodings": [
                {
                  "@type": "FastPrimitivesCoder$eNprYEpOLEhMzkiNT0pNzNVLzk9JLSqGUlxuicUlAUWZuZklmWWpxc4gQa5CBs3GQsbaQqZQ/vi0xJycpMTk7Hiw+kJmPEYFZCZn56RCjWABGsFaW8iWVJykBwDlGS3/",

                  "component_encodings": [
                    {
                      "@type": "FastPrimitivesCoder$eNprYEpOLEhMzkiNT0pNzNVLzk9JLSqGUlxuicUlAUWZuZklmWWpxc4gQa5CBs3GQsbaQqZQ/vi0xJycpMTk7Hiw+kJmPEYFZCZn56RCjWABGsFaW8iWVJykBwDlGS3/",

                      "component_encodings": [], 
                      "pipeline_proto_coder_id": "ref_Coder_FastPrimitivesCoder_3"
                    }, 
                    {
                      "@type": "FastPrimitivesCoder$eNprYEpOLEhMzkiNT0pNzNVLzk9JLSqGUlxuicUlAUWZuZklmWWpxc4gQa5CBs3GQsbaQqZQ/vi0xJycpMTk7Hiw+kJmPEYFZCZn56RCjWABGsFaW8iWVJykBwDlGS3/",

                      "component_encodings": [], 
                      "pipeline_proto_coder_id": "ref_Coder_FastPrimitivesCoder_3"
                    }
                  ], 
                  "is_pair_like": true, 
                  "pipeline_proto_coder_id": "ref_Coder_FastPrimitivesCoder_3"
                }, 
                {
                  "@type": "kind:global_window"
                }
              ], 
              "is_wrapper": true
            }, 
            "output_name": "out", 
            "user_name": "add_attribute.out"
          }
        ], 
        "parallel_input": {
          "@type": "OutputReference", 
          "output_name": "out", 
          "step_name": "s2"
        }, 
        "serialized_fn": "ref_AppliedPTransform_add_attribute_5", 
        "user_name": "add_attribute"
      }
    }, 
    {
      "kind": "ParallelDo", 
      "name": "s4", 
      "properties": {
        "display_data": [
          {
            "key": "fn", 
            "label": "Transform Function", 
            "namespace": "apache_beam.transforms.core.CallableWrapperDoFn", 
            "type": "STRING", 
            "value": "to_proto_str"
          }, 
          {
            "key": "fn", 
            "label": "Transform Function", 
            "namespace": "apache_beam.transforms.core.ParDo", 
            "shortValue": "CallableWrapperDoFn", 
            "type": "STRING", 
            "value": "apache_beam.transforms.core.CallableWrapperDoFn"
          }
        ], 
        "non_parallel_inputs": {}, 
        "output_info": [
          {
            "encoding": {
              "@type": "kind:windowed_value", 
              "component_encodings": [
                {
                  "@type": "kind:bytes"
                }, 
                {
                  "@type": "kind:global_window"
                }
              ], 
              "is_wrapper": true
            }, 
            "output_name": "out", 
            "user_name": "WriteToPubSub/ToProtobuf.out"
          }
        ], 
        "parallel_input": {
          "@type": "OutputReference", 
          "output_name": "out", 
          "step_name": "s3"
        }, 
        "serialized_fn": "ref_AppliedPTransform_WriteToPubSub/ToProtobuf_7", 
        "user_name": "WriteToPubSub/ToProtobuf"
      }
    }, 
    {
      "kind": "ParallelWrite", 
      "name": "s5", 
      "properties": {
        "display_data": [], 
        "encoding": {
          "@type": "kind:windowed_value", 
          "component_encodings": [
            {
              "@type": "kind:bytes"
            }, 
            {
              "@type": "kind:global_window"
            }
          ], 
          "is_wrapper": true
        }, 
        "format": "pubsub", 
        "parallel_input": {
          "@type": "OutputReference", 
          "output_name": "out", 
          "step_name": "s4"
        }, 
        "pubsub_id_label": "id", 
        "pubsub_serialized_attributes_fn": "", 
        "pubsub_timestamp_label": "timestamp", 
        "pubsub_topic": "projects/apache-beam-testing/topics/psit_topic_outputa261c0ff-6159-4c54-b77f-7117bea94898",

        "user_name": "WriteToPubSub/Write/NativeWrite"
      }
    }
  ], 
  "type": "JOB_TYPE_STREAMING"
}
root: INFO: Create job: <Job
 createTime: u'2019-01-02T20:02:21.397698Z'
 currentStateTime: u'1970-01-01T00:00:00Z'
 id: u'2019-01-02_12_02_20-8390766231968879629'
 location: u'us-central1'
 name: u'beamapp-jenkins-0102200215-090636'
 projectId: u'apache-beam-testing'
 stageStates: []
 startTime: u'2019-01-02T20:02:21.397698Z'
 steps: []
 tempFiles: []
 type: TypeValueValuesEnum(JOB_TYPE_STREAMING, 2)>
root: INFO: Created job with id: [2019-01-02_12_02_20-8390766231968879629]
root: INFO: To access the Dataflow monitoring console, please navigate to https://console.cloud.google.com/dataflow/jobsDetail/locations/us-central1/jobs/2019-01-02_12_02_20-8390766231968879629?project=apache-beam-testing
--------------------- >> end captured logging << ---------------------

----------------------------------------------------------------------
XML: <https://builds.apache.org/job/beam_PostCommit_Python_Verify/ws/src/sdks/python/nosetests.xml>
----------------------------------------------------------------------
Ran 25 tests in 3192.927s

FAILED (errors=1)
Found: https://console.cloud.google.com/dataflow/jobsDetail/locations/us-central1/jobs/2019-01-02_11_37_21-8390314348911615680?project=apache-beam-testing.
Found: https://console.cloud.google.com/dataflow/jobsDetail/locations/us-central1/jobs/2019-01-02_11_44_50-2561948043100560632?project=apache-beam-testing.
Found: https://console.cloud.google.com/dataflow/jobsDetail/locations/us-central1/jobs/2019-01-02_11_53_03-124372952481018879?project=apache-beam-testing.
Found: https://console.cloud.google.com/dataflow/jobsDetail/locations/us-central1/jobs/2019-01-02_12_00_16-11429202310657285902?project=apache-beam-testing.
Found: https://console.cloud.google.com/dataflow/jobsDetail/locations/us-central1/jobs/2019-01-02_12_08_03-5909799802171650450?project=apache-beam-testing.
Found: https://console.cloud.google.com/dataflow/jobsDetail/locations/us-central1/jobs/2019-01-02_12_16_11-9178491457126412128?project=apache-beam-testing.
Found: https://console.cloud.google.com/dataflow/jobsDetail/locations/us-central1/jobs/2019-01-02_12_22_49-10850972248113034257?project=apache-beam-testing.
Found: https://console.cloud.google.com/dataflow/jobsDetail/locations/us-central1/jobs/2019-01-02_11_37_22-6483052741407107849?project=apache-beam-testing.
Found: https://console.cloud.google.com/dataflow/jobsDetail/locations/us-central1/jobs/2019-01-02_11_52_13-6493984109537945364?project=apache-beam-testing.
Found: https://console.cloud.google.com/dataflow/jobsDetail/locations/us-central1/jobs/2019-01-02_11_37_21-9623617068183415598?project=apache-beam-testing.
Found: https://console.cloud.google.com/dataflow/jobsDetail/locations/us-central1/jobs/2019-01-02_11_37_22-8081576918366419287?project=apache-beam-testing.
Found: https://console.cloud.google.com/dataflow/jobsDetail/locations/us-central1/jobs/2019-01-02_11_49_42-12420488986065366590?project=apache-beam-testing.
Found: https://console.cloud.google.com/dataflow/jobsDetail/locations/us-central1/jobs/2019-01-02_11_56_05-16447955357158258038?project=apache-beam-testing.
Found: https://console.cloud.google.com/dataflow/jobsDetail/locations/us-central1/jobs/2019-01-02_12_02_59-16387947411524857049?project=apache-beam-testing.
Found: https://console.cloud.google.com/dataflow/jobsDetail/locations/us-central1/jobs/2019-01-02_11_37_21-9394435774836344255?project=apache-beam-testing.
Found: https://console.cloud.google.com/dataflow/jobsDetail/locations/us-central1/jobs/2019-01-02_11_37_21-11033718341912800631?project=apache-beam-testing.
Found: https://console.cloud.google.com/dataflow/jobsDetail/locations/us-central1/jobs/2019-01-02_11_46_38-5804163849577558111?project=apache-beam-testing.
Found: https://console.cloud.google.com/dataflow/jobsDetail/locations/us-central1/jobs/2019-01-02_11_54_28-15889928190126678658?project=apache-beam-testing.
Found: https://console.cloud.google.com/dataflow/jobsDetail/locations/us-central1/jobs/2019-01-02_11_37_20-12854526818951075712?project=apache-beam-testing.
Found: https://console.cloud.google.com/dataflow/jobsDetail/locations/us-central1/jobs/2019-01-02_11_44_25-7091876062418218294?project=apache-beam-testing.
Found: https://console.cloud.google.com/dataflow/jobsDetail/locations/us-central1/jobs/2019-01-02_11_53_58-5247832804961426440?project=apache-beam-testing.
Found: https://console.cloud.google.com/dataflow/jobsDetail/locations/us-central1/jobs/2019-01-02_12_02_20-8390766231968879629?project=apache-beam-testing.
Found: https://console.cloud.google.com/dataflow/jobsDetail/locations/us-central1/jobs/2019-01-02_11_37_21-15741579706154208267?project=apache-beam-testing.
Found: https://console.cloud.google.com/dataflow/jobsDetail/locations/us-central1/jobs/2019-01-02_11_46_14-5674335332592436195?project=apache-beam-testing.

> Task :beam-sdks-python:postCommitIT FAILED
:beam-sdks-python:postCommitIT (Thread[Task worker for ':',5,main]) completed. Took 53 mins
13.849 secs.

FAILURE: Build failed with an exception.

* Where:
Build file '<https://builds.apache.org/job/beam_PostCommit_Python_Verify/ws/src/sdks/python/build.gradle'>
line: 276

* What went wrong:
Execution failed for task ':beam-sdks-python:postCommitIT'.
> Process 'command 'sh'' finished with non-zero exit value 1

* Try:
Run with --stacktrace option to get the stack trace. Run with --debug option to get more log
output. Run with --scan to get full insights.

* Get more help at https://help.gradle.org

BUILD FAILED in 57m 59s
6 actionable tasks: 6 executed

Publishing build scan...
https://gradle.com/s/roubms2wkswxm

Build step 'Invoke Gradle script' changed build result to FAILURE
Build step 'Invoke Gradle script' marked build as failure

---------------------------------------------------------------------
To unsubscribe, e-mail: builds-unsubscribe@beam.apache.org
For additional commands, e-mail: builds-help@beam.apache.org


Mime
View raw message