beam-builds mailing list archives

Site index · List index
Message view « Date » · « Thread »
Top « Date » · « Thread »
From Apache Jenkins Server <jenk...@builds.apache.org>
Subject Build failed in Jenkins: beam_PreCommit_Python_ValidatesRunner_Flink_Cron #1
Date Wed, 16 Jan 2019 06:02:05 GMT
See <https://builds.apache.org/job/beam_PreCommit_Python_ValidatesRunner_Flink_Cron/1/display/redirect>

------------------------------------------
Started by timer
[EnvInject] - Loading node environment variables.
Building remotely on beam5 (beam) in workspace <https://builds.apache.org/job/beam_PreCommit_Python_ValidatesRunner_Flink_Cron/ws/>
Cloning the remote Git repository
Cloning repository https://github.com/apache/beam.git
 > git init <https://builds.apache.org/job/beam_PreCommit_Python_ValidatesRunner_Flink_Cron/ws/src>
# timeout=10
Fetching upstream changes from https://github.com/apache/beam.git
 > git --version # timeout=10
 > git fetch --tags --progress https://github.com/apache/beam.git +refs/heads/*:refs/remotes/origin/*
 > git config remote.origin.url https://github.com/apache/beam.git # timeout=10
 > git config --add remote.origin.fetch +refs/heads/*:refs/remotes/origin/* # timeout=10
 > git config remote.origin.url https://github.com/apache/beam.git # timeout=10
Fetching upstream changes from https://github.com/apache/beam.git
 > git fetch --tags --progress https://github.com/apache/beam.git +refs/heads/*:refs/remotes/origin/*
+refs/pull/${ghprbPullId}/*:refs/remotes/origin/pr/${ghprbPullId}/*
 > git rev-parse origin/master^{commit} # timeout=10
Checking out Revision be1b166a6c54b1dd9b82d639b0b949dedba1964c (origin/master)
 > git config core.sparsecheckout # timeout=10
 > git checkout -f be1b166a6c54b1dd9b82d639b0b949dedba1964c
Commit message: "Merge pull request #7500: [BEAM-4076] Add antlr4 to beam"
First time build. Skipping changelog.
Cleaning workspace
 > git rev-parse --verify HEAD # timeout=10
Resetting working tree
 > git reset --hard # timeout=10
 > git clean -fdx # timeout=10
[EnvInject] - Executing scripts and injecting environment variables after the SCM step.
[EnvInject] - Injecting as environment variables the properties content 
SPARK_LOCAL_IP=127.0.0.1

[EnvInject] - Variables injected successfully.
[Gradle] - Launching build.
[src] $ <https://builds.apache.org/job/beam_PreCommit_Python_ValidatesRunner_Flink_Cron/ws/src/gradlew>
--continue --max-workers=12 -Dorg.gradle.jvmargs=-Xms2g -Dorg.gradle.jvmargs=-Xmx4g :beam-sdks-python:flinkValidatesRunner
To honour the JVM settings for this build a new JVM will be forked. Please consider using
the daemon: https://docs.gradle.org/4.10.3/userguide/gradle_daemon.html.
Daemon will be stopped at the end of the build stopping after processing
Parallel execution is an incubating feature.
> Task :buildSrc:compileJava NO-SOURCE
> Task :buildSrc:compileGroovy FROM-CACHE
> Task :buildSrc:processResources NO-SOURCE
> Task :buildSrc:classes UP-TO-DATE
> Task :buildSrc:jar
> Task :buildSrc:assemble
> Task :buildSrc:spotlessGroovy
> Task :buildSrc:spotlessGroovyCheck
> Task :buildSrc:spotlessGroovyGradle
> Task :buildSrc:spotlessGroovyGradleCheck
> Task :buildSrc:spotlessCheck
> Task :buildSrc:compileTestJava NO-SOURCE
> Task :buildSrc:compileTestGroovy NO-SOURCE
> Task :buildSrc:processTestResources NO-SOURCE
> Task :buildSrc:testClasses UP-TO-DATE
> Task :buildSrc:test NO-SOURCE
> Task :buildSrc:check
> Task :buildSrc:build
Parallel execution with configuration on demand is an incubating feature.

> Configure project :beam-model-pipeline
applyPortabilityNature with [shadowJarValidationExcludes:[org/apache/beam/model/pipeline/v1/**]]
for project beam-model-pipeline

> Configure project :beam-model-fn-execution
applyPortabilityNature with [shadowJarValidationExcludes:[org/apache/beam/model/fnexecution/v1/**]]
for project beam-model-fn-execution

> Configure project :beam-model-job-management
applyPortabilityNature with [shadowJarValidationExcludes:[org/apache/beam/model/jobmanagement/v1/**]]
for project beam-model-job-management

> Task :beam-runners-core-java:processResources NO-SOURCE
> Task :beam-sdks-java-fn-execution:processResources NO-SOURCE
> Task :beam-runners-java-fn-execution:processResources NO-SOURCE
> Task :beam-sdks-java-extensions-google-cloud-platform-core:processResources NO-SOURCE
> Task :beam-sdks-java-core:generateAvroProtocol NO-SOURCE
> Task :beam-sdks-java-harness:processResources NO-SOURCE
> Task :beam-vendor-sdks-java-extensions-protobuf:processResources NO-SOURCE
> Task :beam-runners-core-construction-java:processResources NO-SOURCE
> Task :beam-runners-flink_2.11-job-server:processResources NO-SOURCE
> Task :beam-runners-flink_2.11:processResources
> Task :beam-sdks-java-core:generateAvroJava NO-SOURCE
> Task :beam-model-fn-execution:extractProto
> Task :beam-model-job-management:extractProto
> Task :beam-model-job-management:processResources
> Task :beam-model-fn-execution:processResources
> Task :beam-sdks-java-core:generateGrammarSource FROM-CACHE
> Task :beam-sdks-java-core:processResources
> Task :beam-model-pipeline:extractIncludeProto
> Task :beam-model-pipeline:extractProto
> Task :beam-model-pipeline:generateProto
> Task :beam-model-pipeline:compileJava FROM-CACHE
> Task :beam-model-pipeline:processResources
> Task :beam-model-pipeline:classes
> Task :beam-model-pipeline:jar
> Task :beam-model-fn-execution:extractIncludeProto
> Task :beam-model-job-management:extractIncludeProto
> Task :beam-model-job-management:generateProto
> Task :beam-model-fn-execution:generateProto
> Task :beam-model-job-management:compileJava FROM-CACHE
> Task :beam-model-job-management:classes
> Task :beam-model-fn-execution:compileJava FROM-CACHE
> Task :beam-model-fn-execution:classes

> Task :beam-sdks-python:setupVirtualenv
New python executable in <https://builds.apache.org/job/beam_PreCommit_Python_ValidatesRunner_Flink_Cron/ws/src/build/gradleenv/1327086738/bin/python2>
Also creating executable in <https://builds.apache.org/job/beam_PreCommit_Python_ValidatesRunner_Flink_Cron/ws/src/build/gradleenv/1327086738/bin/python>
Installing setuptools, pkg_resources, pip, wheel...
> Task :beam-model-pipeline:shadowJar
> Task :beam-model-job-management:shadowJar
> Task :beam-sdks-java-core:compileJava FROM-CACHE
> Task :beam-sdks-java-core:classes
> Task :beam-model-fn-execution:shadowJar

> Task :beam-sdks-python:setupVirtualenv
done.
Running virtualenv with interpreter /usr/bin/python2
Collecting tox==3.0.0
  Using cached https://files.pythonhosted.org/packages/e6/41/4dcfd713282bf3213b0384320fa8841e4db032ddcb80bc08a540159d42a8/tox-3.0.0-py2.py3-none-any.whl
Collecting grpcio-tools==1.3.5
  Using cached https://files.pythonhosted.org/packages/05/f6/0296e29b1bac6f85d2a8556d48adf825307f73109a3c2c17fb734292db0a/grpcio_tools-1.3.5-cp27-cp27mu-manylinux1_x86_64.whl
Collecting pluggy<1.0,>=0.3.0 (from tox==3.0.0)
  Using cached https://files.pythonhosted.org/packages/2d/60/f58d9e8197f911f9405bf7e02227b43a2acc2c2f1a8cbb1be5ecf6bfd0b8/pluggy-0.8.1-py2.py3-none-any.whl
Requirement already satisfied, skipping upgrade: six in /usr/local/lib/python2.7/dist-packages
(from tox==3.0.0) (1.11.0)
Requirement already satisfied, skipping upgrade: virtualenv>=1.11.2 in /usr/lib/python2.7/dist-packages
(from tox==3.0.0) (15.0.1)
Collecting py>=1.4.17 (from tox==3.0.0)
  Using cached https://files.pythonhosted.org/packages/3e/c7/3da685ef117d42ac8d71af525208759742dd235f8094221fdaafcd3dba8f/py-1.7.0-py2.py3-none-any.whl
Collecting grpcio>=1.3.5 (from grpcio-tools==1.3.5)
  Using cached https://files.pythonhosted.org/packages/ab/13/b4f3d8551e0663ad1a6ba8539057ecd0715bcdf3f2eea235f67b248f37cb/grpcio-1.18.0-cp27-cp27mu-manylinux1_x86_64.whl
Collecting protobuf>=3.2.0 (from grpcio-tools==1.3.5)
  Using cached https://files.pythonhosted.org/packages/b8/c2/b7f587c0aaf8bf2201405e8162323037fe8d17aa21d3c7dda811b8d01469/protobuf-3.6.1-cp27-cp27mu-manylinux1_x86_64.whl
Requirement already satisfied, skipping upgrade: enum34>=1.0.4 in /usr/local/lib/python2.7/dist-packages
(from grpcio>=1.3.5->grpcio-tools==1.3.5) (1.1.6)
Collecting futures>=2.2.0 (from grpcio>=1.3.5->grpcio-tools==1.3.5)
  Using cached https://files.pythonhosted.org/packages/2d/99/b2c4e9d5a30f6471e410a146232b4118e697fa3ffc06d6a65efde84debd0/futures-3.2.0-py2-none-any.whl
Requirement already satisfied, skipping upgrade: setuptools in /usr/lib/python2.7/dist-packages
(from protobuf>=3.2.0->grpcio-tools==1.3.5) (33.1.1)
Installing collected packages: pluggy, py, tox, futures, grpcio, protobuf, grpcio-tools
Could not install packages due to an EnvironmentError: [Errno 13] Permission denied: '/usr/local/lib/python2.7/dist-packages/pluggy'
Consider using the `--user` option or check the permissions.


> Task :beam-sdks-python:setupVirtualenv FAILED
> Task :beam-sdks-java-core:shadowJar

> Task :beam-vendor-sdks-java-extensions-protobuf:compileJava
Note: Some input files use or override a deprecated API.
Note: Recompile with -Xlint:deprecation for details.

> Task :beam-vendor-sdks-java-extensions-protobuf:classes

> Task :beam-sdks-java-fn-execution:compileJava
Note: Some input files use or override a deprecated API.
Note: Recompile with -Xlint:deprecation for details.
Note: Some input files use unchecked or unsafe operations.
Note: Recompile with -Xlint:unchecked for details.

> Task :beam-sdks-java-fn-execution:classes

> Task :beam-sdks-java-extensions-google-cloud-platform-core:compileJava
Note: <https://builds.apache.org/job/beam_PreCommit_Python_ValidatesRunner_Flink_Cron/ws/src/sdks/java/extensions/google-cloud-platform-core/src/main/java/org/apache/beam/sdk/util/GcsUtil.java>
uses or overrides a deprecated API.
Note: Recompile with -Xlint:deprecation for details.

> Task :beam-sdks-java-extensions-google-cloud-platform-core:classes
> Task :beam-sdks-java-fn-execution:shadowJar

> Task :beam-runners-core-construction-java:compileJava
Note: Some input files use or override a deprecated API.
Note: Recompile with -Xlint:deprecation for details.
Note: Some input files use unchecked or unsafe operations.
Note: Recompile with -Xlint:unchecked for details.

> Task :beam-runners-core-construction-java:classes
> Task :beam-vendor-sdks-java-extensions-protobuf:shadowJar
> Task :beam-runners-core-construction-java:shadowJar
> Task :beam-sdks-java-extensions-google-cloud-platform-core:shadowJar

> Task :beam-runners-core-java:compileJava
Note: Some input files use or override a deprecated API.
Note: Recompile with -Xlint:deprecation for details.
Note: Some input files use unchecked or unsafe operations.
Note: Recompile with -Xlint:unchecked for details.

> Task :beam-runners-core-java:classes
> Task :beam-runners-core-java:shadowJar

> Task :beam-sdks-java-harness:compileJava
Note: Some input files use or override a deprecated API.
Note: Recompile with -Xlint:deprecation for details.
Note: Some input files use unchecked or unsafe operations.
Note: Recompile with -Xlint:unchecked for details.

> Task :beam-sdks-java-harness:classes
> Task :beam-sdks-java-harness:jar
> Task :beam-sdks-java-harness:shadowJar

> Task :beam-runners-java-fn-execution:compileJava
Note: <https://builds.apache.org/job/beam_PreCommit_Python_ValidatesRunner_Flink_Cron/ws/src/runners/java-fn-execution/src/main/java/org/apache/beam/runners/fnexecution/ServerFactory.java>
uses or overrides a deprecated API.
Note: Recompile with -Xlint:deprecation for details.
Note: Some input files use unchecked or unsafe operations.
Note: Recompile with -Xlint:unchecked for details.

> Task :beam-runners-java-fn-execution:classes
> Task :beam-runners-java-fn-execution:shadowJar

> Task :beam-runners-flink_2.11:compileJava
Note: Some input files use or override a deprecated API.
Note: Recompile with -Xlint:deprecation for details.
Note: Some input files use unchecked or unsafe operations.
Note: Recompile with -Xlint:unchecked for details.

> Task :beam-runners-flink_2.11:classes
> Task :beam-runners-flink_2.11:shadowJar
> Task :beam-runners-flink_2.11-job-server:compileJava NO-SOURCE
> Task :beam-runners-flink_2.11-job-server:classes UP-TO-DATE
> Task :beam-runners-flink_2.11-job-server:shadowJar

FAILURE: Build failed with an exception.

* What went wrong:
Execution failed for task ':beam-sdks-python:setupVirtualenv'.
> Process 'command 'sh'' finished with non-zero exit value 1

* Try:
Run with --stacktrace option to get the stack trace. Run with --info or --debug option to
get more log output. Run with --scan to get full insights.

* Get more help at https://help.gradle.org

Deprecated Gradle features were used in this build, making it incompatible with Gradle 5.0.
Use '--warning-mode all' to show the individual deprecation warnings.
See https://docs.gradle.org/4.10.3/userguide/command_line_interface.html#sec:command_line_warnings

BUILD FAILED in 1m 41s
43 actionable tasks: 38 executed, 5 from cache

Publishing build scan...
https://gradle.com/s/fraju5pv6euxw

Build step 'Invoke Gradle script' changed build result to FAILURE
Build step 'Invoke Gradle script' marked build as failure

---------------------------------------------------------------------
To unsubscribe, e-mail: builds-unsubscribe@beam.apache.org
For additional commands, e-mail: builds-help@beam.apache.org


Mime
View raw message