beam-builds mailing list archives

Site index · List index
Message view « Date » · « Thread »
Top « Date » · « Thread »
From Apache Jenkins Server <jenk...@builds.apache.org>
Subject Build failed in Jenkins: beam_PostCommit_Py_VR_Dataflow #2311
Date Wed, 16 Jan 2019 22:13:29 GMT
See <https://builds.apache.org/job/beam_PostCommit_Py_VR_Dataflow/2311/display/redirect?page=changes>

Changes:

[migryz] Update syncjenkins shema

------------------------------------------
[...truncated 187.61 KB...]
----------------------------------------------------------------------
Traceback (most recent call last):
  File "<https://builds.apache.org/job/beam_PostCommit_Py_VR_Dataflow/ws/src/sdks/python/apache_beam/transforms/sideinputs_test.py",>
line 274, in test_as_list_twice
    pipeline.run()
  File "<https://builds.apache.org/job/beam_PostCommit_Py_VR_Dataflow/ws/src/sdks/python/apache_beam/testing/test_pipeline.py",>
line 107, in run
    else test_runner_api))
  File "<https://builds.apache.org/job/beam_PostCommit_Py_VR_Dataflow/ws/src/sdks/python/apache_beam/pipeline.py",>
line 405, in run
    self._options).run(False)
  File "<https://builds.apache.org/job/beam_PostCommit_Py_VR_Dataflow/ws/src/sdks/python/apache_beam/pipeline.py",>
line 418, in run
    return self.runner.run_pipeline(self, self._options)
  File "<https://builds.apache.org/job/beam_PostCommit_Py_VR_Dataflow/ws/src/sdks/python/apache_beam/runners/dataflow/test_dataflow_runner.py",>
line 53, in run_pipeline
    pipeline, options)
  File "<https://builds.apache.org/job/beam_PostCommit_Py_VR_Dataflow/ws/src/sdks/python/apache_beam/runners/dataflow/dataflow_runner.py",>
line 394, in run_pipeline
    self.dataflow_client.create_job(self.job), self)
  File "<https://builds.apache.org/job/beam_PostCommit_Py_VR_Dataflow/ws/src/sdks/python/apache_beam/utils/retry.py",>
line 184, in wrapper
    return fun(*args, **kwargs)
  File "<https://builds.apache.org/job/beam_PostCommit_Py_VR_Dataflow/ws/src/sdks/python/apache_beam/runners/dataflow/internal/apiclient.py",>
line 504, in create_job
    self.create_job_description(job)
  File "<https://builds.apache.org/job/beam_PostCommit_Py_VR_Dataflow/ws/src/sdks/python/apache_beam/runners/dataflow/internal/apiclient.py",>
line 533, in create_job_description
    resources = self._stage_resources(job.options)
  File "<https://builds.apache.org/job/beam_PostCommit_Py_VR_Dataflow/ws/src/sdks/python/apache_beam/runners/dataflow/internal/apiclient.py",>
line 464, in _stage_resources
    staging_location=google_cloud_options.staging_location)
  File "<https://builds.apache.org/job/beam_PostCommit_Py_VR_Dataflow/ws/src/sdks/python/apache_beam/runners/portability/stager.py",>
line 274, in stage_job_resources
    shutil.rmtree(temp_dir)
  File "/usr/lib/python2.7/shutil.py", line 239, in rmtree
    onerror(os.listdir, path, sys.exc_info())
  File "/usr/lib/python2.7/shutil.py", line 237, in rmtree
    names = os.listdir(path)
OSError: [Errno 2] No such file or directory: '/tmp/tmpdCvKkQ'
-------------------- >> begin captured logging << --------------------
root: DEBUG: Connecting using Google Application Default Credentials.
root: INFO: Starting GCS upload to gs://temp-storage-for-end-to-end-tests/staging-it/beamapp-jenkins-0116215835-621722.1547675915.621910/pipeline.pb...
oauth2client.transport: INFO: Attempting refresh to obtain initial access_token
oauth2client.transport: INFO: Attempting refresh to obtain initial access_token
root: INFO: Completed GCS upload to gs://temp-storage-for-end-to-end-tests/staging-it/beamapp-jenkins-0116215835-621722.1547675915.621910/pipeline.pb
in 0 seconds.
root: INFO: Starting GCS upload to gs://temp-storage-for-end-to-end-tests/staging-it/beamapp-jenkins-0116215835-621722.1547675915.621910/requirements.txt...
root: INFO: Completed GCS upload to gs://temp-storage-for-end-to-end-tests/staging-it/beamapp-jenkins-0116215835-621722.1547675915.621910/requirements.txt
in 0 seconds.
root: INFO: Executing command: ['<https://builds.apache.org/job/beam_PostCommit_Py_VR_Dataflow/ws/src/build/gradleenv/1327086738/bin/python',>
'-m', 'pip', 'download', '--dest', '/tmp/dataflow-requirements-cache', '-r', 'postcommit_requirements.txt',
'--exists-action', 'i', '--no-binary', ':all:']
root: INFO: Starting GCS upload to gs://temp-storage-for-end-to-end-tests/staging-it/beamapp-jenkins-0116215835-621722.1547675915.621910/pbr-4.2.0.tar.gz...
root: INFO: Completed GCS upload to gs://temp-storage-for-end-to-end-tests/staging-it/beamapp-jenkins-0116215835-621722.1547675915.621910/pbr-4.2.0.tar.gz
in 0 seconds.
root: INFO: Starting GCS upload to gs://temp-storage-for-end-to-end-tests/staging-it/beamapp-jenkins-0116215835-621722.1547675915.621910/setuptools-40.0.0.zip...
root: INFO: Completed GCS upload to gs://temp-storage-for-end-to-end-tests/staging-it/beamapp-jenkins-0116215835-621722.1547675915.621910/setuptools-40.0.0.zip
in 0 seconds.
root: INFO: Starting GCS upload to gs://temp-storage-for-end-to-end-tests/staging-it/beamapp-jenkins-0116215835-621722.1547675915.621910/pbr-4.3.0.tar.gz...
root: INFO: Completed GCS upload to gs://temp-storage-for-end-to-end-tests/staging-it/beamapp-jenkins-0116215835-621722.1547675915.621910/pbr-4.3.0.tar.gz
in 0 seconds.
root: INFO: Starting GCS upload to gs://temp-storage-for-end-to-end-tests/staging-it/beamapp-jenkins-0116215835-621722.1547675915.621910/setuptools-40.3.0.zip...
root: INFO: Completed GCS upload to gs://temp-storage-for-end-to-end-tests/staging-it/beamapp-jenkins-0116215835-621722.1547675915.621910/setuptools-40.3.0.zip
in 0 seconds.
root: INFO: Starting GCS upload to gs://temp-storage-for-end-to-end-tests/staging-it/beamapp-jenkins-0116215835-621722.1547675915.621910/setuptools-39.1.0.zip...
root: INFO: Completed GCS upload to gs://temp-storage-for-end-to-end-tests/staging-it/beamapp-jenkins-0116215835-621722.1547675915.621910/setuptools-39.1.0.zip
in 0 seconds.
root: INFO: Starting GCS upload to gs://temp-storage-for-end-to-end-tests/staging-it/beamapp-jenkins-0116215835-621722.1547675915.621910/PyHamcrest-1.9.0.tar.gz...
root: INFO: Completed GCS upload to gs://temp-storage-for-end-to-end-tests/staging-it/beamapp-jenkins-0116215835-621722.1547675915.621910/PyHamcrest-1.9.0.tar.gz
in 0 seconds.
root: INFO: Starting GCS upload to gs://temp-storage-for-end-to-end-tests/staging-it/beamapp-jenkins-0116215835-621722.1547675915.621910/setuptools-40.4.2.zip...
root: INFO: Completed GCS upload to gs://temp-storage-for-end-to-end-tests/staging-it/beamapp-jenkins-0116215835-621722.1547675915.621910/setuptools-40.4.2.zip
in 0 seconds.
root: INFO: Starting GCS upload to gs://temp-storage-for-end-to-end-tests/staging-it/beamapp-jenkins-0116215835-621722.1547675915.621910/pbr-5.1.1.tar.gz...
root: INFO: Completed GCS upload to gs://temp-storage-for-end-to-end-tests/staging-it/beamapp-jenkins-0116215835-621722.1547675915.621910/pbr-5.1.1.tar.gz
in 0 seconds.
root: INFO: Starting GCS upload to gs://temp-storage-for-end-to-end-tests/staging-it/beamapp-jenkins-0116215835-621722.1547675915.621910/setuptools-40.5.0.zip...
root: INFO: Completed GCS upload to gs://temp-storage-for-end-to-end-tests/staging-it/beamapp-jenkins-0116215835-621722.1547675915.621910/setuptools-40.5.0.zip
in 0 seconds.
root: INFO: Starting GCS upload to gs://temp-storage-for-end-to-end-tests/staging-it/beamapp-jenkins-0116215835-621722.1547675915.621910/pbr-4.0.4.tar.gz...
root: INFO: Completed GCS upload to gs://temp-storage-for-end-to-end-tests/staging-it/beamapp-jenkins-0116215835-621722.1547675915.621910/pbr-4.0.4.tar.gz
in 0 seconds.
root: INFO: Starting GCS upload to gs://temp-storage-for-end-to-end-tests/staging-it/beamapp-jenkins-0116215835-621722.1547675915.621910/setuptools-40.4.1.zip...
root: INFO: Completed GCS upload to gs://temp-storage-for-end-to-end-tests/staging-it/beamapp-jenkins-0116215835-621722.1547675915.621910/setuptools-40.4.1.zip
in 0 seconds.
root: INFO: Starting GCS upload to gs://temp-storage-for-end-to-end-tests/staging-it/beamapp-jenkins-0116215835-621722.1547675915.621910/setuptools-40.6.1.zip...
root: INFO: Completed GCS upload to gs://temp-storage-for-end-to-end-tests/staging-it/beamapp-jenkins-0116215835-621722.1547675915.621910/setuptools-40.6.1.zip
in 0 seconds.
root: INFO: Starting GCS upload to gs://temp-storage-for-end-to-end-tests/staging-it/beamapp-jenkins-0116215835-621722.1547675915.621910/pbr-5.1.0.tar.gz...
root: INFO: Completed GCS upload to gs://temp-storage-for-end-to-end-tests/staging-it/beamapp-jenkins-0116215835-621722.1547675915.621910/pbr-5.1.0.tar.gz
in 0 seconds.
root: INFO: Starting GCS upload to gs://temp-storage-for-end-to-end-tests/staging-it/beamapp-jenkins-0116215835-621722.1547675915.621910/setuptools-40.1.0.zip...
root: INFO: Completed GCS upload to gs://temp-storage-for-end-to-end-tests/staging-it/beamapp-jenkins-0116215835-621722.1547675915.621910/setuptools-40.1.0.zip
in 0 seconds.
root: INFO: Starting GCS upload to gs://temp-storage-for-end-to-end-tests/staging-it/beamapp-jenkins-0116215835-621722.1547675915.621910/pbr-4.0.3.tar.gz...
root: INFO: Completed GCS upload to gs://temp-storage-for-end-to-end-tests/staging-it/beamapp-jenkins-0116215835-621722.1547675915.621910/pbr-4.0.3.tar.gz
in 0 seconds.
root: INFO: Starting GCS upload to gs://temp-storage-for-end-to-end-tests/staging-it/beamapp-jenkins-0116215835-621722.1547675915.621910/pbr-4.1.1.tar.gz...
root: INFO: Completed GCS upload to gs://temp-storage-for-end-to-end-tests/staging-it/beamapp-jenkins-0116215835-621722.1547675915.621910/pbr-4.1.1.tar.gz
in 0 seconds.
root: INFO: Starting GCS upload to gs://temp-storage-for-end-to-end-tests/staging-it/beamapp-jenkins-0116215835-621722.1547675915.621910/setuptools-39.2.0.zip...
root: INFO: Completed GCS upload to gs://temp-storage-for-end-to-end-tests/staging-it/beamapp-jenkins-0116215835-621722.1547675915.621910/setuptools-39.2.0.zip
in 0 seconds.
root: INFO: Starting GCS upload to gs://temp-storage-for-end-to-end-tests/staging-it/beamapp-jenkins-0116215835-621722.1547675915.621910/mock-2.0.0.tar.gz...
root: INFO: Completed GCS upload to gs://temp-storage-for-end-to-end-tests/staging-it/beamapp-jenkins-0116215835-621722.1547675915.621910/mock-2.0.0.tar.gz
in 0 seconds.
root: INFO: Starting GCS upload to gs://temp-storage-for-end-to-end-tests/staging-it/beamapp-jenkins-0116215835-621722.1547675915.621910/pbr-5.0.0.tar.gz...
root: INFO: Completed GCS upload to gs://temp-storage-for-end-to-end-tests/staging-it/beamapp-jenkins-0116215835-621722.1547675915.621910/pbr-5.0.0.tar.gz
in 0 seconds.
root: INFO: Starting GCS upload to gs://temp-storage-for-end-to-end-tests/staging-it/beamapp-jenkins-0116215835-621722.1547675915.621910/setuptools-40.6.0.zip...
root: INFO: Completed GCS upload to gs://temp-storage-for-end-to-end-tests/staging-it/beamapp-jenkins-0116215835-621722.1547675915.621910/setuptools-40.6.0.zip
in 0 seconds.
root: INFO: Starting GCS upload to gs://temp-storage-for-end-to-end-tests/staging-it/beamapp-jenkins-0116215835-621722.1547675915.621910/setuptools-40.2.0.zip...
root: INFO: Completed GCS upload to gs://temp-storage-for-end-to-end-tests/staging-it/beamapp-jenkins-0116215835-621722.1547675915.621910/setuptools-40.2.0.zip
in 0 seconds.
root: INFO: Starting GCS upload to gs://temp-storage-for-end-to-end-tests/staging-it/beamapp-jenkins-0116215835-621722.1547675915.621910/six-1.12.0.tar.gz...
root: INFO: Completed GCS upload to gs://temp-storage-for-end-to-end-tests/staging-it/beamapp-jenkins-0116215835-621722.1547675915.621910/six-1.12.0.tar.gz
in 0 seconds.
root: INFO: Starting GCS upload to gs://temp-storage-for-end-to-end-tests/staging-it/beamapp-jenkins-0116215835-621722.1547675915.621910/six-1.11.0.tar.gz...
root: INFO: Completed GCS upload to gs://temp-storage-for-end-to-end-tests/staging-it/beamapp-jenkins-0116215835-621722.1547675915.621910/six-1.11.0.tar.gz
in 0 seconds.
root: INFO: Starting GCS upload to gs://temp-storage-for-end-to-end-tests/staging-it/beamapp-jenkins-0116215835-621722.1547675915.621910/setuptools-40.6.2.zip...
root: INFO: Completed GCS upload to gs://temp-storage-for-end-to-end-tests/staging-it/beamapp-jenkins-0116215835-621722.1547675915.621910/setuptools-40.6.2.zip
in 0 seconds.
root: INFO: Starting GCS upload to gs://temp-storage-for-end-to-end-tests/staging-it/beamapp-jenkins-0116215835-621722.1547675915.621910/setuptools-40.4.3.zip...
root: INFO: Completed GCS upload to gs://temp-storage-for-end-to-end-tests/staging-it/beamapp-jenkins-0116215835-621722.1547675915.621910/setuptools-40.4.3.zip
in 0 seconds.
root: INFO: Starting GCS upload to gs://temp-storage-for-end-to-end-tests/staging-it/beamapp-jenkins-0116215835-621722.1547675915.621910/setuptools-40.6.3.zip...
root: INFO: Completed GCS upload to gs://temp-storage-for-end-to-end-tests/staging-it/beamapp-jenkins-0116215835-621722.1547675915.621910/setuptools-40.6.3.zip
in 0 seconds.
root: INFO: Starting GCS upload to gs://temp-storage-for-end-to-end-tests/staging-it/beamapp-jenkins-0116215835-621722.1547675915.621910/funcsigs-1.0.2.tar.gz...
root: INFO: Completed GCS upload to gs://temp-storage-for-end-to-end-tests/staging-it/beamapp-jenkins-0116215835-621722.1547675915.621910/funcsigs-1.0.2.tar.gz
in 0 seconds.
root: INFO: Starting GCS upload to gs://temp-storage-for-end-to-end-tests/staging-it/beamapp-jenkins-0116215835-621722.1547675915.621910/pbr-4.1.0.tar.gz...
root: INFO: Completed GCS upload to gs://temp-storage-for-end-to-end-tests/staging-it/beamapp-jenkins-0116215835-621722.1547675915.621910/pbr-4.1.0.tar.gz
in 0 seconds.
root: INFO: Copying Beam SDK "build/apache-beam.tar.gz" to staging location.
root: INFO: Starting GCS upload to gs://temp-storage-for-end-to-end-tests/staging-it/beamapp-jenkins-0116215835-621722.1547675915.621910/dataflow_python_sdk.tar...
root: INFO: Completed GCS upload to gs://temp-storage-for-end-to-end-tests/staging-it/beamapp-jenkins-0116215835-621722.1547675915.621910/dataflow_python_sdk.tar
in 0 seconds.
root: INFO: Starting GCS upload to gs://temp-storage-for-end-to-end-tests/staging-it/beamapp-jenkins-0116215835-621722.1547675915.621910/dataflow-worker.jar...
root: INFO: Completed GCS upload to gs://temp-storage-for-end-to-end-tests/staging-it/beamapp-jenkins-0116215835-621722.1547675915.621910/dataflow-worker.jar
in 2 seconds.
--------------------- >> end captured logging << ---------------------

======================================================================
ERROR: test_as_list_and_as_dict_side_inputs (apache_beam.transforms.sideinputs_test.SideInputsTest)
----------------------------------------------------------------------
Traceback (most recent call last):
  File "<https://builds.apache.org/job/beam_PostCommit_Py_VR_Dataflow/ws/src/sdks/python/apache_beam/transforms/sideinputs_test.py",>
line 205, in test_as_list_and_as_dict_side_inputs
    pipeline.run()
  File "<https://builds.apache.org/job/beam_PostCommit_Py_VR_Dataflow/ws/src/sdks/python/apache_beam/testing/test_pipeline.py",>
line 107, in run
    else test_runner_api))
  File "<https://builds.apache.org/job/beam_PostCommit_Py_VR_Dataflow/ws/src/sdks/python/apache_beam/pipeline.py",>
line 405, in run
    self._options).run(False)
  File "<https://builds.apache.org/job/beam_PostCommit_Py_VR_Dataflow/ws/src/sdks/python/apache_beam/pipeline.py",>
line 418, in run
    return self.runner.run_pipeline(self, self._options)
  File "<https://builds.apache.org/job/beam_PostCommit_Py_VR_Dataflow/ws/src/sdks/python/apache_beam/runners/dataflow/test_dataflow_runner.py",>
line 53, in run_pipeline
    pipeline, options)
  File "<https://builds.apache.org/job/beam_PostCommit_Py_VR_Dataflow/ws/src/sdks/python/apache_beam/runners/dataflow/dataflow_runner.py",>
line 394, in run_pipeline
    self.dataflow_client.create_job(self.job), self)
  File "<https://builds.apache.org/job/beam_PostCommit_Py_VR_Dataflow/ws/src/sdks/python/apache_beam/utils/retry.py",>
line 184, in wrapper
    return fun(*args, **kwargs)
  File "<https://builds.apache.org/job/beam_PostCommit_Py_VR_Dataflow/ws/src/sdks/python/apache_beam/runners/dataflow/internal/apiclient.py",>
line 504, in create_job
    self.create_job_description(job)
  File "<https://builds.apache.org/job/beam_PostCommit_Py_VR_Dataflow/ws/src/sdks/python/apache_beam/runners/dataflow/internal/apiclient.py",>
line 533, in create_job_description
    resources = self._stage_resources(job.options)
  File "<https://builds.apache.org/job/beam_PostCommit_Py_VR_Dataflow/ws/src/sdks/python/apache_beam/runners/dataflow/internal/apiclient.py",>
line 464, in _stage_resources
    staging_location=google_cloud_options.staging_location)
  File "<https://builds.apache.org/job/beam_PostCommit_Py_VR_Dataflow/ws/src/sdks/python/apache_beam/runners/portability/stager.py",>
line 274, in stage_job_resources
    shutil.rmtree(temp_dir)
  File "/usr/lib/python2.7/shutil.py", line 239, in rmtree
    onerror(os.listdir, path, sys.exc_info())
  File "/usr/lib/python2.7/shutil.py", line 237, in rmtree
    names = os.listdir(path)
OSError: [Errno 2] No such file or directory: '/tmp/tmpCv55xx'
-------------------- >> begin captured logging << --------------------
root: DEBUG: Connecting using Google Application Default Credentials.
root: INFO: Starting GCS upload to gs://temp-storage-for-end-to-end-tests/staging-it/beamapp-jenkins-0116215835-555731.1547675915.555909/pipeline.pb...
oauth2client.transport: INFO: Attempting refresh to obtain initial access_token
oauth2client.transport: INFO: Attempting refresh to obtain initial access_token
root: INFO: Completed GCS upload to gs://temp-storage-for-end-to-end-tests/staging-it/beamapp-jenkins-0116215835-555731.1547675915.555909/pipeline.pb
in 0 seconds.
root: INFO: Starting GCS upload to gs://temp-storage-for-end-to-end-tests/staging-it/beamapp-jenkins-0116215835-555731.1547675915.555909/requirements.txt...
root: INFO: Completed GCS upload to gs://temp-storage-for-end-to-end-tests/staging-it/beamapp-jenkins-0116215835-555731.1547675915.555909/requirements.txt
in 0 seconds.
root: INFO: Executing command: ['<https://builds.apache.org/job/beam_PostCommit_Py_VR_Dataflow/ws/src/build/gradleenv/1327086738/bin/python',>
'-m', 'pip', 'download', '--dest', '/tmp/dataflow-requirements-cache', '-r', 'postcommit_requirements.txt',
'--exists-action', 'i', '--no-binary', ':all:']
root: INFO: Starting GCS upload to gs://temp-storage-for-end-to-end-tests/staging-it/beamapp-jenkins-0116215835-555731.1547675915.555909/pbr-4.2.0.tar.gz...
root: INFO: Completed GCS upload to gs://temp-storage-for-end-to-end-tests/staging-it/beamapp-jenkins-0116215835-555731.1547675915.555909/pbr-4.2.0.tar.gz
in 0 seconds.
root: INFO: Starting GCS upload to gs://temp-storage-for-end-to-end-tests/staging-it/beamapp-jenkins-0116215835-555731.1547675915.555909/setuptools-40.0.0.zip...
root: INFO: Completed GCS upload to gs://temp-storage-for-end-to-end-tests/staging-it/beamapp-jenkins-0116215835-555731.1547675915.555909/setuptools-40.0.0.zip
in 0 seconds.
root: INFO: Starting GCS upload to gs://temp-storage-for-end-to-end-tests/staging-it/beamapp-jenkins-0116215835-555731.1547675915.555909/pbr-4.3.0.tar.gz...
root: INFO: Completed GCS upload to gs://temp-storage-for-end-to-end-tests/staging-it/beamapp-jenkins-0116215835-555731.1547675915.555909/pbr-4.3.0.tar.gz
in 0 seconds.
root: INFO: Starting GCS upload to gs://temp-storage-for-end-to-end-tests/staging-it/beamapp-jenkins-0116215835-555731.1547675915.555909/setuptools-40.3.0.zip...
root: INFO: Completed GCS upload to gs://temp-storage-for-end-to-end-tests/staging-it/beamapp-jenkins-0116215835-555731.1547675915.555909/setuptools-40.3.0.zip
in 0 seconds.
root: INFO: Starting GCS upload to gs://temp-storage-for-end-to-end-tests/staging-it/beamapp-jenkins-0116215835-555731.1547675915.555909/setuptools-39.1.0.zip...
root: INFO: Completed GCS upload to gs://temp-storage-for-end-to-end-tests/staging-it/beamapp-jenkins-0116215835-555731.1547675915.555909/setuptools-39.1.0.zip
in 0 seconds.
root: INFO: Starting GCS upload to gs://temp-storage-for-end-to-end-tests/staging-it/beamapp-jenkins-0116215835-555731.1547675915.555909/PyHamcrest-1.9.0.tar.gz...
root: INFO: Completed GCS upload to gs://temp-storage-for-end-to-end-tests/staging-it/beamapp-jenkins-0116215835-555731.1547675915.555909/PyHamcrest-1.9.0.tar.gz
in 0 seconds.
root: INFO: Starting GCS upload to gs://temp-storage-for-end-to-end-tests/staging-it/beamapp-jenkins-0116215835-555731.1547675915.555909/setuptools-40.4.2.zip...
root: INFO: Completed GCS upload to gs://temp-storage-for-end-to-end-tests/staging-it/beamapp-jenkins-0116215835-555731.1547675915.555909/setuptools-40.4.2.zip
in 0 seconds.
root: INFO: Starting GCS upload to gs://temp-storage-for-end-to-end-tests/staging-it/beamapp-jenkins-0116215835-555731.1547675915.555909/pbr-5.1.1.tar.gz...
root: INFO: Completed GCS upload to gs://temp-storage-for-end-to-end-tests/staging-it/beamapp-jenkins-0116215835-555731.1547675915.555909/pbr-5.1.1.tar.gz
in 0 seconds.
root: INFO: Starting GCS upload to gs://temp-storage-for-end-to-end-tests/staging-it/beamapp-jenkins-0116215835-555731.1547675915.555909/setuptools-40.5.0.zip...
root: INFO: Completed GCS upload to gs://temp-storage-for-end-to-end-tests/staging-it/beamapp-jenkins-0116215835-555731.1547675915.555909/setuptools-40.5.0.zip
in 0 seconds.
root: INFO: Starting GCS upload to gs://temp-storage-for-end-to-end-tests/staging-it/beamapp-jenkins-0116215835-555731.1547675915.555909/pbr-4.0.4.tar.gz...
root: INFO: Completed GCS upload to gs://temp-storage-for-end-to-end-tests/staging-it/beamapp-jenkins-0116215835-555731.1547675915.555909/pbr-4.0.4.tar.gz
in 0 seconds.
root: INFO: Starting GCS upload to gs://temp-storage-for-end-to-end-tests/staging-it/beamapp-jenkins-0116215835-555731.1547675915.555909/setuptools-40.4.1.zip...
root: INFO: Completed GCS upload to gs://temp-storage-for-end-to-end-tests/staging-it/beamapp-jenkins-0116215835-555731.1547675915.555909/setuptools-40.4.1.zip
in 0 seconds.
root: INFO: Starting GCS upload to gs://temp-storage-for-end-to-end-tests/staging-it/beamapp-jenkins-0116215835-555731.1547675915.555909/setuptools-40.6.1.zip...
root: INFO: Completed GCS upload to gs://temp-storage-for-end-to-end-tests/staging-it/beamapp-jenkins-0116215835-555731.1547675915.555909/setuptools-40.6.1.zip
in 0 seconds.
root: INFO: Starting GCS upload to gs://temp-storage-for-end-to-end-tests/staging-it/beamapp-jenkins-0116215835-555731.1547675915.555909/pbr-5.1.0.tar.gz...
root: INFO: Completed GCS upload to gs://temp-storage-for-end-to-end-tests/staging-it/beamapp-jenkins-0116215835-555731.1547675915.555909/pbr-5.1.0.tar.gz
in 0 seconds.
root: INFO: Starting GCS upload to gs://temp-storage-for-end-to-end-tests/staging-it/beamapp-jenkins-0116215835-555731.1547675915.555909/setuptools-40.1.0.zip...
root: INFO: Completed GCS upload to gs://temp-storage-for-end-to-end-tests/staging-it/beamapp-jenkins-0116215835-555731.1547675915.555909/setuptools-40.1.0.zip
in 0 seconds.
root: INFO: Starting GCS upload to gs://temp-storage-for-end-to-end-tests/staging-it/beamapp-jenkins-0116215835-555731.1547675915.555909/pbr-4.0.3.tar.gz...
root: INFO: Completed GCS upload to gs://temp-storage-for-end-to-end-tests/staging-it/beamapp-jenkins-0116215835-555731.1547675915.555909/pbr-4.0.3.tar.gz
in 0 seconds.
root: INFO: Starting GCS upload to gs://temp-storage-for-end-to-end-tests/staging-it/beamapp-jenkins-0116215835-555731.1547675915.555909/pbr-4.1.1.tar.gz...
root: INFO: Completed GCS upload to gs://temp-storage-for-end-to-end-tests/staging-it/beamapp-jenkins-0116215835-555731.1547675915.555909/pbr-4.1.1.tar.gz
in 0 seconds.
root: INFO: Starting GCS upload to gs://temp-storage-for-end-to-end-tests/staging-it/beamapp-jenkins-0116215835-555731.1547675915.555909/setuptools-39.2.0.zip...
root: INFO: Completed GCS upload to gs://temp-storage-for-end-to-end-tests/staging-it/beamapp-jenkins-0116215835-555731.1547675915.555909/setuptools-39.2.0.zip
in 0 seconds.
root: INFO: Starting GCS upload to gs://temp-storage-for-end-to-end-tests/staging-it/beamapp-jenkins-0116215835-555731.1547675915.555909/mock-2.0.0.tar.gz...
root: INFO: Completed GCS upload to gs://temp-storage-for-end-to-end-tests/staging-it/beamapp-jenkins-0116215835-555731.1547675915.555909/mock-2.0.0.tar.gz
in 0 seconds.
root: INFO: Starting GCS upload to gs://temp-storage-for-end-to-end-tests/staging-it/beamapp-jenkins-0116215835-555731.1547675915.555909/pbr-5.0.0.tar.gz...
root: INFO: Completed GCS upload to gs://temp-storage-for-end-to-end-tests/staging-it/beamapp-jenkins-0116215835-555731.1547675915.555909/pbr-5.0.0.tar.gz
in 0 seconds.
root: INFO: Starting GCS upload to gs://temp-storage-for-end-to-end-tests/staging-it/beamapp-jenkins-0116215835-555731.1547675915.555909/setuptools-40.6.0.zip...
root: INFO: Completed GCS upload to gs://temp-storage-for-end-to-end-tests/staging-it/beamapp-jenkins-0116215835-555731.1547675915.555909/setuptools-40.6.0.zip
in 0 seconds.
root: INFO: Starting GCS upload to gs://temp-storage-for-end-to-end-tests/staging-it/beamapp-jenkins-0116215835-555731.1547675915.555909/setuptools-40.2.0.zip...
root: INFO: Completed GCS upload to gs://temp-storage-for-end-to-end-tests/staging-it/beamapp-jenkins-0116215835-555731.1547675915.555909/setuptools-40.2.0.zip
in 0 seconds.
root: INFO: Starting GCS upload to gs://temp-storage-for-end-to-end-tests/staging-it/beamapp-jenkins-0116215835-555731.1547675915.555909/six-1.12.0.tar.gz...
root: INFO: Completed GCS upload to gs://temp-storage-for-end-to-end-tests/staging-it/beamapp-jenkins-0116215835-555731.1547675915.555909/six-1.12.0.tar.gz
in 0 seconds.
root: INFO: Starting GCS upload to gs://temp-storage-for-end-to-end-tests/staging-it/beamapp-jenkins-0116215835-555731.1547675915.555909/six-1.11.0.tar.gz...
root: INFO: Completed GCS upload to gs://temp-storage-for-end-to-end-tests/staging-it/beamapp-jenkins-0116215835-555731.1547675915.555909/six-1.11.0.tar.gz
in 0 seconds.
root: INFO: Starting GCS upload to gs://temp-storage-for-end-to-end-tests/staging-it/beamapp-jenkins-0116215835-555731.1547675915.555909/setuptools-40.6.2.zip...
root: INFO: Completed GCS upload to gs://temp-storage-for-end-to-end-tests/staging-it/beamapp-jenkins-0116215835-555731.1547675915.555909/setuptools-40.6.2.zip
in 0 seconds.
root: INFO: Starting GCS upload to gs://temp-storage-for-end-to-end-tests/staging-it/beamapp-jenkins-0116215835-555731.1547675915.555909/setuptools-40.4.3.zip...
root: INFO: Completed GCS upload to gs://temp-storage-for-end-to-end-tests/staging-it/beamapp-jenkins-0116215835-555731.1547675915.555909/setuptools-40.4.3.zip
in 0 seconds.
root: INFO: Starting GCS upload to gs://temp-storage-for-end-to-end-tests/staging-it/beamapp-jenkins-0116215835-555731.1547675915.555909/setuptools-40.6.3.zip...
root: INFO: Completed GCS upload to gs://temp-storage-for-end-to-end-tests/staging-it/beamapp-jenkins-0116215835-555731.1547675915.555909/setuptools-40.6.3.zip
in 0 seconds.
root: INFO: Starting GCS upload to gs://temp-storage-for-end-to-end-tests/staging-it/beamapp-jenkins-0116215835-555731.1547675915.555909/funcsigs-1.0.2.tar.gz...
root: INFO: Completed GCS upload to gs://temp-storage-for-end-to-end-tests/staging-it/beamapp-jenkins-0116215835-555731.1547675915.555909/funcsigs-1.0.2.tar.gz
in 0 seconds.
root: INFO: Starting GCS upload to gs://temp-storage-for-end-to-end-tests/staging-it/beamapp-jenkins-0116215835-555731.1547675915.555909/pbr-4.1.0.tar.gz...
root: INFO: Completed GCS upload to gs://temp-storage-for-end-to-end-tests/staging-it/beamapp-jenkins-0116215835-555731.1547675915.555909/pbr-4.1.0.tar.gz
in 0 seconds.
root: INFO: Copying Beam SDK "build/apache-beam.tar.gz" to staging location.
root: INFO: Starting GCS upload to gs://temp-storage-for-end-to-end-tests/staging-it/beamapp-jenkins-0116215835-555731.1547675915.555909/dataflow_python_sdk.tar...
root: INFO: Completed GCS upload to gs://temp-storage-for-end-to-end-tests/staging-it/beamapp-jenkins-0116215835-555731.1547675915.555909/dataflow_python_sdk.tar
in 0 seconds.
root: INFO: Starting GCS upload to gs://temp-storage-for-end-to-end-tests/staging-it/beamapp-jenkins-0116215835-555731.1547675915.555909/dataflow-worker.jar...
root: INFO: Completed GCS upload to gs://temp-storage-for-end-to-end-tests/staging-it/beamapp-jenkins-0116215835-555731.1547675915.555909/dataflow-worker.jar
in 3 seconds.
--------------------- >> end captured logging << ---------------------

----------------------------------------------------------------------
XML: <https://builds.apache.org/job/beam_PostCommit_Py_VR_Dataflow/ws/src/sdks/python/nosetests.xml>
----------------------------------------------------------------------
Ran 14 tests in 893.323s

FAILED (errors=4)
Found: https://console.cloud.google.com/dataflow/jobsDetail/locations/us-central1/jobs/2019-01-16_13_59_01-11991829003629907249?project=apache-beam-testing.
Found: https://console.cloud.google.com/dataflow/jobsDetail/locations/us-central1/jobs/2019-01-16_14_06_05-10944986900377578358?project=apache-beam-testing.
Found: https://console.cloud.google.com/dataflow/jobsDetail/locations/us-central1/jobs/2019-01-16_13_58_49-1951573837785247559?project=apache-beam-testing.
Found: https://console.cloud.google.com/dataflow/jobsDetail/locations/us-central1/jobs/2019-01-16_13_58_48-12053700857252458295?project=apache-beam-testing.
Found: https://console.cloud.google.com/dataflow/jobsDetail/locations/us-central1/jobs/2019-01-16_14_06_04-12022720115345795448?project=apache-beam-testing.
Found: https://console.cloud.google.com/dataflow/jobsDetail/locations/us-central1/jobs/2019-01-16_13_58_49-4442649273329232308?project=apache-beam-testing.
Found: https://console.cloud.google.com/dataflow/jobsDetail/locations/us-central1/jobs/2019-01-16_13_59_01-17982694098009976843?project=apache-beam-testing.
Found: https://console.cloud.google.com/dataflow/jobsDetail/locations/us-central1/jobs/2019-01-16_13_58_49-15391058709923125548?project=apache-beam-testing.
Found: https://console.cloud.google.com/dataflow/jobsDetail/locations/us-central1/jobs/2019-01-16_13_59_01-7054233680728362043?project=apache-beam-testing.
Found: https://console.cloud.google.com/dataflow/jobsDetail/locations/us-central1/jobs/2019-01-16_13_59_01-10277680390681753892?project=apache-beam-testing.

> Task :beam-sdks-python:validatesRunnerStreamingTests FAILED

FAILURE: Build failed with an exception.

* Where:
Build file '<https://builds.apache.org/job/beam_PostCommit_Py_VR_Dataflow/ws/src/sdks/python/build.gradle'>
line: 306

* What went wrong:
Execution failed for task ':beam-sdks-python:validatesRunnerStreamingTests'.
> Process 'command 'sh'' finished with non-zero exit value 1

* Try:
Run with --stacktrace option to get the stack trace. Run with --info or --debug option to
get more log output. Run with --scan to get full insights.

* Get more help at https://help.gradle.org

Deprecated Gradle features were used in this build, making it incompatible with Gradle 5.0.
Use '--warning-mode all' to show the individual deprecation warnings.
See https://docs.gradle.org/4.10.3/userguide/command_line_interface.html#sec:command_line_warnings

BUILD FAILED in 30m 49s
61 actionable tasks: 55 executed, 6 from cache

Publishing build scan...
https://gradle.com/s/xtcvj3o3hxaug

Build step 'Invoke Gradle script' changed build result to FAILURE
Build step 'Invoke Gradle script' marked build as failure

---------------------------------------------------------------------
To unsubscribe, e-mail: builds-unsubscribe@beam.apache.org
For additional commands, e-mail: builds-help@beam.apache.org


Mime
View raw message