beam-builds mailing list archives

Site index · List index
Message view « Date » · « Thread »
Top « Date » · « Thread »
From Apache Jenkins Server <jenk...@builds.apache.org>
Subject Build failed in Jenkins: beam_PreCommit_Java_Cron #789
Date Sat, 05 Jan 2019 18:19:20 GMT
See <https://builds.apache.org/job/beam_PreCommit_Java_Cron/789/display/redirect>

------------------------------------------
[...truncated 834.74 KB...]
         ^
<https://builds.apache.org/job/beam_PreCommit_Java_Cron/ws/src/sdks/java/fn-execution/src/main/java/org/apache/beam/sdk/fn/splittabledofn/RestrictionTrackers.java>:34:
warning: no @param for position
    void onClaimFailed(PositionT position);
         ^

> Task :beam-sdks-java-core:javadoc
100 warnings

> Task :beam-sdks-java-extensions-kryo:compileTestJava
> Task :beam-sdks-java-extensions-kryo:testClasses
> Task :beam-sdks-java-extensions-kryo:packageTests
> Task :beam-sdks-java-extensions-kryo:assemble
> Task :beam-sdks-java-extensions-kryo:checkstyleTest
> Task :beam-sdks-java-io-hadoop-common:compileTestJava
> Task :beam-sdks-java-io-hadoop-common:testClasses
> Task :beam-sdks-java-io-hadoop-common:packageTests
> Task :beam-sdks-java-io-hadoop-common:assemble
> Task :beam-sdks-java-io-hadoop-common:checkstyleMain
> Task :beam-sdks-java-io-hadoop-common:checkstyleTest
> Task :beam-vendor-sdks-java-extensions-protobuf:findbugsMain
> Task :beam-vendor-sdks-java-extensions-protobuf:javadoc NO-SOURCE
> Task :beam-vendor-sdks-java-extensions-protobuf:test NO-SOURCE
> Task :beam-vendor-sdks-java-extensions-protobuf:validateShadedJarDoesntLeakNonProjectClasses
> Task :beam-vendor-sdks-java-extensions-protobuf:check
> Task :beam-vendor-sdks-java-extensions-protobuf:build
> Task :beam-sdks-java-extensions-kryo:test
> Task :beam-sdks-java-extensions-kryo:check
> Task :beam-sdks-java-extensions-kryo:build
> Task :beam-runners-direct-java:findbugsMain
> Task :beam-sdks-java-extensions-euphoria:compileTestJava
> Task :beam-sdks-java-extensions-sql-jdbc:shadowJarTest
> Task :beam-sdks-java-extensions-sql-jdbc:preCommit
> Task :beam-sdks-java-io-hadoop-common:findbugsMain

> Task :beam-sdks-java-extensions-euphoria:compileTestJava
Note: Some input files use unchecked or unsafe operations.
Note: Recompile with -Xlint:unchecked for details.

> Task :beam-sdks-java-fn-execution:test
> Task :beam-sdks-java-extensions-euphoria:testClasses
> Task :beam-sdks-java-extensions-euphoria:packageTests
> Task :beam-sdks-java-extensions-euphoria:assemble
> Task :beam-sdks-java-fn-execution:validateShadedJarDoesntLeakNonProjectClasses
> Task :beam-sdks-java-fn-execution:check
> Task :beam-sdks-java-fn-execution:build
> Task :beam-sdks-java-extensions-euphoria:checkstyleTest

> Task :beam-sdks-java-io-hadoop-common:javadoc
<https://builds.apache.org/job/beam_PreCommit_Java_Cron/ws/src/sdks/java/io/hadoop-common/src/main/java/org/apache/beam/sdk/io/hadoop/SerializableConfiguration.java>:73:
warning: no @param for conf
  public static Job newJob(@Nullable SerializableConfiguration conf) throws IOException {
                    ^
<https://builds.apache.org/job/beam_PreCommit_Java_Cron/ws/src/sdks/java/io/hadoop-common/src/main/java/org/apache/beam/sdk/io/hadoop/SerializableConfiguration.java>:73:
warning: no @return
  public static Job newJob(@Nullable SerializableConfiguration conf) throws IOException {
                    ^
<https://builds.apache.org/job/beam_PreCommit_Java_Cron/ws/src/sdks/java/io/hadoop-common/src/main/java/org/apache/beam/sdk/io/hadoop/SerializableConfiguration.java>:73:
warning: no @throws for java.io.IOException
  public static Job newJob(@Nullable SerializableConfiguration conf) throws IOException {
                    ^
<https://builds.apache.org/job/beam_PreCommit_Java_Cron/ws/src/sdks/java/io/hadoop-common/src/main/java/org/apache/beam/sdk/io/hadoop/SerializableConfiguration.java>:87:
warning: no @param for conf
  public static Configuration newConfiguration(@Nullable SerializableConfiguration conf) {
                              ^
<https://builds.apache.org/job/beam_PreCommit_Java_Cron/ws/src/sdks/java/io/hadoop-common/src/main/java/org/apache/beam/sdk/io/hadoop/SerializableConfiguration.java>:87:
warning: no @return
  public static Configuration newConfiguration(@Nullable SerializableConfiguration conf) {
                              ^
<https://builds.apache.org/job/beam_PreCommit_Java_Cron/ws/src/sdks/java/io/hadoop-common/src/main/java/org/apache/beam/sdk/io/hadoop/WritableCoder.java>:61:
warning: no @param for clazz
  public static <T extends Writable> WritableCoder<T> of(Class<T> clazz)
{
                                                      ^
<https://builds.apache.org/job/beam_PreCommit_Java_Cron/ws/src/sdks/java/io/hadoop-common/src/main/java/org/apache/beam/sdk/io/hadoop/WritableCoder.java>:61:
warning: no @return
  public static <T extends Writable> WritableCoder<T> of(Class<T> clazz)
{
                                                      ^
<https://builds.apache.org/job/beam_PreCommit_Java_Cron/ws/src/sdks/java/io/hadoop-common/src/main/java/org/apache/beam/sdk/io/hadoop/WritableCoder.java>:130:
warning: no @return
  public static CoderProvider getCoderProvider() {
                              ^
8 warnings

> Task :beam-runners-direct-java:javadoc
<https://builds.apache.org/job/beam_PreCommit_Java_Cron/ws/src/runners/direct-java/src/main/java/org/apache/beam/runners/direct/Clock.java>:28:
warning: no @return
  Instant now();
          ^
<https://builds.apache.org/job/beam_PreCommit_Java_Cron/ws/src/runners/direct-java/src/main/java/org/apache/beam/runners/direct/DirectRunner.java>:135:
warning: no @param for options
  public static DirectRunner fromOptions(PipelineOptions options) {
                             ^
<https://builds.apache.org/job/beam_PreCommit_Java_Cron/ws/src/runners/direct-java/src/main/java/org/apache/beam/runners/direct/DirectRunner.java>:135:
warning: no @return
  public static DirectRunner fromOptions(PipelineOptions options) {
                             ^
<https://builds.apache.org/job/beam_PreCommit_Java_Cron/ws/src/runners/direct-java/src/main/java/org/apache/beam/runners/direct/WatermarkManager.java>:841:
warning: no @param for <ExecutableT>
      WatermarkManager<ExecutableT, ? super CollectionT> create(
                                                         ^
<https://builds.apache.org/job/beam_PreCommit_Java_Cron/ws/src/runners/direct-java/src/main/java/org/apache/beam/runners/direct/WatermarkManager.java>:841:
warning: no @param for <CollectionT>
      WatermarkManager<ExecutableT, ? super CollectionT> create(
                                                         ^
<https://builds.apache.org/job/beam_PreCommit_Java_Cron/ws/src/runners/direct-java/src/main/java/org/apache/beam/runners/direct/WatermarkManager.java>:841:
warning: no @return
      WatermarkManager<ExecutableT, ? super CollectionT> create(
                                                         ^
<https://builds.apache.org/job/beam_PreCommit_Java_Cron/ws/src/runners/direct-java/src/main/java/org/apache/beam/runners/direct/WatermarkManager.java>:941:
warning: no @param for executable
  public TransformWatermarks getWatermarks(ExecutableT executable) {
                             ^
<https://builds.apache.org/job/beam_PreCommit_Java_Cron/ws/src/runners/direct-java/src/main/java/org/apache/beam/runners/direct/WatermarkManager.java>:1140:
warning: no @return
  public Collection<FiredTimers<ExecutableT>> extractFiredTimers() {
                                              ^
<https://builds.apache.org/job/beam_PreCommit_Java_Cron/ws/src/runners/direct-java/src/main/java/org/apache/beam/runners/direct/WatermarkManager.java>:1575:
warning: no @return
    public Collection<TimerData> getTimers() {
                                 ^
<https://builds.apache.org/job/beam_PreCommit_Java_Cron/ws/src/runners/direct-java/src/main/java/org/apache/beam/runners/direct/WatermarkManager.java>:1408:
warning: no @return
    public static TimerUpdate empty() {
                              ^
<https://builds.apache.org/job/beam_PreCommit_Java_Cron/ws/src/runners/direct-java/src/main/java/org/apache/beam/runners/direct/WatermarkManager.java>:1417:
warning: no @param for key
    public static TimerUpdateBuilder builder(StructuralKey<?> key) {
                                     ^
<https://builds.apache.org/job/beam_PreCommit_Java_Cron/ws/src/runners/direct-java/src/main/java/org/apache/beam/runners/direct/WatermarkManager.java>:1417:
warning: no @return
    public static TimerUpdateBuilder builder(StructuralKey<?> key) {
                                     ^
<https://builds.apache.org/job/beam_PreCommit_Java_Cron/ws/src/runners/direct-java/src/main/java/org/apache/beam/runners/direct/WatermarkManager.java>:1518:
warning: no @param for completedTimers
    public TimerUpdate withCompletedTimers(Iterable<TimerData> completedTimers) {
                       ^
<https://builds.apache.org/job/beam_PreCommit_Java_Cron/ws/src/runners/direct-java/src/main/java/org/apache/beam/runners/direct/WatermarkManager.java>:1518:
warning: no @return
    public TimerUpdate withCompletedTimers(Iterable<TimerData> completedTimers) {
                       ^
<https://builds.apache.org/job/beam_PreCommit_Java_Cron/ws/src/runners/direct-java/src/main/java/org/apache/beam/runners/direct/WatermarkManager.java>:1441:
warning: no @param for completedTimers
      public TimerUpdateBuilder withCompletedTimers(Iterable<TimerData> completedTimers)
{
                                ^
<https://builds.apache.org/job/beam_PreCommit_Java_Cron/ws/src/runners/direct-java/src/main/java/org/apache/beam/runners/direct/WatermarkManager.java>:1441:
warning: no @return
      public TimerUpdateBuilder withCompletedTimers(Iterable<TimerData> completedTimers)
{
                                ^
<https://builds.apache.org/job/beam_PreCommit_Java_Cron/ws/src/runners/direct-java/src/main/java/org/apache/beam/runners/direct/WatermarkManager.java>:1450:
warning: no @param for setTimer
      public TimerUpdateBuilder setTimer(TimerData setTimer) {
                                ^
<https://builds.apache.org/job/beam_PreCommit_Java_Cron/ws/src/runners/direct-java/src/main/java/org/apache/beam/runners/direct/WatermarkManager.java>:1450:
warning: no @return
      public TimerUpdateBuilder setTimer(TimerData setTimer) {
                                ^
<https://builds.apache.org/job/beam_PreCommit_Java_Cron/ws/src/runners/direct-java/src/main/java/org/apache/beam/runners/direct/WatermarkManager.java>:1465:
warning: no @param for deletedTimer
      public TimerUpdateBuilder deletedTimer(TimerData deletedTimer) {
                                ^
<https://builds.apache.org/job/beam_PreCommit_Java_Cron/ws/src/runners/direct-java/src/main/java/org/apache/beam/runners/direct/WatermarkManager.java>:1465:
warning: no @return
      public TimerUpdateBuilder deletedTimer(TimerData deletedTimer) {
                                ^
<https://builds.apache.org/job/beam_PreCommit_Java_Cron/ws/src/runners/direct-java/src/main/java/org/apache/beam/runners/direct/WatermarkManager.java>:1475:
warning: no @return
      public TimerUpdate build() {
                         ^
<https://builds.apache.org/job/beam_PreCommit_Java_Cron/ws/src/runners/direct-java/src/main/java/org/apache/beam/runners/direct/WatermarkManager.java>:1282:
warning: no @return
    public Instant getInputWatermark() {
                   ^
<https://builds.apache.org/job/beam_PreCommit_Java_Cron/ws/src/runners/direct-java/src/main/java/org/apache/beam/runners/direct/WatermarkManager.java>:1287:
warning: no @return
    public Instant getOutputWatermark() {
                   ^
<https://builds.apache.org/job/beam_PreCommit_Java_Cron/ws/src/runners/direct-java/src/main/java/org/apache/beam/runners/direct/WatermarkManager.java>:1297:
warning: no @return
    public synchronized Instant getSynchronizedProcessingInputTime() {
                                ^
<https://builds.apache.org/job/beam_PreCommit_Java_Cron/ws/src/runners/direct-java/src/main/java/org/apache/beam/runners/direct/WatermarkManager.java>:1311:
warning: no @return
    public synchronized Instant getSynchronizedProcessingOutputTime() {
                                ^
25 warnings

> Task :beam-sdks-java-javadoc:allJavadoc
> Task :beam-sdks-java-io-hadoop-common:test
> Task :beam-sdks-java-io-hadoop-common:validateShadedJarDoesntLeakNonProjectClasses
> Task :beam-sdks-java-io-hadoop-common:check
> Task :beam-sdks-java-io-hadoop-common:build
> Task :beam-sdks-java-core:test
> Task :beam-sdks-java-extensions-euphoria:test
> Task :beam-sdks-java-extensions-euphoria:check
> Task :beam-sdks-java-extensions-euphoria:build
> Task :beam-sdks-java-extensions-euphoria:buildDependents
> Task :beam-sdks-java-extensions-kryo:buildDependents
> Task :beam-runners-direct-java:test
> Task :beam-sdks-java-io-hbase:check
> Task :beam-sdks-java-io-hbase:build
> Task :beam-sdks-java-io-hbase:buildDependents
> Task :beam-sdks-java-io-hadoop-common:buildDependents
> Task :beam-runners-direct-java:validateShadedJarDoesntLeakNonProjectClasses
> Task :beam-runners-direct-java:check
> Task :beam-runners-direct-java:build
> Task :beam-sdks-java-core:validateShadedJarDoesntLeakNonProjectClasses
> Task :beam-sdks-java-core:check
> Task :beam-sdks-java-core:build
> Task :beam-sdks-java-core:buildNeeded
> Task :beam-sdks-java-nexmark:shadowJar
> Task :beam-sdks-java-nexmark:validateShadedJarDoesntLeakNonProjectClasses
> Task :beam-sdks-java-nexmark:check
> Task :beam-sdks-java-nexmark:build
> Task :beam-sdks-java-nexmark:buildDependents
> Task :beam-sdks-java-extensions-sql:buildDependents
> Task :beam-sdks-java-test-utils:buildDependents
> Task :beam-sdks-java-io-kafka:buildDependents
> Task :beam-sdks-java-extensions-join-library:buildDependents

FAILURE: Build completed with 4 failures.

1: Task failed with an exception.
-----------
* What went wrong:
Execution failed for task ':beam-sdks-java-io-hadoop-file-system:test'.
> Process 'Gradle Test Executor 91' finished with non-zero exit value 1
  This problem might be caused by incorrect test process configuration.
  Please refer to the test execution section in the user guide at https://docs.gradle.org/4.10.3/userguide/java_plugin.html#sec:test_execution

* Try:
Run with --stacktrace option to get the stack trace. Run with --info or --debug option to
get more log output. Run with --scan to get full insights.
==============================================================================

2: Task failed with an exception.
-----------
* What went wrong:
Execution failed for task ':beam-runners-flink-1.6:test'.
> Process 'Gradle Test Executor 85' finished with non-zero exit value 137
  This problem might be caused by incorrect test process configuration.
  Please refer to the test execution section in the user guide at https://docs.gradle.org/4.10.3/userguide/java_plugin.html#sec:test_execution

* Try:
Run with --stacktrace option to get the stack trace. Run with --info or --debug option to
get more log output. Run with --scan to get full insights.
==============================================================================

3: Task failed with an exception.
-----------
* What went wrong:
Execution failed for task ':beam-sdks-java-io-elasticsearch-tests-5:test'.
> Process 'Gradle Test Executor 84' finished with non-zero exit value 1
  This problem might be caused by incorrect test process configuration.
  Please refer to the test execution section in the user guide at https://docs.gradle.org/4.10.3/userguide/java_plugin.html#sec:test_execution

* Try:
Run with --stacktrace option to get the stack trace. Run with --info or --debug option to
get more log output. Run with --scan to get full insights.
==============================================================================

4: Task failed with an exception.
-----------
* What went wrong:
Execution failed for task ':beam-sdks-java-io-elasticsearch-tests-6:test'.
> Process 'Gradle Test Executor 86' finished with non-zero exit value 1
  This problem might be caused by incorrect test process configuration.
  Please refer to the test execution section in the user guide at https://docs.gradle.org/4.10.3/userguide/java_plugin.html#sec:test_execution

* Try:
Run with --stacktrace option to get the stack trace. Run with --info or --debug option to
get more log output. Run with --scan to get full insights.
==============================================================================

* Get more help at https://help.gradle.org

Deprecated Gradle features were used in this build, making it incompatible with Gradle 5.0.
Use '--warning-mode all' to show the individual deprecation warnings.
See https://docs.gradle.org/4.10.3/userguide/command_line_interface.html#sec:command_line_warnings

BUILD FAILED in 19m 4s
863 actionable tasks: 853 executed, 10 from cache

Publishing build scan...
https://gradle.com/s/2gjce3h6ccan6

Build step 'Invoke Gradle script' changed build result to FAILURE
Build step 'Invoke Gradle script' marked build as failure

---------------------------------------------------------------------
To unsubscribe, e-mail: builds-unsubscribe@beam.apache.org
For additional commands, e-mail: builds-help@beam.apache.org


Mime
View raw message