beam-builds mailing list archives

Site index · List index
Message view « Date » · « Thread »
Top « Date » · « Thread »
From Apache Jenkins Server <jenk...@builds.apache.org>
Subject Build failed in Jenkins: beam_Release_NightlySnapshot #290
Date Wed, 02 Jan 2019 22:35:53 GMT
See <https://builds.apache.org/job/beam_Release_NightlySnapshot/290/display/redirect?page=changes>

Changes:

[chamikara] Updates release validating to run LeaderBoard example using Dataflow

[aaltay] [BEAM-5315] Python 3 port io.source* and io.concat_source* modules

------------------------------------------
[...truncated 53.09 MB...]
Build cache key for task ':beam-vendor-sdks-java-extensions-protobuf:validateShadedJarDoesntLeakNonProjectClasses'
is a64fb579e57ef05e7c5674b4d904ed65
Caching disabled for task ':beam-vendor-sdks-java-extensions-protobuf:validateShadedJarDoesntLeakNonProjectClasses':
Caching has not been enabled for the task
Task ':beam-vendor-sdks-java-extensions-protobuf:validateShadedJarDoesntLeakNonProjectClasses'
is not up-to-date because:
  No history is available.
:beam-vendor-sdks-java-extensions-protobuf:validateShadedJarDoesntLeakNonProjectClasses (Thread[Task
worker for ':' Thread 8,5,main]) completed. Took 0.064 secs.
:beam-vendor-sdks-java-extensions-protobuf:check (Thread[Task worker for ':' Thread 8,5,main])
started.

> Task :beam-vendor-sdks-java-extensions-protobuf:check
Skipping task ':beam-vendor-sdks-java-extensions-protobuf:check' as it has no actions.
:beam-vendor-sdks-java-extensions-protobuf:check (Thread[Task worker for ':' Thread 8,5,main])
completed. Took 0.0 secs.
:beam-vendor-sdks-java-extensions-protobuf:build (Thread[Task worker for ':' Thread 11,5,main])
started.

> Task :beam-vendor-sdks-java-extensions-protobuf:build
Skipping task ':beam-vendor-sdks-java-extensions-protobuf:build' as it has no actions.
:beam-vendor-sdks-java-extensions-protobuf:build (Thread[Task worker for ':' Thread 11,5,main])
completed. Took 0.0 secs.
:beam-website:assemble (Thread[Task worker for ':' Thread 11,5,main]) started.

> Task :beam-website:assemble UP-TO-DATE
Skipping task ':beam-website:assemble' as it has no actions.
:beam-website:assemble (Thread[Task worker for ':' Thread 11,5,main]) completed. Took 0.0
secs.
:beam-website:setupBuildDir (Thread[Task worker for ':' Thread 11,5,main]) started.

> Task :beam-website:setupBuildDir
Build cache key for task ':beam-website:setupBuildDir' is fb2b365f958e0219d3a886db810dc756
Caching disabled for task ':beam-website:setupBuildDir': Caching has not been enabled for
the task
Task ':beam-website:setupBuildDir' is not up-to-date because:
  No history is available.
:beam-website:setupBuildDir (Thread[Task worker for ':' Thread 11,5,main]) completed. Took
0.004 secs.
:beam-website:buildDockerImage (Thread[Task worker for ':' Thread 11,5,main]) started.

> Task :beam-website:buildDockerImage
Caching disabled for task ':beam-website:buildDockerImage': Caching has not been enabled for
the task
Task ':beam-website:buildDockerImage' is not up-to-date because:
  Task has not declared any outputs despite executing actions.
Starting process 'command 'docker''. Working directory: <https://builds.apache.org/job/beam_Release_NightlySnapshot/ws/src/website>
Command: docker build -t beam-website .
Successfully started process 'command 'docker''
Sending build context to Docker daemon  26.38MB
Step 1/7 : FROM ruby:2.5
2.5: Pulling from library/ruby
Digest: sha256:4fe61c638dec4dc1d16935325586166b4a87a3aaa1c5a0a40db39a908eae70c5
Status: Downloaded newer image for ruby:2.5
 ---> 6fc6e4e7a8ee
Step 2/7 : WORKDIR /ruby
 ---> Using cache
 ---> faa38363f57c
Step 3/7 : RUN gem install bundler
 ---> Using cache
 ---> a1836e0d93bc
Step 4/7 : ADD Gemfile Gemfile.lock /ruby/
 ---> Using cache
 ---> 956f5841be6b
Step 5/7 : RUN bundle install --deployment --path $GEM_HOME
 ---> Using cache
 ---> 51f0799dbdaa
Step 6/7 : ENV LC_ALL C.UTF-8
 ---> Using cache
 ---> db1332a93a68
Step 7/7 : CMD sleep 3600
 ---> Using cache
 ---> 843e1818274a
Successfully built 843e1818274a
Successfully tagged beam-website:latest
:beam-website:buildDockerImage (Thread[Task worker for ':' Thread 11,5,main]) completed. Took
0.899 secs.
:beam-website:createDockerContainer (Thread[Task worker for ':' Thread 11,5,main]) started.

> Task :beam-website:createDockerContainer
Caching disabled for task ':beam-website:createDockerContainer': Caching has not been enabled
for the task
Task ':beam-website:createDockerContainer' is not up-to-date because:
  Task has not declared any outputs despite executing actions.
Starting process 'command '/bin/bash''. Working directory: <https://builds.apache.org/job/beam_Release_NightlySnapshot/ws/src/website>
Command: /bin/bash -c docker create -v <https://builds.apache.org/job/beam_Release_NightlySnapshot/ws/src>:/repo
-u $(id -u):$(id -g)  beam-website
Successfully started process 'command '/bin/bash''
:beam-website:createDockerContainer (Thread[Task worker for ':' Thread 11,5,main]) completed.
Took 1.612 secs.
:beam-website:startDockerContainer (Thread[Task worker for ':' Thread 11,5,main]) started.

> Task :beam-website:startDockerContainer
Caching disabled for task ':beam-website:startDockerContainer': Caching has not been enabled
for the task
Task ':beam-website:startDockerContainer' is not up-to-date because:
  Task has not declared any outputs despite executing actions.
Starting process 'command 'docker''. Working directory: <https://builds.apache.org/job/beam_Release_NightlySnapshot/ws/src/website>
Command: docker start 711245099e01fe6696c4efd42a40d92f0065e1d4891e580c074bdee7afa08707
Successfully started process 'command 'docker''
711245099e01fe6696c4efd42a40d92f0065e1d4891e580c074bdee7afa08707
:beam-website:startDockerContainer (Thread[Task worker for ':' Thread 11,5,main]) completed.
Took 0.284 secs.
:beam-website:buildLocalWebsite (Thread[Task worker for ':' Thread 11,5,main]) started.

> Task :beam-website:buildLocalWebsite
Build cache key for task ':beam-website:buildLocalWebsite' is caffbcab24e1b0838f7e656b5bf47fb5
Caching disabled for task ':beam-website:buildLocalWebsite': Caching has not been enabled
for the task
Task ':beam-website:buildLocalWebsite' is not up-to-date because:
  No history is available.
Starting process 'command 'docker''. Working directory: <https://builds.apache.org/job/beam_Release_NightlySnapshot/ws/src/website>
Command: docker exec 711245099e01fe6696c4efd42a40d92f0065e1d4891e580c074bdee7afa08707 /bin/bash
-c cd /repo/build/website &&         bundle exec jekyll build 	--destination generated-local-content
        --config /repo/website/_config.yml,/repo/website/_config_test.yml         --incremental
         --source /repo/website/src
        
Successfully started process 'command 'docker''
`/` is not writable.
Bundler will use `/tmp/bundler/home/unknown' as your home directory temporarily.
Configuration file: /repo/website/_config.yml
Configuration file: /repo/website/_config_test.yml
            Source: /repo/website/src
       Destination: generated-local-content
 Incremental build: enabled
      Generating... 
                    done in 11.021 seconds.
 Auto-regeneration: disabled. Use --watch to enable.
:beam-website:buildLocalWebsite (Thread[Task worker for ':' Thread 11,5,main]) completed.
Took 12.291 secs.
:beam-website:testWebsite (Thread[Task worker for ':' Thread 11,5,main]) started.

> Task :beam-website:testWebsite
Caching disabled for task ':beam-website:testWebsite': Caching has not been enabled for the
task
Task ':beam-website:testWebsite' is not up-to-date because:
  Task has not declared any outputs despite executing actions.
Starting process 'command 'docker''. Working directory: <https://builds.apache.org/job/beam_Release_NightlySnapshot/ws/src/website>
Command: docker exec 711245099e01fe6696c4efd42a40d92f0065e1d4891e580c074bdee7afa08707 /bin/bash
-c cd /repo/build/website &&       bundle exec rake test
Successfully started process 'command 'docker''
`/` is not writable.
Bundler will use `/tmp/bundler/home/unknown' as your home directory temporarily.
Running ["LinkCheck", "ScriptCheck", "ImageCheck", "HtmlCheck"] on ["./generated-local-content"]
on *.html... 


Checking 737 external links...
Ran on 181 files!


HTML-Proofer finished successfully.
:beam-website:testWebsite (Thread[Task worker for ':' Thread 11,5,main]) completed. Took 44.159
secs.
:beam-website:stopAndRemoveDockerContainer (Thread[Task worker for ':' Thread 11,5,main])
started.

> Task :beam-website:stopAndRemoveDockerContainer
Caching disabled for task ':beam-website:stopAndRemoveDockerContainer': Caching has not been
enabled for the task
Task ':beam-website:stopAndRemoveDockerContainer' is not up-to-date because:
  Task has not declared any outputs despite executing actions.
Starting process 'command 'docker''. Working directory: <https://builds.apache.org/job/beam_Release_NightlySnapshot/ws/src/website>
Command: docker rm -f 711245099e01fe6696c4efd42a40d92f0065e1d4891e580c074bdee7afa08707
Successfully started process 'command 'docker''
711245099e01fe6696c4efd42a40d92f0065e1d4891e580c074bdee7afa08707
:beam-website:stopAndRemoveDockerContainer (Thread[Task worker for ':' Thread 11,5,main])
completed. Took 0.364 secs.
:beam-website:buildWebsite (Thread[Task worker for ':' Thread 11,5,main]) started.

> Task :beam-website:buildWebsite
Skipping task ':beam-website:buildWebsite' as it has no actions.
:beam-website:buildWebsite (Thread[Task worker for ':' Thread 11,5,main]) completed. Took
0.0 secs.
:beam-website:check (Thread[Task worker for ':' Thread 11,5,main]) started.

> Task :beam-website:check
Skipping task ':beam-website:check' as it has no actions.
:beam-website:check (Thread[Task worker for ':' Thread 11,5,main]) completed. Took 0.0 secs.
:beam-website:build (Thread[Task worker for ':' Thread 6,5,main]) started.

> Task :beam-website:build
Skipping task ':beam-website:build' as it has no actions.
:beam-website:build (Thread[Task worker for ':' Thread 6,5,main]) completed. Took 0.0 secs.
:release:compileJava (Thread[Task worker for ':' Thread 6,5,main]) started.

> Task :release:compileJava NO-SOURCE
file or directory '<https://builds.apache.org/job/beam_Release_NightlySnapshot/ws/src/release/src/main/java',>
not found
Skipping task ':release:compileJava' as it has no source files and no previous output files.
:release:compileJava (Thread[Task worker for ':' Thread 6,5,main]) completed. Took 0.001 secs.
:release:compileGroovy (Thread[Task worker for ':' Thread 6,5,main]) started.

> Task :release:compileGroovy
Build cache key for task ':release:compileGroovy' is 35d0e89a2134bccb31badbd3ba2bd719
Task ':release:compileGroovy' is not up-to-date because:
  No history is available.
Packing task ':release:compileGroovy'
:release:compileGroovy (Thread[Task worker for ':' Thread 6,5,main]) completed. Took 0.393
secs.
:release:processResources (Thread[Task worker for ':' Thread 6,5,main]) started.

> Task :release:processResources NO-SOURCE
file or directory '<https://builds.apache.org/job/beam_Release_NightlySnapshot/ws/src/release/src/main/resources',>
not found
Skipping task ':release:processResources' as it has no source files and no previous output
files.
:release:processResources (Thread[Task worker for ':' Thread 6,5,main]) completed. Took 0.0
secs.
:release:classes (Thread[Task worker for ':' Thread 6,5,main]) started.

> Task :release:classes
Skipping task ':release:classes' as it has no actions.
:release:classes (Thread[Task worker for ':' Thread 6,5,main]) completed. Took 0.0 secs.
:release:jar (Thread[Task worker for ':' Thread 6,5,main]) started.

> Task :release:jar
Build cache key for task ':release:jar' is 416e1cce4173a091b7b82425a4a3bc83
Caching disabled for task ':release:jar': Caching has not been enabled for the task
Task ':release:jar' is not up-to-date because:
  No history is available.
:release:jar (Thread[Task worker for ':' Thread 6,5,main]) completed. Took 0.008 secs.
:release:assemble (Thread[Task worker for ':' Thread 6,5,main]) started.

> Task :release:assemble
Skipping task ':release:assemble' as it has no actions.
:release:assemble (Thread[Task worker for ':' Thread 6,5,main]) completed. Took 0.0 secs.
:release:compileTestJava (Thread[Task worker for ':' Thread 6,5,main]) started.

> Task :release:compileTestJava NO-SOURCE
file or directory '<https://builds.apache.org/job/beam_Release_NightlySnapshot/ws/src/release/src/test/java',>
not found
Skipping task ':release:compileTestJava' as it has no source files and no previous output
files.
:release:compileTestJava (Thread[Task worker for ':' Thread 6,5,main]) completed. Took 0.0
secs.
:release:compileTestGroovy (Thread[Task worker for ':' Thread 6,5,main]) started.

> Task :release:compileTestGroovy NO-SOURCE
file or directory '<https://builds.apache.org/job/beam_Release_NightlySnapshot/ws/src/release/src/test/groovy',>
not found
Skipping task ':release:compileTestGroovy' as it has no source files and no previous output
files.
:release:compileTestGroovy (Thread[Task worker for ':' Thread 6,5,main]) completed. Took 0.0
secs.
:release:processTestResources (Thread[Task worker for ':' Thread 6,5,main]) started.

> Task :release:processTestResources NO-SOURCE
file or directory '<https://builds.apache.org/job/beam_Release_NightlySnapshot/ws/src/release/src/test/resources',>
not found
Skipping task ':release:processTestResources' as it has no source files and no previous output
files.
:release:processTestResources (Thread[Task worker for ':' Thread 6,5,main]) completed. Took
0.0 secs.
:release:testClasses (Thread[Task worker for ':' Thread 6,5,main]) started.

> Task :release:testClasses UP-TO-DATE
Skipping task ':release:testClasses' as it has no actions.
:release:testClasses (Thread[Task worker for ':' Thread 6,5,main]) completed. Took 0.0 secs.
:release:test (Thread[Task worker for ':' Thread 6,5,main]) started.

> Task :release:test NO-SOURCE
Skipping task ':release:test' as it has no source files and no previous output files.
:release:test (Thread[Task worker for ':' Thread 6,5,main]) completed. Took 0.0 secs.
:release:check (Thread[Task worker for ':' Thread 6,5,main]) started.

> Task :release:check UP-TO-DATE
Skipping task ':release:check' as it has no actions.
:release:check (Thread[Task worker for ':' Thread 6,5,main]) completed. Took 0.0 secs.
:release:build (Thread[Task worker for ':' Thread 6,5,main]) started.

> Task :release:build
Skipping task ':release:build' as it has no actions.
:release:build (Thread[Task worker for ':' Thread 6,5,main]) completed. Took 0.0 secs.

FAILURE: Build failed with an exception.

* What went wrong:
Execution failed for task ':beam-sdks-java-io-elasticsearch-tests-2:test'.
> There were failing tests. See the report at: file://<https://builds.apache.org/job/beam_Release_NightlySnapshot/ws/src/sdks/java/io/elasticsearch-tests/elasticsearch-tests-2/build/reports/tests/test/index.html>

* Try:
Run with --stacktrace option to get the stack trace. Run with --debug option to get more log
output. Run with --scan to get full insights.

* Get more help at https://help.gradle.org

Deprecated Gradle features were used in this build, making it incompatible with Gradle 5.0.
Use '--warning-mode all' to show the individual deprecation warnings.
See https://docs.gradle.org/4.10.2/userguide/command_line_interface.html#sec:command_line_warnings

BUILD FAILED in 1h 33m 25s
958 actionable tasks: 950 executed, 6 from cache, 2 up-to-date

Publishing build scan...
https://gradle.com/s/umeki7yl4ipq6

Closing Git repo: <https://builds.apache.org/job/beam_Release_NightlySnapshot/ws/src/.git>
Stopped 1 worker daemon(s).
Build step 'Invoke Gradle script' changed build result to FAILURE
Build step 'Invoke Gradle script' marked build as failure

---------------------------------------------------------------------
To unsubscribe, e-mail: builds-unsubscribe@beam.apache.org
For additional commands, e-mail: builds-help@beam.apache.org


Mime
View raw message