beam-builds mailing list archives

Site index · List index
Message view « Date » · « Thread »
Top « Date » · « Thread »
From Apache Jenkins Server <jenk...@builds.apache.org>
Subject Build failed in Jenkins: beam_PreCommit_Java_Cron #784
Date Fri, 04 Jan 2019 12:19:23 GMT
See <https://builds.apache.org/job/beam_PreCommit_Java_Cron/784/display/redirect?page=changes>

Changes:

[echauchot] [BEAM-6030] Split metrics related options out of PipelineOptions

[echauchot] [BEAM-6030] Add Experimental label on MetricsOptions

------------------------------------------
[...truncated 62.12 MB...]
        BeamCalcRel(expr#0..4=[{inputs}], expr#5=[10], expr#6=[MOD($t1, $t5)], expr#7=[CAST($t6):BIGINT
NOT NULL], proj#0..4=[{exprs}], side_id=[$t7])
          BeamIOSourceRel(table=[[beam, bid]])
        BeamIOSourceRel(table=[[beam, side]])


org.apache.beam.sdk.nexmark.queries.sql.SqlBoundedSideInputJoinTest > inputOutputSameEvents
STANDARD_ERROR
    Jan 04, 2019 12:18:59 PM org.apache.beam.sdk.extensions.sql.impl.BeamQueryPlanner convertToBeamRel
    INFO: SQL:
    WITH `bid_with_side` (`auction`, `bidder`, `price`, `dateTime`, `extra`, `side_id`) AS
(SELECT `bid`.`auction`, `bid`.`bidder`, `bid`.`price`, `bid`.`dateTime`, `bid`.`extra`, CAST(MOD(`bid`.`bidder`,
10) AS BIGINT) AS `side_id`
    FROM `beam`.`bid` AS `bid`) (SELECT `bid_with_side`.`auction`, `bid_with_side`.`bidder`,
`bid_with_side`.`price`, `bid_with_side`.`dateTime`, `side`.`extra`
    FROM `bid_with_side` AS `bid_with_side`,
    `beam`.`side` AS `side`
    WHERE `bid_with_side`.`side_id` = `side`.`id`)
    Jan 04, 2019 12:18:59 PM org.apache.beam.sdk.extensions.sql.impl.BeamQueryPlanner convertToBeamRel
    INFO: SQLPlan>
    LogicalProject(auction=[$0], bidder=[$1], price=[$2], dateTime=[$3], extra=[$7])
      LogicalFilter(condition=[=($5, $6)])
        LogicalJoin(condition=[true], joinType=[inner])
          LogicalProject(auction=[$0], bidder=[$1], price=[$2], dateTime=[$3], extra=[$4],
side_id=[CAST(MOD($1, 10)):BIGINT NOT NULL])
            BeamIOSourceRel(table=[[beam, bid]])
          BeamIOSourceRel(table=[[beam, side]])

    Jan 04, 2019 12:18:59 PM org.apache.beam.sdk.extensions.sql.impl.BeamQueryPlanner convertToBeamRel
    INFO: BEAMPlan>
    BeamCalcRel(expr#0..7=[{inputs}], proj#0..3=[{exprs}], extra=[$t7])
      BeamJoinRel(condition=[=($5, $6)], joinType=[inner])
        BeamCalcRel(expr#0..4=[{inputs}], expr#5=[10], expr#6=[MOD($t1, $t5)], expr#7=[CAST($t6):BIGINT
NOT NULL], proj#0..4=[{exprs}], side_id=[$t7])
          BeamIOSourceRel(table=[[beam, bid]])
        BeamIOSourceRel(table=[[beam, side]])


org.apache.beam.sdk.nexmark.queries.sql.SqlQuery1Test > testConvertsPriceToEur STANDARD_ERROR
    Jan 04, 2019 12:19:01 PM org.apache.beam.sdk.extensions.sql.impl.BeamQueryPlanner convertToBeamRel
    INFO: SQL:
    SELECT `PCOLLECTION`.`auction`, `PCOLLECTION`.`bidder`, `DolToEur`(`PCOLLECTION`.`price`)
AS `price`, `PCOLLECTION`.`dateTime`, `PCOLLECTION`.`extra`
    FROM `beam`.`PCOLLECTION` AS `PCOLLECTION`
    Jan 04, 2019 12:19:01 PM org.apache.beam.sdk.extensions.sql.impl.BeamQueryPlanner convertToBeamRel
    INFO: SQLPlan>
    LogicalProject(auction=[$0], bidder=[$1], price=[DolToEur($2)], dateTime=[$3], extra=[$4])
      BeamIOSourceRel(table=[[beam, PCOLLECTION]])

    Jan 04, 2019 12:19:01 PM org.apache.beam.sdk.extensions.sql.impl.BeamQueryPlanner convertToBeamRel
    INFO: BEAMPlan>
    BeamCalcRel(expr#0..4=[{inputs}], expr#5=[DolToEur($t2)], proj#0..1=[{exprs}], price=[$t5],
dateTime=[$t3], extra=[$t4])
      BeamIOSourceRel(table=[[beam, PCOLLECTION]])


org.apache.beam.sdk.nexmark.queries.SessionSideInputJoinTest > queryMatchesModelBatchCsv
STANDARD_ERROR
    Jan 04, 2019 12:19:03 PM org.apache.beam.sdk.io.WriteFiles$WriteShardsIntoTempFilesFn
processElement
    INFO: Opening writer b35e3927-5bc2-479f-8fe9-c2aa303aa751 for window org.apache.beam.sdk.transforms.windowing.GlobalWindow@58e14383
pane PaneInfo{isFirst=true, isLast=true, timing=ON_TIME, index=0, onTimeIndex=0} destination
null
    Jan 04, 2019 12:19:03 PM org.apache.beam.sdk.io.WriteFiles$WriteShardsIntoTempFilesFn
processElement
    INFO: Opening writer 0913bbaf-f5e9-41c4-9e09-430192f00f46 for window org.apache.beam.sdk.transforms.windowing.GlobalWindow@58e14383
pane PaneInfo{isFirst=true, isLast=true, timing=ON_TIME, index=0, onTimeIndex=0} destination
null
    Jan 04, 2019 12:19:03 PM org.apache.beam.sdk.io.WriteFiles$WriteShardsIntoTempFilesFn
processElement
    INFO: Opening writer 16316a4c-cf3a-45a7-a3bb-9b90625ef008 for window org.apache.beam.sdk.transforms.windowing.GlobalWindow@58e14383
pane PaneInfo{isFirst=true, isLast=true, timing=ON_TIME, index=0, onTimeIndex=0} destination
null
    Jan 04, 2019 12:19:03 PM org.apache.beam.sdk.io.FileBasedSink$Writer close
    INFO: Successfully wrote temporary file <https://builds.apache.org/job/beam_PreCommit_Java_Cron/ws/src/sdks/java/testing/nexmark/null/.temp-beam-2019-01-04_12-19-03-5/0913bbaf-f5e9-41c4-9e09-430192f00f46>
    Jan 04, 2019 12:19:03 PM org.apache.beam.sdk.io.FileBasedSink$Writer close
    INFO: Successfully wrote temporary file <https://builds.apache.org/job/beam_PreCommit_Java_Cron/ws/src/sdks/java/testing/nexmark/null/.temp-beam-2019-01-04_12-19-03-5/16316a4c-cf3a-45a7-a3bb-9b90625ef008>
    Jan 04, 2019 12:19:03 PM org.apache.beam.sdk.io.FileBasedSink$Writer close
    INFO: Successfully wrote temporary file <https://builds.apache.org/job/beam_PreCommit_Java_Cron/ws/src/sdks/java/testing/nexmark/null/.temp-beam-2019-01-04_12-19-03-5/b35e3927-5bc2-479f-8fe9-c2aa303aa751>
    Jan 04, 2019 12:19:03 PM org.apache.beam.sdk.io.WriteFiles$FinalizeTempFileBundles$FinalizeFn
process
    INFO: Finalizing 3 file results
    Jan 04, 2019 12:19:03 PM org.apache.beam.sdk.io.FileBasedSink$WriteOperation createMissingEmptyShards
    INFO: Finalizing for destination null num shards 3.
    Jan 04, 2019 12:19:03 PM org.apache.beam.sdk.io.FileBasedSink$WriteOperation moveToOutputFiles
    INFO: Will copy temporary file FileResult{tempFilename=<https://builds.apache.org/job/beam_PreCommit_Java_Cron/ws/src/sdks/java/testing/nexmark/null/.temp-beam-2019-01-04_12-19-03-5/16316a4c-cf3a-45a7-a3bb-9b90625ef008,>
shard=1, window=org.apache.beam.sdk.transforms.windowing.GlobalWindow@58e14383, paneInfo=PaneInfo{isFirst=true,
isLast=true, timing=ON_TIME, index=0, onTimeIndex=0}} to final location <https://builds.apache.org/job/beam_PreCommit_Java_Cron/ws/src/sdks/java/testing/nexmark/null/SessionSideInputJoin-75391013-00001-of-00003>
    Jan 04, 2019 12:19:03 PM org.apache.beam.sdk.io.FileBasedSink$WriteOperation moveToOutputFiles
    INFO: Will copy temporary file FileResult{tempFilename=<https://builds.apache.org/job/beam_PreCommit_Java_Cron/ws/src/sdks/java/testing/nexmark/null/.temp-beam-2019-01-04_12-19-03-5/b35e3927-5bc2-479f-8fe9-c2aa303aa751,>
shard=0, window=org.apache.beam.sdk.transforms.windowing.GlobalWindow@58e14383, paneInfo=PaneInfo{isFirst=true,
isLast=true, timing=ON_TIME, index=0, onTimeIndex=0}} to final location <https://builds.apache.org/job/beam_PreCommit_Java_Cron/ws/src/sdks/java/testing/nexmark/null/SessionSideInputJoin-75391013-00000-of-00003>
    Jan 04, 2019 12:19:03 PM org.apache.beam.sdk.io.FileBasedSink$WriteOperation moveToOutputFiles
    INFO: Will copy temporary file FileResult{tempFilename=<https://builds.apache.org/job/beam_PreCommit_Java_Cron/ws/src/sdks/java/testing/nexmark/null/.temp-beam-2019-01-04_12-19-03-5/0913bbaf-f5e9-41c4-9e09-430192f00f46,>
shard=2, window=org.apache.beam.sdk.transforms.windowing.GlobalWindow@58e14383, paneInfo=PaneInfo{isFirst=true,
isLast=true, timing=ON_TIME, index=0, onTimeIndex=0}} to final location <https://builds.apache.org/job/beam_PreCommit_Java_Cron/ws/src/sdks/java/testing/nexmark/null/SessionSideInputJoin-75391013-00002-of-00003>
    Jan 04, 2019 12:19:03 PM org.apache.beam.sdk.io.FileBasedSink$WriteOperation removeTemporaryFiles
    INFO: Will remove known temporary file <https://builds.apache.org/job/beam_PreCommit_Java_Cron/ws/src/sdks/java/testing/nexmark/null/.temp-beam-2019-01-04_12-19-03-5/16316a4c-cf3a-45a7-a3bb-9b90625ef008>
    Jan 04, 2019 12:19:03 PM org.apache.beam.sdk.io.FileBasedSink$WriteOperation removeTemporaryFiles
    INFO: Will remove known temporary file <https://builds.apache.org/job/beam_PreCommit_Java_Cron/ws/src/sdks/java/testing/nexmark/null/.temp-beam-2019-01-04_12-19-03-5/b35e3927-5bc2-479f-8fe9-c2aa303aa751>
    Jan 04, 2019 12:19:03 PM org.apache.beam.sdk.io.FileBasedSink$WriteOperation removeTemporaryFiles
    INFO: Will remove known temporary file <https://builds.apache.org/job/beam_PreCommit_Java_Cron/ws/src/sdks/java/testing/nexmark/null/.temp-beam-2019-01-04_12-19-03-5/0913bbaf-f5e9-41c4-9e09-430192f00f46>
    Jan 04, 2019 12:19:03 PM org.apache.beam.sdk.io.FileBasedSink$WriteOperation removeTemporaryFiles
    WARNING: Failed to match temporary files under: [<https://builds.apache.org/job/beam_PreCommit_Java_Cron/ws/src/sdks/java/testing/nexmark/null/.temp-beam-2019-01-04_12-19-03-5/].>
    Jan 04, 2019 12:19:03 PM org.apache.beam.sdk.io.FileBasedSource getEstimatedSizeBytes
    INFO: Filepattern <https://builds.apache.org/job/beam_PreCommit_Java_Cron/ws/src/sdks/java/testing/nexmark/null/SessionSideInputJoin-75391013*>
matched 3 files with total size 40
    Jan 04, 2019 12:19:03 PM org.apache.beam.sdk.io.FileBasedSource split
    INFO: Splitting filepattern <https://builds.apache.org/job/beam_PreCommit_Java_Cron/ws/src/sdks/java/testing/nexmark/null/SessionSideInputJoin-75391013*>
into bundles of size 2 took 1 ms and produced 3 files and 20 bundles

org.apache.beam.sdk.nexmark.queries.SessionSideInputJoinTest > queryMatchesModelStreamingCsv
STANDARD_ERROR
    Jan 04, 2019 12:19:05 PM org.apache.beam.sdk.io.WriteFiles$WriteShardsIntoTempFilesFn
processElement
    INFO: Opening writer c86ae391-0a34-4b72-935c-6d80a102b33b for window org.apache.beam.sdk.transforms.windowing.GlobalWindow@58e14383
pane PaneInfo{isFirst=true, isLast=true, timing=ON_TIME, index=0, onTimeIndex=0} destination
null
    Jan 04, 2019 12:19:05 PM org.apache.beam.sdk.io.WriteFiles$WriteShardsIntoTempFilesFn
processElement
    INFO: Opening writer defc4b6b-9cda-41de-806c-6d70ff7bda42 for window org.apache.beam.sdk.transforms.windowing.GlobalWindow@58e14383
pane PaneInfo{isFirst=true, isLast=true, timing=ON_TIME, index=0, onTimeIndex=0} destination
null
    Jan 04, 2019 12:19:05 PM org.apache.beam.sdk.io.WriteFiles$WriteShardsIntoTempFilesFn
processElement
    INFO: Opening writer 17caf4e5-8df7-482b-a8e9-8c928b404edb for window org.apache.beam.sdk.transforms.windowing.GlobalWindow@58e14383
pane PaneInfo{isFirst=true, isLast=true, timing=ON_TIME, index=0, onTimeIndex=0} destination
null
    Jan 04, 2019 12:19:05 PM org.apache.beam.sdk.io.FileBasedSink$Writer close
    INFO: Successfully wrote temporary file <https://builds.apache.org/job/beam_PreCommit_Java_Cron/ws/src/sdks/java/testing/nexmark/null/.temp-beam-2019-01-04_12-19-05-6/c86ae391-0a34-4b72-935c-6d80a102b33b>
    Jan 04, 2019 12:19:05 PM org.apache.beam.sdk.io.FileBasedSink$Writer close
    INFO: Successfully wrote temporary file <https://builds.apache.org/job/beam_PreCommit_Java_Cron/ws/src/sdks/java/testing/nexmark/null/.temp-beam-2019-01-04_12-19-05-6/defc4b6b-9cda-41de-806c-6d70ff7bda42>
    Jan 04, 2019 12:19:05 PM org.apache.beam.sdk.io.FileBasedSink$Writer close
    INFO: Successfully wrote temporary file <https://builds.apache.org/job/beam_PreCommit_Java_Cron/ws/src/sdks/java/testing/nexmark/null/.temp-beam-2019-01-04_12-19-05-6/17caf4e5-8df7-482b-a8e9-8c928b404edb>
    Jan 04, 2019 12:19:05 PM org.apache.beam.sdk.io.WriteFiles$FinalizeTempFileBundles$FinalizeFn
process
    INFO: Finalizing 3 file results
    Jan 04, 2019 12:19:05 PM org.apache.beam.sdk.io.FileBasedSink$WriteOperation createMissingEmptyShards
    INFO: Finalizing for destination null num shards 3.
    Jan 04, 2019 12:19:05 PM org.apache.beam.sdk.io.FileBasedSink$WriteOperation moveToOutputFiles
    INFO: Will copy temporary file FileResult{tempFilename=<https://builds.apache.org/job/beam_PreCommit_Java_Cron/ws/src/sdks/java/testing/nexmark/null/.temp-beam-2019-01-04_12-19-05-6/c86ae391-0a34-4b72-935c-6d80a102b33b,>
shard=0, window=org.apache.beam.sdk.transforms.windowing.GlobalWindow@58e14383, paneInfo=PaneInfo{isFirst=true,
isLast=true, timing=ON_TIME, index=0, onTimeIndex=0}} to final location <https://builds.apache.org/job/beam_PreCommit_Java_Cron/ws/src/sdks/java/testing/nexmark/null/SessionSideInputJoin--1769848065-00000-of-00003>
    Jan 04, 2019 12:19:05 PM org.apache.beam.sdk.io.FileBasedSink$WriteOperation moveToOutputFiles
    INFO: Will copy temporary file FileResult{tempFilename=<https://builds.apache.org/job/beam_PreCommit_Java_Cron/ws/src/sdks/java/testing/nexmark/null/.temp-beam-2019-01-04_12-19-05-6/defc4b6b-9cda-41de-806c-6d70ff7bda42,>
shard=1, window=org.apache.beam.sdk.transforms.windowing.GlobalWindow@58e14383, paneInfo=PaneInfo{isFirst=true,
isLast=true, timing=ON_TIME, index=0, onTimeIndex=0}} to final location <https://builds.apache.org/job/beam_PreCommit_Java_Cron/ws/src/sdks/java/testing/nexmark/null/SessionSideInputJoin--1769848065-00001-of-00003>
    Jan 04, 2019 12:19:05 PM org.apache.beam.sdk.io.FileBasedSink$WriteOperation moveToOutputFiles
    INFO: Will copy temporary file FileResult{tempFilename=<https://builds.apache.org/job/beam_PreCommit_Java_Cron/ws/src/sdks/java/testing/nexmark/null/.temp-beam-2019-01-04_12-19-05-6/17caf4e5-8df7-482b-a8e9-8c928b404edb,>
shard=2, window=org.apache.beam.sdk.transforms.windowing.GlobalWindow@58e14383, paneInfo=PaneInfo{isFirst=true,
isLast=true, timing=ON_TIME, index=0, onTimeIndex=0}} to final location <https://builds.apache.org/job/beam_PreCommit_Java_Cron/ws/src/sdks/java/testing/nexmark/null/SessionSideInputJoin--1769848065-00002-of-00003>
    Jan 04, 2019 12:19:05 PM org.apache.beam.sdk.io.FileBasedSink$WriteOperation removeTemporaryFiles
    INFO: Will remove known temporary file <https://builds.apache.org/job/beam_PreCommit_Java_Cron/ws/src/sdks/java/testing/nexmark/null/.temp-beam-2019-01-04_12-19-05-6/17caf4e5-8df7-482b-a8e9-8c928b404edb>
    Jan 04, 2019 12:19:05 PM org.apache.beam.sdk.io.FileBasedSink$WriteOperation removeTemporaryFiles
    INFO: Will remove known temporary file <https://builds.apache.org/job/beam_PreCommit_Java_Cron/ws/src/sdks/java/testing/nexmark/null/.temp-beam-2019-01-04_12-19-05-6/defc4b6b-9cda-41de-806c-6d70ff7bda42>
    Jan 04, 2019 12:19:05 PM org.apache.beam.sdk.io.FileBasedSink$WriteOperation removeTemporaryFiles
    INFO: Will remove known temporary file <https://builds.apache.org/job/beam_PreCommit_Java_Cron/ws/src/sdks/java/testing/nexmark/null/.temp-beam-2019-01-04_12-19-05-6/c86ae391-0a34-4b72-935c-6d80a102b33b>
    Jan 04, 2019 12:19:05 PM org.apache.beam.sdk.io.FileBasedSink$WriteOperation removeTemporaryFiles
    WARNING: Failed to match temporary files under: [<https://builds.apache.org/job/beam_PreCommit_Java_Cron/ws/src/sdks/java/testing/nexmark/null/.temp-beam-2019-01-04_12-19-05-6/].>
    Jan 04, 2019 12:19:05 PM org.apache.beam.sdk.io.FileBasedSource getEstimatedSizeBytes
    INFO: Filepattern <https://builds.apache.org/job/beam_PreCommit_Java_Cron/ws/src/sdks/java/testing/nexmark/null/SessionSideInputJoin--1769848065*>
matched 3 files with total size 40
    Jan 04, 2019 12:19:05 PM org.apache.beam.sdk.io.FileBasedSource split
    INFO: Splitting filepattern <https://builds.apache.org/job/beam_PreCommit_Java_Cron/ws/src/sdks/java/testing/nexmark/null/SessionSideInputJoin--1769848065*>
into bundles of size 2 took 1 ms and produced 3 files and 20 bundles

Gradle Test Executor 82 finished executing tests.

> Task :beam-sdks-java-nexmark:test
Finished generating test XML results (0.002 secs) into: <https://builds.apache.org/job/beam_PreCommit_Java_Cron/ws/src/sdks/java/testing/nexmark/build/test-results/test>
Generating HTML test report...
Finished generating test html results (0.003 secs) into: <https://builds.apache.org/job/beam_PreCommit_Java_Cron/ws/src/sdks/java/testing/nexmark/build/reports/tests/test>
Packing task ':beam-sdks-java-nexmark:test'
:beam-sdks-java-nexmark:test (Thread[Task worker for ':',5,main]) completed. Took 6 mins 24.07
secs.
:beam-sdks-java-nexmark:shadowJar (Thread[Task worker for ':',5,main]) started.

> Task :beam-sdks-java-nexmark:shadowJar
Build cache key for task ':beam-sdks-java-nexmark:shadowJar' is 4de781e191ad10fcf7887f5b2fb4f69d
Caching disabled for task ':beam-sdks-java-nexmark:shadowJar': Caching has not been enabled
for the task
Task ':beam-sdks-java-nexmark:shadowJar' is not up-to-date because:
  No history is available.
*******************
GRADLE SHADOW STATS

Total Jars: 2 (includes project)
Total Time: 2.101s [2101ms]
Average Time/Jar: 1.0505s [1050.5ms]
*******************
:beam-sdks-java-nexmark:shadowJar (Thread[Task worker for ':',5,main]) completed. Took 2.406
secs.
:beam-sdks-java-nexmark:validateShadedJarDoesntLeakNonProjectClasses (Thread[Task worker for
':',5,main]) started.

> Task :beam-sdks-java-nexmark:validateShadedJarDoesntLeakNonProjectClasses
Build cache key for task ':beam-sdks-java-nexmark:validateShadedJarDoesntLeakNonProjectClasses'
is fe3e87c0f4c415c3a81492509bcbc643
Caching disabled for task ':beam-sdks-java-nexmark:validateShadedJarDoesntLeakNonProjectClasses':
Caching has not been enabled for the task
Task ':beam-sdks-java-nexmark:validateShadedJarDoesntLeakNonProjectClasses' is not up-to-date
because:
  No history is available.
:beam-sdks-java-nexmark:validateShadedJarDoesntLeakNonProjectClasses (Thread[Task worker for
':',5,main]) completed. Took 0.059 secs.
:beam-sdks-java-nexmark:check (Thread[Task worker for ':',5,main]) started.

> Task :beam-sdks-java-nexmark:check
Skipping task ':beam-sdks-java-nexmark:check' as it has no actions.
:beam-sdks-java-nexmark:check (Thread[Task worker for ':',5,main]) completed. Took 0.0 secs.
:beam-sdks-java-nexmark:build (Thread[Task worker for ':',5,main]) started.

> Task :beam-sdks-java-nexmark:build
Skipping task ':beam-sdks-java-nexmark:build' as it has no actions.
:beam-sdks-java-nexmark:build (Thread[Task worker for ':',5,main]) completed. Took 0.0 secs.
:beam-sdks-java-nexmark:buildDependents (Thread[Task worker for ':',5,main]) started.

> Task :beam-sdks-java-nexmark:buildDependents
Caching disabled for task ':beam-sdks-java-nexmark:buildDependents': Caching has not been
enabled for the task
Task ':beam-sdks-java-nexmark:buildDependents' is not up-to-date because:
  Task has not declared any outputs despite executing actions.
:beam-sdks-java-nexmark:buildDependents (Thread[Task worker for ':',5,main]) completed. Took
0.0 secs.
:beam-sdks-java-extensions-sql:buildDependents (Thread[Task worker for ':' Thread 5,5,main])
started.
:beam-sdks-java-io-kafka:buildDependents (Thread[Task worker for ':' Thread 8,5,main]) started.
:beam-sdks-java-test-utils:buildDependents (Thread[Task worker for ':' Thread 2,5,main]) started.

> Task :beam-sdks-java-io-kafka:buildDependents
Caching disabled for task ':beam-sdks-java-io-kafka:buildDependents': Caching has not been
enabled for the task
Task ':beam-sdks-java-io-kafka:buildDependents' is not up-to-date because:
  Task has not declared any outputs despite executing actions.

> Task :beam-sdks-java-test-utils:buildDependents
Caching disabled for task ':beam-sdks-java-test-utils:buildDependents': Caching has not been
enabled for the task
Task ':beam-sdks-java-test-utils:buildDependents' is not up-to-date because:
  Task has not declared any outputs despite executing actions.
:beam-sdks-java-io-kafka:buildDependents (Thread[Task worker for ':' Thread 8,5,main]) completed.
Took 0.0 secs.
:beam-sdks-java-test-utils:buildDependents (Thread[Task worker for ':' Thread 2,5,main]) completed.
Took 0.0 secs.

> Task :beam-sdks-java-extensions-sql:buildDependents
Caching disabled for task ':beam-sdks-java-extensions-sql:buildDependents': Caching has not
been enabled for the task
Task ':beam-sdks-java-extensions-sql:buildDependents' is not up-to-date because:
  Task has not declared any outputs despite executing actions.
:beam-sdks-java-extensions-sql:buildDependents (Thread[Task worker for ':' Thread 5,5,main])
completed. Took 0.0 secs.
:beam-sdks-java-extensions-join-library:buildDependents (Thread[Task worker for ':' Thread
10,5,main]) started.

> Task :beam-sdks-java-extensions-join-library:buildDependents
Caching disabled for task ':beam-sdks-java-extensions-join-library:buildDependents': Caching
has not been enabled for the task
Task ':beam-sdks-java-extensions-join-library:buildDependents' is not up-to-date because:
  Task has not declared any outputs despite executing actions.
:beam-sdks-java-extensions-join-library:buildDependents (Thread[Task worker for ':' Thread
10,5,main]) completed. Took 0.0 secs.

FAILURE: Build completed with 3 failures.

1: Task failed with an exception.
-----------
* What went wrong:
Execution failed for task ':beam-sdks-java-io-hbase:test'.
> Process 'Gradle Test Executor 65' finished with non-zero exit value 1
  This problem might be caused by incorrect test process configuration.
  Please refer to the test execution section in the user guide at https://docs.gradle.org/4.10.2/userguide/java_plugin.html#sec:test_execution

* Try:
Run with --stacktrace option to get the stack trace. Run with --debug option to get more log
output. Run with --scan to get full insights.
==============================================================================

2: Task failed with an exception.
-----------
* What went wrong:
Execution failed for task ':beam-sdks-java-io-hadoop-file-system:test'.
> Process 'Gradle Test Executor 64' finished with non-zero exit value 1
  This problem might be caused by incorrect test process configuration.
  Please refer to the test execution section in the user guide at https://docs.gradle.org/4.10.2/userguide/java_plugin.html#sec:test_execution

* Try:
Run with --stacktrace option to get the stack trace. Run with --debug option to get more log
output. Run with --scan to get full insights.
==============================================================================

3: Task failed with an exception.
-----------
* What went wrong:
Execution failed for task ':beam-runners-flink_2.11:test'.
> Process 'Gradle Test Executor 60' finished with non-zero exit value 1
  This problem might be caused by incorrect test process configuration.
  Please refer to the test execution section in the user guide at https://docs.gradle.org/4.10.2/userguide/java_plugin.html#sec:test_execution

* Try:
Run with --stacktrace option to get the stack trace. Run with --debug option to get more log
output. Run with --scan to get full insights.
==============================================================================

* Get more help at https://help.gradle.org

Deprecated Gradle features were used in this build, making it incompatible with Gradle 5.0.
Use '--warning-mode all' to show the individual deprecation warnings.
See https://docs.gradle.org/4.10.2/userguide/command_line_interface.html#sec:command_line_warnings

BUILD FAILED in 19m 1s
865 actionable tasks: 852 executed, 13 from cache

Publishing build scan...
https://gradle.com/s/pfq3bebcyfrru

Closing Git repo: <https://builds.apache.org/job/beam_PreCommit_Java_Cron/ws/src/.git>
Build step 'Invoke Gradle script' changed build result to FAILURE
Build step 'Invoke Gradle script' marked build as failure

---------------------------------------------------------------------
To unsubscribe, e-mail: builds-unsubscribe@beam.apache.org
For additional commands, e-mail: builds-help@beam.apache.org


Mime
View raw message