beam-builds mailing list archives

Site index · List index
Message view « Date » · « Thread »
Top « Date » · « Thread »
From Apache Jenkins Server <jenk...@builds.apache.org>
Subject Build failed in Jenkins: beam_PreCommit_Spotless_Cron #301
Date Thu, 17 Jan 2019 06:01:54 GMT
See <https://builds.apache.org/job/beam_PreCommit_Spotless_Cron/301/display/redirect?page=changes>

Changes:

[relax] Fix nested collections.

[relax] Fix CheckStyle.

[relax] Add back newline.

[github] [BEAM-6405] Disable parallel test execution of Java

[kenn] Move the contribution testing guide to the confluence wiki (#7486)

------------------------------------------
[...truncated 22.77 KB...]
> Task :beam-sdks-java-extensions-join-library:spotlessCheck
> Task :beam-sdks-java-extensions-json-jackson:spotlessJava
> Task :beam-sdks-java-extensions-json-jackson:spotlessJavaCheck
> Task :beam-sdks-java-extensions-json-jackson:spotlessCheck
> Task :beam-runners-flink-1.6:spotlessJava
> Task :beam-runners-flink-1.6:spotlessJavaCheck
> Task :beam-runners-flink-1.6:spotlessCheck
> Task :beam-runners-flink_2.11:spotlessJava
> Task :beam-runners-flink-1.7:spotlessJava
> Task :beam-runners-flink_2.11:spotlessJavaCheck
> Task :beam-runners-flink_2.11:spotlessCheck
> Task :beam-runners-flink-1.7:spotlessJavaCheck
> Task :beam-runners-flink-1.7:spotlessCheck
> Task :beam-sdks-java-extensions-protobuf:spotlessJava
> Task :beam-sdks-java-extensions-protobuf:spotlessJavaCheck
> Task :beam-sdks-java-extensions-protobuf:spotlessCheck
> Task :beam-sdks-java-extensions-kryo:spotlessJava
> Task :beam-sdks-java-extensions-kryo:spotlessJavaCheck
> Task :beam-sdks-java-extensions-kryo:spotlessCheck
> Task :beam-sdks-java-extensions-google-cloud-platform-core:spotlessJava
> Task :beam-sdks-java-extensions-google-cloud-platform-core:spotlessJavaCheck
> Task :beam-sdks-java-extensions-google-cloud-platform-core:spotlessCheck
> Task :beam-sdks-java-extensions-sql-jdbc:spotlessJava
> Task :beam-sdks-java-extensions-sql-jdbc:spotlessJavaCheck
> Task :beam-sdks-java-extensions-sql-jdbc:spotlessCheck
> Task :beam-runners-core-construction-java:spotlessJava
> Task :beam-runners-core-construction-java:spotlessJavaCheck
> Task :beam-runners-core-construction-java:spotlessCheck
> Task :beam-runners-spark:spotlessJava
> Task :beam-runners-spark:spotlessJavaCheck
> Task :beam-runners-spark:spotlessCheck
> Task :beam-sdks-java-extensions-sketching:spotlessJava
> Task :beam-sdks-java-extensions-sketching:spotlessJavaCheck
> Task :beam-sdks-java-extensions-sketching:spotlessCheck
> Task :beam-sdks-java-extensions-sorter:spotlessJava
> Task :beam-sdks-java-extensions-sorter:spotlessJavaCheck
> Task :beam-sdks-java-extensions-sorter:spotlessCheck
> Task :beam-sdks-java-io-amqp:spotlessJava
> Task :beam-sdks-java-io-amqp:spotlessJavaCheck
> Task :beam-sdks-java-io-amqp:spotlessCheck
> Task :beam-runners-core-java:spotlessJava
> Task :beam-runners-core-java:spotlessJavaCheck
> Task :beam-runners-core-java:spotlessCheck
> Task :beam-sdks-java-io-common:spotlessJava
> Task :beam-sdks-java-io-common:spotlessJavaCheck
> Task :beam-sdks-java-io-common:spotlessCheck
> Task :beam-sdks-java-io-clickhouse:spotlessJava
> Task :beam-sdks-java-io-clickhouse:spotlessJavaCheck
> Task :beam-sdks-java-io-clickhouse:spotlessCheck
> Task :beam-sdks-java-io-cassandra:spotlessJava
> Task :beam-sdks-java-io-cassandra:spotlessJavaCheck
> Task :beam-sdks-java-io-cassandra:spotlessCheck
> Task :beam-sdks-java-io-elasticsearch:spotlessJava
> Task :beam-sdks-java-io-elasticsearch-tests-2:spotlessJava
> Task :beam-sdks-java-io-elasticsearch-tests-2:spotlessJavaCheck
> Task :beam-sdks-java-io-elasticsearch-tests-2:spotlessCheck
> Task :beam-sdks-java-io-elasticsearch-tests-6:spotlessJava
> Task :beam-sdks-java-io-elasticsearch:spotlessJavaCheck
> Task :beam-sdks-java-io-elasticsearch:spotlessCheck
> Task :beam-sdks-java-io-elasticsearch-tests-6:spotlessJavaCheck
> Task :beam-sdks-java-io-elasticsearch-tests-6:spotlessCheck
> Task :beam-sdks-java-io-elasticsearch-tests-5:spotlessJava
> Task :beam-sdks-java-io-elasticsearch-tests-5:spotlessJavaCheck
> Task :beam-sdks-java-io-elasticsearch-tests-5:spotlessCheck
> Task :beam-sdks-java-io-hadoop-common:spotlessJava
> Task :beam-sdks-java-io-hadoop-common:spotlessJavaCheck
> Task :beam-sdks-java-io-hadoop-common:spotlessCheck
> Task :beam-sdks-java-io-file-based-io-tests:spotlessJava
> Task :beam-sdks-java-io-file-based-io-tests:spotlessJavaCheck
> Task :beam-sdks-java-io-file-based-io-tests:spotlessCheck
> Task :beam-sdks-java-io-elasticsearch-tests-common:spotlessJava
> Task :beam-sdks-java-io-elasticsearch-tests-common:spotlessJavaCheck
> Task :beam-sdks-java-io-elasticsearch-tests-common:spotlessCheck
> Task :beam-sdks-java-io-amazon-web-services:spotlessJava
> Task :beam-sdks-java-io-amazon-web-services:spotlessJavaCheck
> Task :beam-sdks-java-io-amazon-web-services:spotlessCheck
> Task :beam-sdks-java-fn-execution:spotlessJava
> Task :beam-sdks-java-fn-execution:spotlessJavaCheck
> Task :beam-sdks-java-fn-execution:spotlessCheck
> Task :beam-sdks-java-io-hadoop-input-format:spotlessJava
> Task :beam-sdks-java-io-hadoop-input-format:spotlessJavaCheck
> Task :beam-sdks-java-io-hadoop-input-format:spotlessCheck
> Task :beam-sdks-java-io-hadoop-file-system:spotlessJava
> Task :beam-sdks-java-io-hadoop-file-system:spotlessJavaCheck
> Task :beam-sdks-java-io-hadoop-file-system:spotlessCheck
> Task :beam-sdks-java-io-hcatalog:spotlessJava
> Task :beam-sdks-java-io-hcatalog:spotlessJavaCheck
> Task :beam-sdks-java-io-hcatalog:spotlessCheck
> Task :beam-sdks-java-io-hbase:spotlessJava
> Task :beam-sdks-java-io-hbase:spotlessJavaCheck
> Task :beam-sdks-java-io-hbase:spotlessCheck
> Task :beam-sdks-java-io-jdbc:spotlessJava
> Task :beam-sdks-java-io-jdbc:spotlessJavaCheck
> Task :beam-sdks-java-io-jdbc:spotlessCheck
> Task :beam-runners-direct-java:spotlessJava
> Task :beam-runners-direct-java:spotlessJavaCheck
> Task :beam-runners-direct-java:spotlessCheck
> Task :beam-sdks-java-io-jms:spotlessJava
> Task :beam-sdks-java-io-jms:spotlessJavaCheck
> Task :beam-sdks-java-io-jms:spotlessCheck
> Task :beam-sdks-java-extensions-euphoria:spotlessJava
> Task :beam-sdks-java-extensions-euphoria:spotlessJavaCheck
> Task :beam-sdks-java-extensions-euphoria:spotlessCheck
> Task :beam-sdks-java-io-kudu:spotlessJava
> Task :beam-sdks-java-io-kudu:spotlessJavaCheck
> Task :beam-sdks-java-io-kudu:spotlessCheck
> Task :beam-sdks-java-io-hadoop-format:spotlessJava
> Task :beam-sdks-java-io-hadoop-format:spotlessJavaCheck
> Task :beam-sdks-java-io-hadoop-format:spotlessCheck
> Task :beam-sdks-java-io-mqtt:spotlessJava
> Task :beam-sdks-java-io-mqtt:spotlessJavaCheck
> Task :beam-sdks-java-io-mqtt:spotlessCheck
> Task :beam-sdks-java-io-parquet:spotlessJava
> Task :beam-sdks-java-io-parquet:spotlessJavaCheck
> Task :beam-sdks-java-io-parquet:spotlessCheck
> Task :beam-sdks-java-io-mongodb:spotlessJava
> Task :beam-sdks-java-io-rabbitmq:spotlessJava
> Task :beam-sdks-java-harness:spotlessJava
> Task :beam-sdks-java-io-mongodb:spotlessJavaCheck
> Task :beam-sdks-java-harness:spotlessJavaCheck
> Task :beam-sdks-java-harness:spotlessCheck
> Task :beam-sdks-java-io-rabbitmq:spotlessJavaCheck
> Task :beam-sdks-java-io-rabbitmq:spotlessCheck
> Task :beam-sdks-java-io-mongodb:spotlessCheck
> Task :beam-sdks-java-io-solr:spotlessJava
> Task :beam-sdks-java-io-solr:spotlessJavaCheck
> Task :beam-sdks-java-io-solr:spotlessCheck
> Task :beam-sdks-java-io-redis:spotlessJava
> Task :beam-sdks-java-io-redis:spotlessJavaCheck
> Task :beam-sdks-java-io-redis:spotlessCheck
> Task :beam-sdks-java-maven-archetypes-examples:spotlessJava
> Task :beam-sdks-java-maven-archetypes-examples:spotlessJavaCheck
> Task :beam-sdks-java-maven-archetypes-examples:spotlessCheck
> Task :beam-sdks-java-maven-archetypes-starter:spotlessJava
> Task :beam-sdks-java-maven-archetypes-starter:spotlessJavaCheck
> Task :beam-sdks-java-maven-archetypes-starter:spotlessCheck
> Task :beam-sdks-java-io-tika:spotlessJava
> Task :beam-sdks-java-io-tika:spotlessJavaCheck
> Task :beam-sdks-java-io-tika:spotlessCheck
> Task :beam-sdks-java-test-utils:spotlessJava
> Task :beam-sdks-java-test-utils:spotlessJavaCheck
> Task :beam-sdks-java-test-utils:spotlessCheck
> Task :beam-vendor-sdks-java-extensions-protobuf:spotlessJava
> Task :beam-vendor-sdks-java-extensions-protobuf:spotlessJavaCheck
> Task :beam-vendor-sdks-java-extensions-protobuf:spotlessCheck
> Task :beam-sdks-java-load-tests:spotlessJava
> Task :beam-sdks-java-load-tests:spotlessJavaCheck
> Task :beam-sdks-java-load-tests:spotlessCheck
> Task :beam-sdks-java-io-synthetic:spotlessJava
> Task :beam-sdks-java-io-synthetic:spotlessJavaCheck
> Task :beam-sdks-java-io-synthetic:spotlessCheck
> Task :beam-sdks-java-io-kinesis:spotlessJava
> Task :beam-sdks-java-io-kinesis:spotlessJavaCheck
> Task :beam-sdks-java-io-kinesis:spotlessCheck
> Task :beam-sdks-java-io-xml:spotlessJava
> Task :beam-sdks-java-io-xml:spotlessJavaCheck
> Task :beam-sdks-java-io-xml:spotlessCheck
> Task :beam-sdks-java-io-kafka:spotlessJava
> Task :beam-sdks-java-io-kafka:spotlessJavaCheck
> Task :beam-sdks-java-io-kafka:spotlessCheck
> Task :beam-test-infra-metrics:spotlessGroovy
> Task :beam-test-infra-metrics:spotlessGroovyCheck
> Task :beam-test-infra-metrics:spotlessGroovyGradle
> Task :beam-test-infra-metrics:spotlessGroovyGradleCheck
> Task :beam-test-infra-metrics:spotlessCheck
> Task :beam-sdks-java-extensions-sql:spotlessJava
> Task :beam-sdks-java-extensions-sql:spotlessJavaCheck
> Task :beam-sdks-java-extensions-sql:spotlessCheck
> Task :beam-sdks-java-nexmark:spotlessJava
> Task :beam-sdks-java-nexmark:spotlessJavaCheck
> Task :beam-sdks-java-nexmark:spotlessCheck
> Task :beam-sdks-java-io-google-cloud-platform:spotlessJava
> Task :beam-sdks-java-io-google-cloud-platform:spotlessJavaCheck
> Task :beam-sdks-java-io-google-cloud-platform:spotlessCheck
> Task :beam-runners-google-cloud-dataflow-java-fn-api-worker:spotlessJava
> Task :beam-runners-google-cloud-dataflow-java-fn-api-worker:spotlessJavaCheck
> Task :beam-runners-google-cloud-dataflow-java-fn-api-worker:spotlessCheck
> Task :beam-sdks-java-core:spotlessJava FAILED

FAILURE: Build failed with an exception.

* What went wrong:
Execution failed for task ':beam-sdks-java-core:spotlessJava'.
> The following files had format violations:
      sdks/java/core/src/test/java/org/apache/beam/sdk/schemas/utils/TestPOJOs.java
          @@ -820,8 +820,7 @@
           
           ··/**·The·schema·for·{@link·PojoWithNestedArray}.·*/
           ··public·static·final·Schema·POJO_WITH_NESTED_ARRAY_SCHEMA·=
          -······Schema.builder().addArrayField("pojos",
          -··········FieldType.array(
          -··············FieldType.row(SIMPLE_POJO_SCHEMA)))
          -······.build();
          +······Schema.builder()
          +··········.addArrayField("pojos",·FieldType.array(FieldType.row(SIMPLE_POJO_SCHEMA)))
          +··········.build();
           }
      sdks/java/core/src/test/java/org/apache/beam/sdk/schemas/JavaFieldSchemaTest.java
          @@ -466,11 +466,10 @@
           
           ····SimplePOJO·simplePojo·=·createSimple("string");
           ····List<SimplePOJO>·simplePojoList·=·ImmutableList.of(simplePojo,·simplePojo);
          -····List<List<SimplePOJO>>·simplePojoListOfList·=
          -········ImmutableList.of(simplePojoList,·simplePojoList);
          +····List<List<SimplePOJO>>·simplePojoListOfList·=·ImmutableList.of(simplePojoList,·simplePojoList);
           
          -····PojoWithNestedArray·converted·=·registry.getFromRowFunction(PojoWithNestedArray.class)
          -········.apply(nestedRow);
          +····PojoWithNestedArray·converted·=
          +········registry.getFromRowFunction(PojoWithNestedArray.class).apply(nestedRow);
           ····assertEquals(simplePojoListOfList,·converted.pojos);
           ··}
           
          @@ -487,11 +486,12 @@
           
           ····SimplePOJO·simplePojo·=·createSimple("string");
           ····List<SimplePOJO>·simplePojoList·=·ImmutableList.of(simplePojo,·simplePojo);
          -····List<List<SimplePOJO>>·simplePojoListOfList·=
          -········ImmutableList.of(simplePojoList,·simplePojoList);
          +····List<List<SimplePOJO>>·simplePojoListOfList·=·ImmutableList.of(simplePojoList,·simplePojoList);
           
          -····Row·converted·=·registry.getToRowFunction(PojoWithNestedArray.class)
          -········.apply(new·PojoWithNestedArray(simplePojoListOfList));
          +····Row·converted·=
          +········registry
          +············.getToRowFunction(PojoWithNestedArray.class)
          +············.apply(new·PojoWithNestedArray(simplePojoListOfList));
           ····assertEquals(nestedRow,·converted);
           ··}
           }
  Run 'gradlew spotlessApply' to fix these violations.

* Try:
Run with --stacktrace option to get the stack trace. Run with --info or --debug option to
get more log output. Run with --scan to get full insights.

* Get more help at https://help.gradle.org

Deprecated Gradle features were used in this build, making it incompatible with Gradle 5.0.
Use '--warning-mode all' to show the individual deprecation warnings.
See https://docs.gradle.org/4.10.3/userguide/command_line_interface.html#sec:command_line_warnings

BUILD FAILED in 31s
82 actionable tasks: 82 executed

Publishing build scan...
https://gradle.com/s/pb7bjr4ezbqju

Build step 'Invoke Gradle script' changed build result to FAILURE
Build step 'Invoke Gradle script' marked build as failure

---------------------------------------------------------------------
To unsubscribe, e-mail: builds-unsubscribe@beam.apache.org
For additional commands, e-mail: builds-help@beam.apache.org


Mime
View raw message