beam-builds mailing list archives

Site index · List index
Message view « Date » · « Thread »
Top « Date » · « Thread »
From Apache Jenkins Server <jenk...@builds.apache.org>
Subject Build failed in Jenkins: beam_PostCommit_Java_PVR_Flink_Batch #453
Date Thu, 17 Jan 2019 00:09:28 GMT
See <https://builds.apache.org/job/beam_PostCommit_Java_PVR_Flink_Batch/453/display/redirect?page=changes>

Changes:

[klk] Turn off spotless paddedCell

------------------------------------------
[...truncated 6.71 KB...]
> Configure project :beam-model-job-management
applyPortabilityNature with [shadowJarValidationExcludes:[org/apache/beam/model/jobmanagement/v1/**]]
for project beam-model-job-management

> Task :beam-sdks-java-core:generateAvroProtocol NO-SOURCE
> Task :beam-sdks-java-fn-execution:processResources NO-SOURCE
> Task :beam-sdks-java-harness:processResources NO-SOURCE
> Task :beam-runners-core-construction-java:processResources NO-SOURCE
> Task :beam-runners-java-fn-execution:processResources NO-SOURCE
> Task :beam-runners-core-java:processResources NO-SOURCE
> Task :beam-sdks-java-extensions-google-cloud-platform-core:processResources NO-SOURCE
> Task :beam-vendor-sdks-java-extensions-protobuf:processResources NO-SOURCE
> Task :beam-runners-core-construction-java:processTestResources NO-SOURCE
> Task :beam-sdks-java-core:generateAvroJava NO-SOURCE
> Task :beam-runners-core-java:processTestResources NO-SOURCE
> Task :beam-model-job-management:extractProto
> Task :beam-model-fn-execution:extractProto
> Task :beam-sdks-java-io-google-cloud-platform:processResources NO-SOURCE
> Task :beam-sdks-java-extensions-protobuf:extractProto
> Task :beam-sdks-java-extensions-protobuf:processResources NO-SOURCE
> Task :beam-runners-reference-java:processResources NO-SOURCE
> Task :beam-runners-reference-java:processTestResources NO-SOURCE
> Task :beam-runners-flink_2.11:processResources
> Task :beam-model-job-management:processResources
> Task :beam-model-fn-execution:processResources
> Task :beam-runners-flink_2.11:processTestResources
> Task :beam-sdks-java-core:generateGrammarSource FROM-CACHE
> Task :beam-sdks-java-core:processResources
> Task :beam-sdks-java-core:generateTestAvroProtocol NO-SOURCE
> Task :beam-model-pipeline:extractIncludeProto
> Task :beam-model-pipeline:extractProto
> Task :beam-sdks-java-core:generateTestAvroJava
> Task :beam-sdks-java-core:generateTestGrammarSource NO-SOURCE
> Task :beam-sdks-java-core:processTestResources NO-SOURCE
> Task :beam-model-pipeline:generateProto
> Task :beam-model-pipeline:compileJava
> Task :beam-model-pipeline:processResources
> Task :beam-model-pipeline:classes
> Task :beam-model-pipeline:jar
> Task :beam-model-fn-execution:extractIncludeProto
> Task :beam-model-job-management:extractIncludeProto
> Task :beam-model-job-management:generateProto
> Task :beam-model-fn-execution:generateProto
> Task :beam-model-pipeline:shadowJar
> Task :beam-model-job-management:compileJava
> Task :beam-model-job-management:classes
> Task :beam-model-job-management:shadowJar
> Task :beam-model-fn-execution:compileJava
> Task :beam-model-fn-execution:classes
> Task :beam-model-fn-execution:shadowJar

> Task :beam-sdks-java-core:compileJava
Note: Some input files use or override a deprecated API.
Note: Recompile with -Xlint:deprecation for details.
Note: Some input files use unchecked or unsafe operations.
Note: Recompile with -Xlint:unchecked for details.

> Task :beam-sdks-java-core:classes
> Task :beam-sdks-java-core:shadowJar
> Task :beam-sdks-java-extensions-protobuf:extractIncludeProto
> Task :beam-sdks-java-extensions-protobuf:generateProto NO-SOURCE

> Task :beam-vendor-sdks-java-extensions-protobuf:compileJava
Note: Some input files use or override a deprecated API.
Note: Recompile with -Xlint:deprecation for details.

> Task :beam-vendor-sdks-java-extensions-protobuf:classes

> Task :beam-sdks-java-extensions-protobuf:compileJava
Note: Some input files use or override a deprecated API.
Note: Recompile with -Xlint:deprecation for details.

> Task :beam-sdks-java-extensions-protobuf:classes
> Task :beam-sdks-java-extensions-protobuf:shadowJar
> Task :beam-vendor-sdks-java-extensions-protobuf:shadowJar

> Task :beam-sdks-java-extensions-google-cloud-platform-core:compileJava
Note: <https://builds.apache.org/job/beam_PostCommit_Java_PVR_Flink_Batch/ws/src/sdks/java/extensions/google-cloud-platform-core/src/main/java/org/apache/beam/sdk/util/GcsUtil.java>
uses or overrides a deprecated API.
Note: Recompile with -Xlint:deprecation for details.

> Task :beam-sdks-java-extensions-google-cloud-platform-core:classes

> Task :beam-sdks-java-fn-execution:compileJava
Note: Some input files use or override a deprecated API.
Note: Recompile with -Xlint:deprecation for details.
Note: Some input files use unchecked or unsafe operations.
Note: Recompile with -Xlint:unchecked for details.

> Task :beam-sdks-java-fn-execution:classes
> Task :beam-sdks-java-fn-execution:shadowJar
> Task :beam-sdks-java-extensions-google-cloud-platform-core:shadowJar

> Task :beam-runners-core-construction-java:compileJava
Note: Some input files use or override a deprecated API.
Note: Recompile with -Xlint:deprecation for details.
Note: Some input files use unchecked or unsafe operations.
Note: Recompile with -Xlint:unchecked for details.

> Task :beam-runners-core-construction-java:classes
> Task :beam-runners-core-construction-java:shadowJar
> Task :beam-sdks-java-core:compileTestJava

> Task :beam-sdks-java-io-google-cloud-platform:compileJava
Note: Some input files use or override a deprecated API.
Note: Recompile with -Xlint:deprecation for details.
Note: Some input files use unchecked or unsafe operations.
Note: Recompile with -Xlint:unchecked for details.

> Task :beam-sdks-java-io-google-cloud-platform:classes
> Task :beam-sdks-java-io-google-cloud-platform:shadowJar

> Task :beam-runners-core-java:compileJava
Note: Some input files use or override a deprecated API.
Note: Recompile with -Xlint:deprecation for details.
Note: Some input files use unchecked or unsafe operations.
Note: Recompile with -Xlint:unchecked for details.

> Task :beam-runners-core-java:classes
> Task :beam-runners-core-java:shadowJar

> Task :beam-sdks-java-core:compileTestJava
Note: Some input files use or override a deprecated API.
Note: Recompile with -Xlint:deprecation for details.
Note: Some input files use unchecked or unsafe operations.
Note: Recompile with -Xlint:unchecked for details.

> Task :beam-sdks-java-core:testClasses

> Task :beam-runners-core-construction-java:compileTestJava
Note: Some input files use or override a deprecated API.
Note: Recompile with -Xlint:deprecation for details.
Note: Some input files use unchecked or unsafe operations.
Note: Recompile with -Xlint:unchecked for details.

> Task :beam-runners-core-construction-java:testClasses
> Task :beam-runners-core-construction-java:shadowTestJar

> Task :beam-sdks-java-harness:compileJava
Note: Some input files use or override a deprecated API.
Note: Recompile with -Xlint:deprecation for details.
Note: Some input files use unchecked or unsafe operations.
Note: Recompile with -Xlint:unchecked for details.

> Task :beam-sdks-java-harness:classes
> Task :beam-sdks-java-harness:jar
> Task :beam-sdks-java-core:shadowTestJar

> Task :beam-runners-core-java:compileTestJava
Note: Some input files use or override a deprecated API.
Note: Recompile with -Xlint:deprecation for details.
Note: Some input files use unchecked or unsafe operations.
Note: Recompile with -Xlint:unchecked for details.

> Task :beam-runners-core-java:testClasses
> Task :beam-runners-core-java:shadowTestJar
> Task :beam-sdks-java-harness:shadowJar

> Task :beam-runners-java-fn-execution:compileJava
Note: <https://builds.apache.org/job/beam_PostCommit_Java_PVR_Flink_Batch/ws/src/runners/java-fn-execution/src/main/java/org/apache/beam/runners/fnexecution/ServerFactory.java>
uses or overrides a deprecated API.
Note: Recompile with -Xlint:deprecation for details.
Note: Some input files use unchecked or unsafe operations.
Note: Recompile with -Xlint:unchecked for details.

> Task :beam-runners-java-fn-execution:classes
> Task :beam-runners-java-fn-execution:shadowJar
> Task :beam-runners-reference-java:compileJava
> Task :beam-runners-reference-java:classes
> Task :beam-runners-reference-java:shadowJar

> Task :beam-runners-reference-java:compileTestJava
Note: <https://builds.apache.org/job/beam_PostCommit_Java_PVR_Flink_Batch/ws/src/runners/reference/java/src/test/java/org/apache/beam/runners/reference/CloseableResourceTest.java>
uses or overrides a deprecated API.
Note: Recompile with -Xlint:deprecation for details.

> Task :beam-runners-reference-java:testClasses
> Task :beam-runners-reference-java:shadowTestJar

> Task :beam-runners-flink_2.11:compileJava
Note: Some input files use or override a deprecated API.
Note: Recompile with -Xlint:deprecation for details.
Note: Some input files use unchecked or unsafe operations.
Note: Recompile with -Xlint:unchecked for details.

> Task :beam-runners-flink_2.11:classes
> Task :beam-runners-flink_2.11:shadowJar

> Task :beam-runners-flink_2.11:compileTestJava
Note: Some input files use or override a deprecated API.
Note: Recompile with -Xlint:deprecation for details.
Note: Some input files use unchecked or unsafe operations.
Note: Recompile with -Xlint:unchecked for details.

> Task :beam-runners-flink_2.11:testClasses
> Task :beam-runners-flink_2.11:shadowTestJar
> Task :beam-runners-flink_2.11-job-server:validatesPortableRunnerBatch
Could not stop org.gradle.internal.actor.internal.DefaultActorFactory$NonBlockingActor@10900e97.
org.gradle.internal.dispatch.DispatchException: Could not dispatch message [MethodInvocation
method: stop()].
	at org.gradle.internal.dispatch.ExceptionTrackingFailureHandler.dispatchFailed(ExceptionTrackingFailureHandler.java:34)
	at org.gradle.internal.dispatch.FailureHandlingDispatch.dispatch(FailureHandlingDispatch.java:31)
	at org.gradle.internal.dispatch.AsyncDispatch.dispatchMessages(AsyncDispatch.java:133)
	at org.gradle.internal.dispatch.AsyncDispatch.access$000(AsyncDispatch.java:34)
	at org.gradle.internal.dispatch.AsyncDispatch$1.run(AsyncDispatch.java:73)
	at org.gradle.internal.operations.CurrentBuildOperationPreservingRunnable.run(CurrentBuildOperationPreservingRunnable.java:42)
	at org.gradle.internal.concurrent.ExecutorPolicy$CatchAndRecordFailures.onExecute(ExecutorPolicy.java:63)
	at org.gradle.internal.concurrent.ManagedExecutorImpl$1.run(ManagedExecutorImpl.java:46)
	at java.util.concurrent.ThreadPoolExecutor.runWorker(ThreadPoolExecutor.java:1149)
	at java.util.concurrent.ThreadPoolExecutor$Worker.run(ThreadPoolExecutor.java:624)
	at org.gradle.internal.concurrent.ThreadFactoryImpl$ManagedThreadRunnable.run(ThreadFactoryImpl.java:55)
	at java.lang.Thread.run(Thread.java:748)
Caused by: org.gradle.process.internal.ExecException: Process 'Gradle Test Executor 2' finished
with non-zero exit value 137
This problem might be caused by incorrect test process configuration.
Please refer to the test execution section in the user guide at https://docs.gradle.org/4.10.3/userguide/java_plugin.html#sec:test_execution
	at org.gradle.api.internal.tasks.testing.worker.ForkingTestClassProcessor.stop(ForkingTestClassProcessor.java:155)
	at org.gradle.api.internal.tasks.testing.processors.RestartEveryNTestClassProcessor.endBatch(RestartEveryNTestClassProcessor.java:77)
	at org.gradle.api.internal.tasks.testing.processors.RestartEveryNTestClassProcessor.stop(RestartEveryNTestClassProcessor.java:62)
	at sun.reflect.NativeMethodAccessorImpl.invoke0(Native Method)
	at sun.reflect.NativeMethodAccessorImpl.invoke(NativeMethodAccessorImpl.java:62)
	at sun.reflect.DelegatingMethodAccessorImpl.invoke(DelegatingMethodAccessorImpl.java:43)
	at java.lang.reflect.Method.invoke(Method.java:498)
	at org.gradle.internal.dispatch.ReflectionDispatch.dispatch(ReflectionDispatch.java:35)
	at org.gradle.internal.dispatch.ReflectionDispatch.dispatch(ReflectionDispatch.java:24)
	at org.gradle.internal.dispatch.FailureHandlingDispatch.dispatch(FailureHandlingDispatch.java:29)
	... 10 more

> Task :beam-runners-flink_2.11-job-server:validatesPortableRunnerBatch FAILED

FAILURE: Build failed with an exception.

* What went wrong:
Execution failed for task ':beam-runners-flink_2.11-job-server:validatesPortableRunnerBatch'.
> Process 'Gradle Test Executor 1' finished with non-zero exit value 137
  This problem might be caused by incorrect test process configuration.
  Please refer to the test execution section in the user guide at https://docs.gradle.org/4.10.3/userguide/java_plugin.html#sec:test_execution

* Try:
Run with --stacktrace option to get the stack trace. Run with --info or --debug option to
get more log output. Run with --scan to get full insights.

* Get more help at https://help.gradle.org

Deprecated Gradle features were used in this build, making it incompatible with Gradle 5.0.
Use '--warning-mode all' to show the individual deprecation warnings.
See https://docs.gradle.org/4.10.3/userguide/command_line_interface.html#sec:command_line_warnings

BUILD FAILED in 12m 51s
62 actionable tasks: 61 executed, 1 from cache

Publishing build scan...
https://gradle.com/s/eoltqbphocwle

Build step 'Invoke Gradle script' changed build result to FAILURE
Build step 'Invoke Gradle script' marked build as failure

---------------------------------------------------------------------
To unsubscribe, e-mail: builds-unsubscribe@beam.apache.org
For additional commands, e-mail: builds-help@beam.apache.org


Mime
View raw message