beam-builds mailing list archives

Site index · List index
Message view « Date » · « Thread »
Top « Date » · « Thread »
From Apache Jenkins Server <jenk...@builds.apache.org>
Subject Build failed in Jenkins: beam_Release_NightlySnapshot #288
Date Wed, 02 Jan 2019 08:19:32 GMT
See <https://builds.apache.org/job/beam_Release_NightlySnapshot/288/display/redirect>

------------------------------------------
[...truncated 52.01 MB...]
  No history is available.
:beam-vendor-sdks-java-extensions-protobuf:validateShadedJarDoesntLeakNonProjectClasses (Thread[Task
worker for ':' Thread 3,5,main]) completed. Took 0.052 secs.
:beam-vendor-sdks-java-extensions-protobuf:check (Thread[Task worker for ':' Thread 3,5,main])
started.

> Task :beam-vendor-sdks-java-extensions-protobuf:check
Skipping task ':beam-vendor-sdks-java-extensions-protobuf:check' as it has no actions.
:beam-vendor-sdks-java-extensions-protobuf:check (Thread[Task worker for ':' Thread 3,5,main])
completed. Took 0.0 secs.
:beam-vendor-sdks-java-extensions-protobuf:build (Thread[Task worker for ':' Thread 3,5,main])
started.

> Task :beam-vendor-sdks-java-extensions-protobuf:build
Skipping task ':beam-vendor-sdks-java-extensions-protobuf:build' as it has no actions.
:beam-vendor-sdks-java-extensions-protobuf:build (Thread[Task worker for ':' Thread 3,5,main])
completed. Took 0.0 secs.
:beam-website:assemble (Thread[Task worker for ':' Thread 3,5,main]) started.

> Task :beam-website:assemble UP-TO-DATE
Skipping task ':beam-website:assemble' as it has no actions.
:beam-website:assemble (Thread[Task worker for ':' Thread 3,5,main]) completed. Took 0.0 secs.
:beam-website:setupBuildDir (Thread[Task worker for ':' Thread 3,5,main]) started.

> Task :beam-website:setupBuildDir
Build cache key for task ':beam-website:setupBuildDir' is fb2b365f958e0219d3a886db810dc756
Caching disabled for task ':beam-website:setupBuildDir': Caching has not been enabled for
the task
Task ':beam-website:setupBuildDir' is not up-to-date because:
  No history is available.
:beam-website:setupBuildDir (Thread[Task worker for ':' Thread 3,5,main]) completed. Took
0.003 secs.
:beam-website:buildDockerImage (Thread[Task worker for ':' Thread 3,5,main]) started.

> Task :beam-website:buildDockerImage
Caching disabled for task ':beam-website:buildDockerImage': Caching has not been enabled for
the task
Task ':beam-website:buildDockerImage' is not up-to-date because:
  Task has not declared any outputs despite executing actions.
Starting process 'command 'docker''. Working directory: <https://builds.apache.org/job/beam_Release_NightlySnapshot/ws/src/website>
Command: docker build -t beam-website .
Successfully started process 'command 'docker''
Sending build context to Docker daemon  26.38MB
Step 1/7 : FROM ruby:2.5
2.5: Pulling from library/ruby
Digest: sha256:4fe61c638dec4dc1d16935325586166b4a87a3aaa1c5a0a40db39a908eae70c5
Status: Downloaded newer image for ruby:2.5
 ---> 6fc6e4e7a8ee
Step 2/7 : WORKDIR /ruby
 ---> Using cache
 ---> 02f2084d28a7
Step 3/7 : RUN gem install bundler
 ---> Using cache
 ---> 9f6d4f024078
Step 4/7 : ADD Gemfile Gemfile.lock /ruby/
 ---> Using cache
 ---> 02947ced8118
Step 5/7 : RUN bundle install --deployment --path $GEM_HOME
 ---> Using cache
 ---> f86af58badd2
Step 6/7 : ENV LC_ALL C.UTF-8
 ---> Using cache
 ---> 0139da03e033
Step 7/7 : CMD sleep 3600
 ---> Using cache
 ---> eb2a64a18444
Successfully built eb2a64a18444
Successfully tagged beam-website:latest
:beam-website:buildDockerImage (Thread[Task worker for ':' Thread 3,5,main]) completed. Took
0.954 secs.
:beam-website:createDockerContainer (Thread[Task worker for ':' Thread 3,5,main]) started.

> Task :beam-website:createDockerContainer
Caching disabled for task ':beam-website:createDockerContainer': Caching has not been enabled
for the task
Task ':beam-website:createDockerContainer' is not up-to-date because:
  Task has not declared any outputs despite executing actions.
Starting process 'command '/bin/bash''. Working directory: <https://builds.apache.org/job/beam_Release_NightlySnapshot/ws/src/website>
Command: /bin/bash -c docker create -v <https://builds.apache.org/job/beam_Release_NightlySnapshot/ws/src>:/repo
-u $(id -u):$(id -g)  beam-website
Successfully started process 'command '/bin/bash''
:beam-website:createDockerContainer (Thread[Task worker for ':' Thread 3,5,main]) completed.
Took 1.34 secs.
:beam-website:startDockerContainer (Thread[Task worker for ':' Thread 3,5,main]) started.

> Task :beam-website:startDockerContainer
Caching disabled for task ':beam-website:startDockerContainer': Caching has not been enabled
for the task
Task ':beam-website:startDockerContainer' is not up-to-date because:
  Task has not declared any outputs despite executing actions.
Starting process 'command 'docker''. Working directory: <https://builds.apache.org/job/beam_Release_NightlySnapshot/ws/src/website>
Command: docker start d61003ba1072a1450a0f066f116a3a6cd1f00ae07ce4df675e90941f25718b27
Successfully started process 'command 'docker''
d61003ba1072a1450a0f066f116a3a6cd1f00ae07ce4df675e90941f25718b27
:beam-website:startDockerContainer (Thread[Task worker for ':' Thread 3,5,main]) completed.
Took 0.287 secs.
:beam-website:buildLocalWebsite (Thread[Task worker for ':' Thread 3,5,main]) started.

> Task :beam-website:buildLocalWebsite
Build cache key for task ':beam-website:buildLocalWebsite' is 4ac80d17dfba1e1bc7ab01c6d9794eda
Caching disabled for task ':beam-website:buildLocalWebsite': Caching has not been enabled
for the task
Task ':beam-website:buildLocalWebsite' is not up-to-date because:
  No history is available.
Starting process 'command 'docker''. Working directory: <https://builds.apache.org/job/beam_Release_NightlySnapshot/ws/src/website>
Command: docker exec d61003ba1072a1450a0f066f116a3a6cd1f00ae07ce4df675e90941f25718b27 /bin/bash
-c cd /repo/build/website &&         bundle exec jekyll build 	--destination generated-local-content
        --config /repo/website/_config.yml,/repo/website/_config_test.yml         --incremental
         --source /repo/website/src
        
Successfully started process 'command 'docker''
`/` is not writable.
Bundler will use `/tmp/bundler/home/unknown' as your home directory temporarily.
Configuration file: /repo/website/_config.yml
Configuration file: /repo/website/_config_test.yml
            Source: /repo/website/src
       Destination: generated-local-content
 Incremental build: enabled
      Generating... 
                    done in 11.229 seconds.
 Auto-regeneration: disabled. Use --watch to enable.
:beam-website:buildLocalWebsite (Thread[Task worker for ':' Thread 3,5,main]) completed. Took
12.479 secs.
:beam-website:testWebsite (Thread[Task worker for ':' Thread 3,5,main]) started.

> Task :beam-website:testWebsite
Caching disabled for task ':beam-website:testWebsite': Caching has not been enabled for the
task
Task ':beam-website:testWebsite' is not up-to-date because:
  Task has not declared any outputs despite executing actions.
Starting process 'command 'docker''. Working directory: <https://builds.apache.org/job/beam_Release_NightlySnapshot/ws/src/website>
Command: docker exec d61003ba1072a1450a0f066f116a3a6cd1f00ae07ce4df675e90941f25718b27 /bin/bash
-c cd /repo/build/website &&       bundle exec rake test
Successfully started process 'command 'docker''
`/` is not writable.
Bundler will use `/tmp/bundler/home/unknown' as your home directory temporarily.
Running ["ImageCheck", "ScriptCheck", "LinkCheck", "HtmlCheck"] on ["./generated-local-content"]
on *.html... 


Checking 737 external links...
Ran on 181 files!


- ./generated-local-content/blog/2018/10/29/beam-2.8.0.html
  *  External link https://beam.apache.org/roadmap/portability/#python-on-flink failed: got
a time out (response code 0)
rake aborted!
HTML-Proofer found 1 failure!
/usr/local/bundle/ruby/2.5.0/gems/html-proofer-3.8.0/lib/html-proofer/runner.rb:167:in `print_failed_tests'
/usr/local/bundle/ruby/2.5.0/gems/html-proofer-3.8.0/lib/html-proofer/runner.rb:48:in `run'
/repo/build/website/Rakefile:23:in `block in <top (required)>'
/usr/local/bundle/ruby/2.5.0/gems/rake-12.3.0/exe/rake:27:in `<top (required)>'
/usr/local/bundle/bin/bundle:23:in `load'
/usr/local/bundle/bin/bundle:23:in `<main>'
Tasks: TOP => test
(See full trace by running task with --trace)

> Task :beam-website:testWebsite FAILED
:beam-website:testWebsite (Thread[Task worker for ':' Thread 3,5,main]) completed. Took 2
mins 0.801 secs.
:beam-website:stopAndRemoveDockerContainer (Thread[Task worker for ':' Thread 3,5,main]) started.

> Task :beam-website:stopAndRemoveDockerContainer
Caching disabled for task ':beam-website:stopAndRemoveDockerContainer': Caching has not been
enabled for the task
Task ':beam-website:stopAndRemoveDockerContainer' is not up-to-date because:
  Task has not declared any outputs despite executing actions.
Starting process 'command 'docker''. Working directory: <https://builds.apache.org/job/beam_Release_NightlySnapshot/ws/src/website>
Command: docker rm -f d61003ba1072a1450a0f066f116a3a6cd1f00ae07ce4df675e90941f25718b27
Successfully started process 'command 'docker''
d61003ba1072a1450a0f066f116a3a6cd1f00ae07ce4df675e90941f25718b27
:beam-website:stopAndRemoveDockerContainer (Thread[Task worker for ':' Thread 3,5,main]) completed.
Took 0.353 secs.
:beam-website:buildWebsite (Thread[Task worker for ':' Thread 3,5,main]) started.

> Task :beam-website:buildWebsite
Skipping task ':beam-website:buildWebsite' as it has no actions.
:beam-website:buildWebsite (Thread[Task worker for ':' Thread 3,5,main]) completed. Took 0.0
secs.
:release:compileJava (Thread[Task worker for ':' Thread 3,5,main]) started.

> Task :release:compileJava NO-SOURCE
file or directory '<https://builds.apache.org/job/beam_Release_NightlySnapshot/ws/src/release/src/main/java',>
not found
Skipping task ':release:compileJava' as it has no source files and no previous output files.
:release:compileJava (Thread[Task worker for ':' Thread 3,5,main]) completed. Took 0.001 secs.
:release:compileGroovy (Thread[Task worker for ':' Thread 3,5,main]) started.

> Task :release:compileGroovy FROM-CACHE
Build cache key for task ':release:compileGroovy' is 963c3c0cb4a5245ed10f6e321c75ed98
Task ':release:compileGroovy' is not up-to-date because:
  No history is available.
Origin for task ':release:compileGroovy': {executionTime=2334, hostName=apache-beam-jenkins-slave-group-jgm6,
operatingSystem=Linux, buildInvocationId=st3kxejg5nalrbm6iymbsv3q6u, creationTime=1544862885897,
type=org.gradle.api.tasks.compile.GroovyCompile_Decorated, userName=jenkins, gradleVersion=4.10.2,
rootPath=<https://builds.apache.org/job/beam_Release_NightlySnapshot/ws/src,> path=:release:compileGroovy}
Unpacked output for task ':release:compileGroovy' from cache.
:release:compileGroovy (Thread[Task worker for ':' Thread 3,5,main]) completed. Took 0.01
secs.
:release:processResources (Thread[Task worker for ':' Thread 3,5,main]) started.

> Task :release:processResources NO-SOURCE
file or directory '<https://builds.apache.org/job/beam_Release_NightlySnapshot/ws/src/release/src/main/resources',>
not found
Skipping task ':release:processResources' as it has no source files and no previous output
files.
:release:processResources (Thread[Task worker for ':' Thread 3,5,main]) completed. Took 0.0
secs.
:release:classes (Thread[Task worker for ':' Thread 3,5,main]) started.

> Task :release:classes UP-TO-DATE
Skipping task ':release:classes' as it has no actions.
:release:classes (Thread[Task worker for ':' Thread 3,5,main]) completed. Took 0.0 secs.
:release:jar (Thread[Task worker for ':' Thread 3,5,main]) started.

> Task :release:jar
Build cache key for task ':release:jar' is 1a942f3268d9202c85aa89fb3487ff7e
Caching disabled for task ':release:jar': Caching has not been enabled for the task
Task ':release:jar' is not up-to-date because:
  No history is available.
:release:jar (Thread[Task worker for ':' Thread 3,5,main]) completed. Took 0.007 secs.
:release:assemble (Thread[Task worker for ':' Thread 3,5,main]) started.

> Task :release:assemble
Skipping task ':release:assemble' as it has no actions.
:release:assemble (Thread[Task worker for ':' Thread 3,5,main]) completed. Took 0.0 secs.
:release:compileTestJava (Thread[Task worker for ':' Thread 3,5,main]) started.

> Task :release:compileTestJava NO-SOURCE
file or directory '<https://builds.apache.org/job/beam_Release_NightlySnapshot/ws/src/release/src/test/java',>
not found
Skipping task ':release:compileTestJava' as it has no source files and no previous output
files.
:release:compileTestJava (Thread[Task worker for ':' Thread 3,5,main]) completed. Took 0.0
secs.
:release:compileTestGroovy (Thread[Task worker for ':' Thread 3,5,main]) started.

> Task :release:compileTestGroovy NO-SOURCE
file or directory '<https://builds.apache.org/job/beam_Release_NightlySnapshot/ws/src/release/src/test/groovy',>
not found
Skipping task ':release:compileTestGroovy' as it has no source files and no previous output
files.
:release:compileTestGroovy (Thread[Task worker for ':' Thread 3,5,main]) completed. Took 0.0
secs.
:release:processTestResources (Thread[Task worker for ':' Thread 3,5,main]) started.

> Task :release:processTestResources NO-SOURCE
file or directory '<https://builds.apache.org/job/beam_Release_NightlySnapshot/ws/src/release/src/test/resources',>
not found
Skipping task ':release:processTestResources' as it has no source files and no previous output
files.
:release:processTestResources (Thread[Task worker for ':' Thread 3,5,main]) completed. Took
0.0 secs.
:release:testClasses (Thread[Task worker for ':' Thread 3,5,main]) started.

> Task :release:testClasses UP-TO-DATE
Skipping task ':release:testClasses' as it has no actions.
:release:testClasses (Thread[Task worker for ':' Thread 3,5,main]) completed. Took 0.0 secs.
:release:test (Thread[Task worker for ':' Thread 3,5,main]) started.

> Task :release:test NO-SOURCE
Skipping task ':release:test' as it has no source files and no previous output files.
:release:test (Thread[Task worker for ':' Thread 3,5,main]) completed. Took 0.0 secs.
:release:check (Thread[Task worker for ':' Thread 3,5,main]) started.

> Task :release:check UP-TO-DATE
Skipping task ':release:check' as it has no actions.
:release:check (Thread[Task worker for ':' Thread 3,5,main]) completed. Took 0.0 secs.
:release:build (Thread[Task worker for ':' Thread 3,5,main]) started.

> Task :release:build
Skipping task ':release:build' as it has no actions.
:release:build (Thread[Task worker for ':' Thread 3,5,main]) completed. Took 0.0 secs.

FAILURE: Build failed with an exception.

* What went wrong:
Execution failed for task ':beam-website:testWebsite'.
> Process 'command 'docker'' finished with non-zero exit value 1

* Try:
Run with --stacktrace option to get the stack trace. Run with --debug option to get more log
output. Run with --scan to get full insights.

* Get more help at https://help.gradle.org

Deprecated Gradle features were used in this build, making it incompatible with Gradle 5.0.
Use '--warning-mode all' to show the individual deprecation warnings.
See https://docs.gradle.org/4.10.2/userguide/command_line_interface.html#sec:command_line_warnings

BUILD FAILED in 1h 18m 51s
958 actionable tasks: 945 executed, 11 from cache, 2 up-to-date

Publishing build scan...
https://gradle.com/s/hxodpoiryeswq

Closing Git repo: <https://builds.apache.org/job/beam_Release_NightlySnapshot/ws/src/.git>
Build step 'Invoke Gradle script' changed build result to FAILURE
Build step 'Invoke Gradle script' marked build as failure

---------------------------------------------------------------------
To unsubscribe, e-mail: builds-unsubscribe@beam.apache.org
For additional commands, e-mail: builds-help@beam.apache.org


Mime
View raw message