beam-builds mailing list archives

Site index · List index
Message view « Date » · « Thread »
Top « Date » · « Thread »
From Apache Jenkins Server <jenk...@builds.apache.org>
Subject Build failed in Jenkins: beam_PostCommit_Java_ValidatesRunner_PortabilityApi_Dataflow #459
Date Mon, 07 Jan 2019 03:51:25 GMT
See <https://builds.apache.org/job/beam_PostCommit_Java_ValidatesRunner_PortabilityApi_Dataflow/459/display/redirect>

------------------------------------------
[...truncated 32.23 KB...]
Resolving github.com/xordataexchange/crypt: commit='b2862e3d0a775f18c7cfe02273500ae307b61218',
urls=[https://github.com/xordataexchange/crypt.git, git@github.com:xordataexchange/crypt.git]
Resolving go.opencensus.io: commit='aa2b39d1618ef56ba156f27cfcdae9042f68f0bc', urls=[https://github.com/census-instrumentation/opencensus-go]
Resolving golang.org/x/crypto: commit='d9133f5469342136e669e85192a26056b587f503', urls=[https://go.googlesource.com/crypto]
Resolving golang.org/x/debug: commit='95515998a8a4bd7448134b2cb5971dbeb12e0b77', urls=[https://go.googlesource.com/debug]

> Task :beam-sdks-java-core:shadowJar

> Task :beam-sdks-go:resolveBuildDependencies
Resolving golang.org/x/net: commit='2fb46b16b8dda405028c50f7c7f0f9dd1fa6bfb1', urls=[https://go.googlesource.com/net]
Resolving golang.org/x/oauth2: commit='a032972e28060ca4f5644acffae3dfc268cc09db', urls=[https://go.googlesource.com/oauth2]
Resolving golang.org/x/sync: commit='fd80eb99c8f653c847d294a001bdf2a3a6f768f5', urls=[https://go.googlesource.com/sync]

> Task :beam-sdks-java-extensions-protobuf:extractIncludeProto
> Task :beam-sdks-java-extensions-protobuf:generateProto NO-SOURCE

> Task :beam-sdks-go:resolveBuildDependencies
Resolving golang.org/x/sys: commit='37707fdb30a5b38865cfb95e5aab41707daec7fd', urls=[https://go.googlesource.com/sys]
Resolving cached github.com/coreos/etcd: commit='11214aa33bf5a47d3d9d8dafe0f6b97237dfe921',
urls=[https://github.com/coreos/etcd.git, git@github.com:coreos/etcd.git]
Resolving cached github.com/coreos/etcd: commit='11214aa33bf5a47d3d9d8dafe0f6b97237dfe921',
urls=[https://github.com/coreos/etcd.git, git@github.com:coreos/etcd.git]

> Task :beam-sdks-java-extensions-protobuf:compileJava
Note: Some input files use or override a deprecated API.
Note: Recompile with -Xlint:deprecation for details.

> Task :beam-vendor-sdks-java-extensions-protobuf:compileJava
Note: Some input files use or override a deprecated API.
Note: Recompile with -Xlint:deprecation for details.

> Task :beam-sdks-java-extensions-protobuf:classes
> Task :beam-vendor-sdks-java-extensions-protobuf:classes

> Task :beam-sdks-java-fn-execution:compileJava
Note: Some input files use or override a deprecated API.
Note: Recompile with -Xlint:deprecation for details.
Note: Some input files use unchecked or unsafe operations.
Note: Recompile with -Xlint:unchecked for details.

> Task :beam-sdks-java-fn-execution:classes
> Task :beam-vendor-sdks-java-extensions-protobuf:shadowJar
> Task :beam-sdks-java-extensions-protobuf:shadowJar

> Task :beam-sdks-java-extensions-google-cloud-platform-core:compileJava
Note: <https://builds.apache.org/job/beam_PostCommit_Java_ValidatesRunner_PortabilityApi_Dataflow/ws/src/sdks/java/extensions/google-cloud-platform-core/src/main/java/org/apache/beam/sdk/util/GcsUtil.java>
uses or overrides a deprecated API.
Note: Recompile with -Xlint:deprecation for details.

> Task :beam-sdks-java-extensions-google-cloud-platform-core:classes
> Task :beam-sdks-java-fn-execution:shadowJar
> Task :beam-sdks-java-extensions-google-cloud-platform-core:shadowJar

> Task :beam-runners-core-construction-java:compileJava
Note: Some input files use or override a deprecated API.
Note: Recompile with -Xlint:deprecation for details.
Note: Some input files use unchecked or unsafe operations.
Note: Recompile with -Xlint:unchecked for details.

> Task :beam-runners-core-construction-java:classes
> Task :beam-runners-core-construction-java:shadowJar
> Task :beam-sdks-java-core:compileTestJava

> Task :beam-sdks-java-io-google-cloud-platform:compileJava
Note: Some input files use or override a deprecated API.
Note: Recompile with -Xlint:deprecation for details.
Note: Some input files use unchecked or unsafe operations.
Note: Recompile with -Xlint:unchecked for details.

> Task :beam-sdks-java-io-google-cloud-platform:classes
> Task :beam-sdks-java-io-google-cloud-platform:shadowJar

> Task :beam-runners-core-java:compileJava
Note: Some input files use or override a deprecated API.
Note: Recompile with -Xlint:deprecation for details.
Note: Some input files use unchecked or unsafe operations.
Note: Recompile with -Xlint:unchecked for details.

> Task :beam-runners-core-java:classes

> Task :beam-sdks-java-core:compileTestJava
Note: Some input files use or override a deprecated API.
Note: Recompile with -Xlint:deprecation for details.
Note: Some input files use unchecked or unsafe operations.
Note: Recompile with -Xlint:unchecked for details.

> Task :beam-runners-core-java:shadowJar
> Task :beam-sdks-java-core:testClasses

> Task :beam-runners-google-cloud-dataflow-java:compileJava
Note: Some input files use or override a deprecated API.
Note: Recompile with -Xlint:deprecation for details.
Note: Some input files use unchecked or unsafe operations.
Note: Recompile with -Xlint:unchecked for details.

> Task :beam-runners-google-cloud-dataflow-java:classes

> Task :beam-sdks-java-harness:compileJava
Note: Some input files use or override a deprecated API.
Note: Recompile with -Xlint:deprecation for details.
Note: Some input files use unchecked or unsafe operations.
Note: Recompile with -Xlint:unchecked for details.

> Task :beam-sdks-java-harness:classes
> Task :beam-runners-google-cloud-dataflow-java:shadowJar
> Task :beam-sdks-java-core:shadowTestJar

> Task :beam-sdks-go:resolveBuildDependencies
Resolving google.golang.org/api: commit='386d4e5f4f92f86e6aec85985761bba4b938a2d5', urls=[https://code.googlesource.com/google-api-go-client]

> Task :beam-sdks-java-harness:shadowJar
> Task :beam-sdks-java-harness:jar
> Task :beam-sdks-java-container:copyDockerfileDependencies

> Task :beam-sdks-go:resolveBuildDependencies
Resolving google.golang.org/genproto: commit='2b5a72b8730b0b16380010cfe5286c42108d88e7', urls=[https://github.com/google/go-genproto]
Resolving google.golang.org/grpc: commit='7646b5360d049a7ca31e9133315db43456f39e2e', urls=[https://github.com/grpc/grpc-go]
Resolving cached github.com/coreos/etcd: commit='11214aa33bf5a47d3d9d8dafe0f6b97237dfe921',
urls=[https://github.com/coreos/etcd.git, git@github.com:coreos/etcd.git]
Resolving cached github.com/coreos/etcd: commit='11214aa33bf5a47d3d9d8dafe0f6b97237dfe921',
urls=[https://github.com/coreos/etcd.git, git@github.com:coreos/etcd.git]

> Task :beam-runners-java-fn-execution:compileJava
Note: <https://builds.apache.org/job/beam_PostCommit_Java_ValidatesRunner_PortabilityApi_Dataflow/ws/src/runners/java-fn-execution/src/main/java/org/apache/beam/runners/fnexecution/ServerFactory.java>
uses or overrides a deprecated API.
Note: Recompile with -Xlint:deprecation for details.
Note: Some input files use unchecked or unsafe operations.
Note: Recompile with -Xlint:unchecked for details.

> Task :beam-runners-java-fn-execution:classes
> Task :beam-runners-java-fn-execution:shadowJar
> Task :beam-sdks-go:installDependencies

> Task :beam-runners-google-cloud-dataflow-java-fn-api-worker:compileJava
Note: Some input files use or override a deprecated API.
Note: Recompile with -Xlint:deprecation for details.
Note: Some input files use unchecked or unsafe operations.
Note: Recompile with -Xlint:unchecked for details.

> Task :beam-runners-google-cloud-dataflow-java-fn-api-worker:classes
> Task :beam-runners-google-cloud-dataflow-java-fn-api-worker:shadowJar
> Task :beam-sdks-go:buildLinuxAmd64
> Task :beam-sdks-go:build

> Task :beam-sdks-java-container:resolveBuildDependencies
Resolving ./github.com/apache/beam/sdks/go@<https://builds.apache.org/job/beam_PostCommit_Java_ValidatesRunner_PortabilityApi_Dataflow/ws/src/sdks/go>

> Task :beam-sdks-java-container:installDependencies
> Task :beam-sdks-java-container:buildLinuxAmd64
> Task :beam-sdks-java-container:build
> Task :beam-sdks-java-container:dockerPrepare
> Task :beam-sdks-java-container:docker

> Task :beam-runners-google-cloud-dataflow-java:buildAndPushDockerContainer
WARNING: `gcloud docker` will not be supported for Docker client versions above 18.03.

As an alternative, use `gcloud auth configure-docker` to configure `docker` to
use `gcloud` as a credential helper, then use `docker` as you would for non-GCR
registries, e.g. `docker pull gcr.io/project-id/my-image`. Add
`--verbosity=error` to silence this warning: `gcloud docker
--verbosity=error -- pull gcr.io/project-id/my-image`.

See: https://cloud.google.com/container-registry/docs/support/deprecation-notices#gcloud-docker

The push refers to a repository [us.gcr.io/apache-beam-testing/java-postcommit-it/java]
09776821a6e3: Preparing
93d05b15f165: Preparing
7a7de6ebcf4e: Preparing
423122a40c81: Preparing
08b1513fa90e: Preparing
38af37073821: Preparing
a7702ebc484e: Preparing
7b1186903462: Preparing
d2217ead3a1c: Preparing
b53b57a50746: Preparing
d2518892581f: Preparing
c581f4ede92d: Preparing
38af37073821: Waiting
a7702ebc484e: Waiting
7b1186903462: Waiting
d2518892581f: Waiting
d2217ead3a1c: Waiting
b53b57a50746: Waiting
08b1513fa90e: Layer already exists
38af37073821: Layer already exists
a7702ebc484e: Layer already exists
7b1186903462: Layer already exists
d2217ead3a1c: Layer already exists
b53b57a50746: Layer already exists
423122a40c81: Pushed
c581f4ede92d: Layer already exists
7a7de6ebcf4e: Pushed
d2518892581f: Layer already exists
09776821a6e3: Pushed
93d05b15f165: Pushed
20190107000019: digest: sha256:28a7727712822039271259f17618ac9ca6bf5c8f6814e7af3061a22eecce2cd4
size: 2841

> Task :beam-runners-google-cloud-dataflow-java:validatesRunnerFnApiWorkerExecutableStageTest

org.apache.beam.sdk.transforms.FlattenTest > testFlattenIterables FAILED
    java.lang.RuntimeException at FlattenTest.java:252

org.apache.beam.sdk.transforms.FlattenTest > testFlattenIterablesSets FAILED
    java.lang.RuntimeException at FlattenTest.java:280

org.apache.beam.sdk.transforms.FlattenTest > testFlattenPCollectionsEmptyThenParDo FAILED
    java.lang.RuntimeException at FlattenTest.java:224

71 tests completed, 3 failed, 1 skipped

> Task :beam-runners-google-cloud-dataflow-java:validatesRunnerFnApiWorkerExecutableStageTest
FAILED

> Task :beam-runners-google-cloud-dataflow-java:cleanUpDockerImages FAILED
Untagged: us.gcr.io/apache-beam-testing/java-postcommit-it/java:20190107000019
Untagged: us.gcr.io/apache-beam-testing/java-postcommit-it/java@sha256:28a7727712822039271259f17618ac9ca6bf5c8f6814e7af3061a22eecce2cd4
ERROR: (gcloud.container.images.delete) [us.gcr.io/apache-beam-testing/java-postcommit-it/java:20190107000019]
is not a valid name. Expected tag in the form "base:tag" or "tag" or digest in the form "sha256:<digest>"

FAILURE: Build completed with 2 failures.

1: Task failed with an exception.
-----------
* What went wrong:
Execution failed for task ':beam-runners-google-cloud-dataflow-java:validatesRunnerFnApiWorkerExecutableStageTest'.
> There were failing tests. See the report at: file://<https://builds.apache.org/job/beam_PostCommit_Java_ValidatesRunner_PortabilityApi_Dataflow/ws/src/runners/google-cloud-dataflow-java/build/reports/tests/validatesRunnerFnApiWorkerExecutableStageTest/index.html>

* Try:
Run with --stacktrace option to get the stack trace. Run with --info or --debug option to
get more log output. Run with --scan to get full insights.
==============================================================================

2: Task failed with an exception.
-----------
* Where:
Build file '<https://builds.apache.org/job/beam_PostCommit_Java_ValidatesRunner_PortabilityApi_Dataflow/ws/src/runners/google-cloud-dataflow-java/build.gradle'>
line: 459

* What went wrong:
Execution failed for task ':beam-runners-google-cloud-dataflow-java:cleanUpDockerImages'.
> Process 'command 'gcloud'' finished with non-zero exit value 1

* Try:
Run with --stacktrace option to get the stack trace. Run with --info or --debug option to
get more log output. Run with --scan to get full insights.
==============================================================================

* Get more help at https://help.gradle.org

Deprecated Gradle features were used in this build, making it incompatible with Gradle 5.0.
Use '--warning-mode all' to show the individual deprecation warnings.
See https://docs.gradle.org/4.10.3/userguide/command_line_interface.html#sec:command_line_warnings

BUILD FAILED in 3h 51m 15s
75 actionable tasks: 69 executed, 5 from cache, 1 up-to-date

Publishing build scan...
https://gradle.com/s/2sng2tbn5bkhi

Build step 'Invoke Gradle script' changed build result to FAILURE
Build step 'Invoke Gradle script' marked build as failure

---------------------------------------------------------------------
To unsubscribe, e-mail: builds-unsubscribe@beam.apache.org
For additional commands, e-mail: builds-help@beam.apache.org


Mime
View raw message