beam-builds mailing list archives

Site index · List index
Message view « Date » · « Thread »
Top « Date » · « Thread »
From Apache Jenkins Server <jenk...@builds.apache.org>
Subject Build failed in Jenkins: beam_PreCommit_Java_Cron #775
Date Wed, 02 Jan 2019 06:19:59 GMT
See <https://builds.apache.org/job/beam_PreCommit_Java_Cron/775/display/redirect>

------------------------------------------
[...truncated 63.40 MB...]
          BeamIOSourceRel(table=[[beam, bid]])
        BeamIOSourceRel(table=[[beam, side]])


org.apache.beam.sdk.nexmark.queries.sql.SqlQuery1Test > testConvertsPriceToEur STANDARD_ERROR
    Jan 02, 2019 6:19:36 AM org.apache.beam.sdk.extensions.sql.impl.BeamQueryPlanner convertToBeamRel
    INFO: SQL:
    SELECT `PCOLLECTION`.`auction`, `PCOLLECTION`.`bidder`, `DolToEur`(`PCOLLECTION`.`price`)
AS `price`, `PCOLLECTION`.`dateTime`, `PCOLLECTION`.`extra`
    FROM `beam`.`PCOLLECTION` AS `PCOLLECTION`
    Jan 02, 2019 6:19:36 AM org.apache.beam.sdk.extensions.sql.impl.BeamQueryPlanner convertToBeamRel
    INFO: SQLPlan>
    LogicalProject(auction=[$0], bidder=[$1], price=[DolToEur($2)], dateTime=[$3], extra=[$4])
      BeamIOSourceRel(table=[[beam, PCOLLECTION]])

    Jan 02, 2019 6:19:36 AM org.apache.beam.sdk.extensions.sql.impl.BeamQueryPlanner convertToBeamRel
    INFO: BEAMPlan>
    BeamCalcRel(expr#0..4=[{inputs}], expr#5=[DolToEur($t2)], proj#0..1=[{exprs}], price=[$t5],
dateTime=[$t3], extra=[$t4])
      BeamIOSourceRel(table=[[beam, PCOLLECTION]])


org.apache.beam.sdk.nexmark.queries.SessionSideInputJoinTest > queryMatchesModelBatchCsv
STANDARD_ERROR
    Jan 02, 2019 6:19:38 AM org.apache.beam.sdk.io.WriteFiles$WriteShardsIntoTempFilesFn processElement
    INFO: Opening writer 3d7b733b-e24d-4f8b-af1a-914330cee131 for window org.apache.beam.sdk.transforms.windowing.GlobalWindow@238ec335
pane PaneInfo{isFirst=true, isLast=true, timing=ON_TIME, index=0, onTimeIndex=0} destination
null
    Jan 02, 2019 6:19:38 AM org.apache.beam.sdk.io.WriteFiles$WriteShardsIntoTempFilesFn processElement
    INFO: Opening writer 9e570936-8f5c-434e-a7d4-8740ed39392f for window org.apache.beam.sdk.transforms.windowing.GlobalWindow@238ec335
pane PaneInfo{isFirst=true, isLast=true, timing=ON_TIME, index=0, onTimeIndex=0} destination
null
    Jan 02, 2019 6:19:38 AM org.apache.beam.sdk.io.WriteFiles$WriteShardsIntoTempFilesFn processElement
    INFO: Opening writer ec927a7d-33df-41d1-82c7-889e68250136 for window org.apache.beam.sdk.transforms.windowing.GlobalWindow@238ec335
pane PaneInfo{isFirst=true, isLast=true, timing=ON_TIME, index=0, onTimeIndex=0} destination
null
    Jan 02, 2019 6:19:38 AM org.apache.beam.sdk.io.FileBasedSink$Writer close
    INFO: Successfully wrote temporary file <https://builds.apache.org/job/beam_PreCommit_Java_Cron/ws/src/sdks/java/testing/nexmark/null/.temp-beam-2019-01-02_06-19-38-5/9e570936-8f5c-434e-a7d4-8740ed39392f>
    Jan 02, 2019 6:19:38 AM org.apache.beam.sdk.io.FileBasedSink$Writer close
    INFO: Successfully wrote temporary file <https://builds.apache.org/job/beam_PreCommit_Java_Cron/ws/src/sdks/java/testing/nexmark/null/.temp-beam-2019-01-02_06-19-38-5/ec927a7d-33df-41d1-82c7-889e68250136>
    Jan 02, 2019 6:19:38 AM org.apache.beam.sdk.io.FileBasedSink$Writer close
    INFO: Successfully wrote temporary file <https://builds.apache.org/job/beam_PreCommit_Java_Cron/ws/src/sdks/java/testing/nexmark/null/.temp-beam-2019-01-02_06-19-38-5/3d7b733b-e24d-4f8b-af1a-914330cee131>
    Jan 02, 2019 6:19:38 AM org.apache.beam.sdk.io.WriteFiles$FinalizeTempFileBundles$FinalizeFn
process
    INFO: Finalizing 3 file results
    Jan 02, 2019 6:19:38 AM org.apache.beam.sdk.io.FileBasedSink$WriteOperation createMissingEmptyShards
    INFO: Finalizing for destination null num shards 3.
    Jan 02, 2019 6:19:38 AM org.apache.beam.sdk.io.FileBasedSink$WriteOperation moveToOutputFiles
    INFO: Will copy temporary file FileResult{tempFilename=<https://builds.apache.org/job/beam_PreCommit_Java_Cron/ws/src/sdks/java/testing/nexmark/null/.temp-beam-2019-01-02_06-19-38-5/9e570936-8f5c-434e-a7d4-8740ed39392f,>
shard=2, window=org.apache.beam.sdk.transforms.windowing.GlobalWindow@238ec335, paneInfo=PaneInfo{isFirst=true,
isLast=true, timing=ON_TIME, index=0, onTimeIndex=0}} to final location <https://builds.apache.org/job/beam_PreCommit_Java_Cron/ws/src/sdks/java/testing/nexmark/null/SessionSideInputJoin--538070909-00002-of-00003>
    Jan 02, 2019 6:19:38 AM org.apache.beam.sdk.io.FileBasedSink$WriteOperation moveToOutputFiles
    INFO: Will copy temporary file FileResult{tempFilename=<https://builds.apache.org/job/beam_PreCommit_Java_Cron/ws/src/sdks/java/testing/nexmark/null/.temp-beam-2019-01-02_06-19-38-5/3d7b733b-e24d-4f8b-af1a-914330cee131,>
shard=1, window=org.apache.beam.sdk.transforms.windowing.GlobalWindow@238ec335, paneInfo=PaneInfo{isFirst=true,
isLast=true, timing=ON_TIME, index=0, onTimeIndex=0}} to final location <https://builds.apache.org/job/beam_PreCommit_Java_Cron/ws/src/sdks/java/testing/nexmark/null/SessionSideInputJoin--538070909-00001-of-00003>
    Jan 02, 2019 6:19:38 AM org.apache.beam.sdk.io.FileBasedSink$WriteOperation moveToOutputFiles
    INFO: Will copy temporary file FileResult{tempFilename=<https://builds.apache.org/job/beam_PreCommit_Java_Cron/ws/src/sdks/java/testing/nexmark/null/.temp-beam-2019-01-02_06-19-38-5/ec927a7d-33df-41d1-82c7-889e68250136,>
shard=0, window=org.apache.beam.sdk.transforms.windowing.GlobalWindow@238ec335, paneInfo=PaneInfo{isFirst=true,
isLast=true, timing=ON_TIME, index=0, onTimeIndex=0}} to final location <https://builds.apache.org/job/beam_PreCommit_Java_Cron/ws/src/sdks/java/testing/nexmark/null/SessionSideInputJoin--538070909-00000-of-00003>
    Jan 02, 2019 6:19:38 AM org.apache.beam.sdk.io.FileBasedSink$WriteOperation removeTemporaryFiles
    INFO: Will remove known temporary file <https://builds.apache.org/job/beam_PreCommit_Java_Cron/ws/src/sdks/java/testing/nexmark/null/.temp-beam-2019-01-02_06-19-38-5/3d7b733b-e24d-4f8b-af1a-914330cee131>
    Jan 02, 2019 6:19:38 AM org.apache.beam.sdk.io.FileBasedSink$WriteOperation removeTemporaryFiles
    INFO: Will remove known temporary file <https://builds.apache.org/job/beam_PreCommit_Java_Cron/ws/src/sdks/java/testing/nexmark/null/.temp-beam-2019-01-02_06-19-38-5/ec927a7d-33df-41d1-82c7-889e68250136>
    Jan 02, 2019 6:19:38 AM org.apache.beam.sdk.io.FileBasedSink$WriteOperation removeTemporaryFiles
    INFO: Will remove known temporary file <https://builds.apache.org/job/beam_PreCommit_Java_Cron/ws/src/sdks/java/testing/nexmark/null/.temp-beam-2019-01-02_06-19-38-5/9e570936-8f5c-434e-a7d4-8740ed39392f>
    Jan 02, 2019 6:19:38 AM org.apache.beam.sdk.io.FileBasedSink$WriteOperation removeTemporaryFiles
    WARNING: Failed to match temporary files under: [<https://builds.apache.org/job/beam_PreCommit_Java_Cron/ws/src/sdks/java/testing/nexmark/null/.temp-beam-2019-01-02_06-19-38-5/].>
    Jan 02, 2019 6:19:38 AM org.apache.beam.sdk.io.FileBasedSource getEstimatedSizeBytes
    INFO: Filepattern <https://builds.apache.org/job/beam_PreCommit_Java_Cron/ws/src/sdks/java/testing/nexmark/null/SessionSideInputJoin--538070909*>
matched 3 files with total size 40
    Jan 02, 2019 6:19:38 AM org.apache.beam.sdk.io.FileBasedSource split
    INFO: Splitting filepattern <https://builds.apache.org/job/beam_PreCommit_Java_Cron/ws/src/sdks/java/testing/nexmark/null/SessionSideInputJoin--538070909*>
into bundles of size 2 took 1 ms and produced 3 files and 20 bundles

org.apache.beam.sdk.nexmark.queries.SessionSideInputJoinTest > queryMatchesModelStreamingCsv
STANDARD_ERROR
    Jan 02, 2019 6:19:40 AM org.apache.beam.sdk.io.WriteFiles$WriteShardsIntoTempFilesFn processElement
    INFO: Opening writer c40ccf30-4553-47a5-9de4-ad0082d3030b for window org.apache.beam.sdk.transforms.windowing.GlobalWindow@238ec335
pane PaneInfo{isFirst=true, isLast=true, timing=ON_TIME, index=0, onTimeIndex=0} destination
null
    Jan 02, 2019 6:19:40 AM org.apache.beam.sdk.io.WriteFiles$WriteShardsIntoTempFilesFn processElement
    INFO: Opening writer ccefee69-ea7e-4958-9001-8fcfa772ea77 for window org.apache.beam.sdk.transforms.windowing.GlobalWindow@238ec335
pane PaneInfo{isFirst=true, isLast=true, timing=ON_TIME, index=0, onTimeIndex=0} destination
null
    Jan 02, 2019 6:19:40 AM org.apache.beam.sdk.io.WriteFiles$WriteShardsIntoTempFilesFn processElement
    INFO: Opening writer 99eb9206-11bb-47ec-91e6-858e5a0ac251 for window org.apache.beam.sdk.transforms.windowing.GlobalWindow@238ec335
pane PaneInfo{isFirst=true, isLast=true, timing=ON_TIME, index=0, onTimeIndex=0} destination
null
    Jan 02, 2019 6:19:40 AM org.apache.beam.sdk.io.FileBasedSink$Writer close
    INFO: Successfully wrote temporary file <https://builds.apache.org/job/beam_PreCommit_Java_Cron/ws/src/sdks/java/testing/nexmark/null/.temp-beam-2019-01-02_06-19-40-6/c40ccf30-4553-47a5-9de4-ad0082d3030b>
    Jan 02, 2019 6:19:40 AM org.apache.beam.sdk.io.FileBasedSink$Writer close
    INFO: Successfully wrote temporary file <https://builds.apache.org/job/beam_PreCommit_Java_Cron/ws/src/sdks/java/testing/nexmark/null/.temp-beam-2019-01-02_06-19-40-6/ccefee69-ea7e-4958-9001-8fcfa772ea77>
    Jan 02, 2019 6:19:40 AM org.apache.beam.sdk.io.FileBasedSink$Writer close
    INFO: Successfully wrote temporary file <https://builds.apache.org/job/beam_PreCommit_Java_Cron/ws/src/sdks/java/testing/nexmark/null/.temp-beam-2019-01-02_06-19-40-6/99eb9206-11bb-47ec-91e6-858e5a0ac251>
    Jan 02, 2019 6:19:40 AM org.apache.beam.sdk.io.WriteFiles$FinalizeTempFileBundles$FinalizeFn
process
    INFO: Finalizing 3 file results
    Jan 02, 2019 6:19:40 AM org.apache.beam.sdk.io.FileBasedSink$WriteOperation createMissingEmptyShards
    INFO: Finalizing for destination null num shards 3.
    Jan 02, 2019 6:19:40 AM org.apache.beam.sdk.io.FileBasedSink$WriteOperation moveToOutputFiles
    INFO: Will copy temporary file FileResult{tempFilename=<https://builds.apache.org/job/beam_PreCommit_Java_Cron/ws/src/sdks/java/testing/nexmark/null/.temp-beam-2019-01-02_06-19-40-6/c40ccf30-4553-47a5-9de4-ad0082d3030b,>
shard=0, window=org.apache.beam.sdk.transforms.windowing.GlobalWindow@238ec335, paneInfo=PaneInfo{isFirst=true,
isLast=true, timing=ON_TIME, index=0, onTimeIndex=0}} to final location <https://builds.apache.org/job/beam_PreCommit_Java_Cron/ws/src/sdks/java/testing/nexmark/null/SessionSideInputJoin--2036697395-00000-of-00003>
    Jan 02, 2019 6:19:40 AM org.apache.beam.sdk.io.FileBasedSink$WriteOperation moveToOutputFiles
    INFO: Will copy temporary file FileResult{tempFilename=<https://builds.apache.org/job/beam_PreCommit_Java_Cron/ws/src/sdks/java/testing/nexmark/null/.temp-beam-2019-01-02_06-19-40-6/ccefee69-ea7e-4958-9001-8fcfa772ea77,>
shard=1, window=org.apache.beam.sdk.transforms.windowing.GlobalWindow@238ec335, paneInfo=PaneInfo{isFirst=true,
isLast=true, timing=ON_TIME, index=0, onTimeIndex=0}} to final location <https://builds.apache.org/job/beam_PreCommit_Java_Cron/ws/src/sdks/java/testing/nexmark/null/SessionSideInputJoin--2036697395-00001-of-00003>
    Jan 02, 2019 6:19:40 AM org.apache.beam.sdk.io.FileBasedSink$WriteOperation moveToOutputFiles
    INFO: Will copy temporary file FileResult{tempFilename=<https://builds.apache.org/job/beam_PreCommit_Java_Cron/ws/src/sdks/java/testing/nexmark/null/.temp-beam-2019-01-02_06-19-40-6/99eb9206-11bb-47ec-91e6-858e5a0ac251,>
shard=2, window=org.apache.beam.sdk.transforms.windowing.GlobalWindow@238ec335, paneInfo=PaneInfo{isFirst=true,
isLast=true, timing=ON_TIME, index=0, onTimeIndex=0}} to final location <https://builds.apache.org/job/beam_PreCommit_Java_Cron/ws/src/sdks/java/testing/nexmark/null/SessionSideInputJoin--2036697395-00002-of-00003>
    Jan 02, 2019 6:19:40 AM org.apache.beam.sdk.io.FileBasedSink$WriteOperation removeTemporaryFiles
    INFO: Will remove known temporary file <https://builds.apache.org/job/beam_PreCommit_Java_Cron/ws/src/sdks/java/testing/nexmark/null/.temp-beam-2019-01-02_06-19-40-6/c40ccf30-4553-47a5-9de4-ad0082d3030b>
    Jan 02, 2019 6:19:40 AM org.apache.beam.sdk.io.FileBasedSink$WriteOperation removeTemporaryFiles
    INFO: Will remove known temporary file <https://builds.apache.org/job/beam_PreCommit_Java_Cron/ws/src/sdks/java/testing/nexmark/null/.temp-beam-2019-01-02_06-19-40-6/ccefee69-ea7e-4958-9001-8fcfa772ea77>
    Jan 02, 2019 6:19:40 AM org.apache.beam.sdk.io.FileBasedSink$WriteOperation removeTemporaryFiles
    INFO: Will remove known temporary file <https://builds.apache.org/job/beam_PreCommit_Java_Cron/ws/src/sdks/java/testing/nexmark/null/.temp-beam-2019-01-02_06-19-40-6/99eb9206-11bb-47ec-91e6-858e5a0ac251>
    Jan 02, 2019 6:19:40 AM org.apache.beam.sdk.io.FileBasedSink$WriteOperation removeTemporaryFiles
    WARNING: Failed to match temporary files under: [<https://builds.apache.org/job/beam_PreCommit_Java_Cron/ws/src/sdks/java/testing/nexmark/null/.temp-beam-2019-01-02_06-19-40-6/].>
    Jan 02, 2019 6:19:41 AM org.apache.beam.sdk.io.FileBasedSource getEstimatedSizeBytes
    INFO: Filepattern <https://builds.apache.org/job/beam_PreCommit_Java_Cron/ws/src/sdks/java/testing/nexmark/null/SessionSideInputJoin--2036697395*>
matched 3 files with total size 40
    Jan 02, 2019 6:19:41 AM org.apache.beam.sdk.io.FileBasedSource split
    INFO: Splitting filepattern <https://builds.apache.org/job/beam_PreCommit_Java_Cron/ws/src/sdks/java/testing/nexmark/null/SessionSideInputJoin--2036697395*>
into bundles of size 2 took 0 ms and produced 3 files and 20 bundles

Gradle Test Executor 141 finished executing tests.

> Task :beam-sdks-java-nexmark:test
Finished generating test XML results (0.002 secs) into: <https://builds.apache.org/job/beam_PreCommit_Java_Cron/ws/src/sdks/java/testing/nexmark/build/test-results/test>
Generating HTML test report...
Finished generating test html results (0.006 secs) into: <https://builds.apache.org/job/beam_PreCommit_Java_Cron/ws/src/sdks/java/testing/nexmark/build/reports/tests/test>
Packing task ':beam-sdks-java-nexmark:test'
:beam-sdks-java-nexmark:test (Thread[Task worker for ':' Thread 4,5,main]) completed. Took
3 mins 30.449 secs.
:beam-sdks-java-nexmark:shadowJar (Thread[Task worker for ':' Thread 4,5,main]) started.

> Task :beam-sdks-java-nexmark:shadowJar
Build cache key for task ':beam-sdks-java-nexmark:shadowJar' is 8f8b06a1df20774715a788a04115e3ef
Caching disabled for task ':beam-sdks-java-nexmark:shadowJar': Caching has not been enabled
for the task
Task ':beam-sdks-java-nexmark:shadowJar' is not up-to-date because:
  No history is available.
*******************
GRADLE SHADOW STATS

Total Jars: 2 (includes project)
Total Time: 2.212s [2212ms]
Average Time/Jar: 1.106s [1106.0ms]
*******************
:beam-sdks-java-nexmark:shadowJar (Thread[Task worker for ':' Thread 4,5,main]) completed.
Took 2.632 secs.
:beam-sdks-java-nexmark:validateShadedJarDoesntLeakNonProjectClasses (Thread[Task worker for
':' Thread 4,5,main]) started.

> Task :beam-sdks-java-nexmark:validateShadedJarDoesntLeakNonProjectClasses
Build cache key for task ':beam-sdks-java-nexmark:validateShadedJarDoesntLeakNonProjectClasses'
is c85b36f314a4c4067cc6d054d7abaa57
Caching disabled for task ':beam-sdks-java-nexmark:validateShadedJarDoesntLeakNonProjectClasses':
Caching has not been enabled for the task
Task ':beam-sdks-java-nexmark:validateShadedJarDoesntLeakNonProjectClasses' is not up-to-date
because:
  No history is available.
:beam-sdks-java-nexmark:validateShadedJarDoesntLeakNonProjectClasses (Thread[Task worker for
':' Thread 4,5,main]) completed. Took 0.068 secs.
:beam-sdks-java-nexmark:check (Thread[Task worker for ':' Thread 4,5,main]) started.

> Task :beam-sdks-java-nexmark:check
Skipping task ':beam-sdks-java-nexmark:check' as it has no actions.
:beam-sdks-java-nexmark:check (Thread[Task worker for ':' Thread 4,5,main]) completed. Took
0.0 secs.
:beam-sdks-java-nexmark:build (Thread[Task worker for ':' Thread 11,5,main]) started.

> Task :beam-sdks-java-nexmark:build
Skipping task ':beam-sdks-java-nexmark:build' as it has no actions.
:beam-sdks-java-nexmark:build (Thread[Task worker for ':' Thread 11,5,main]) completed. Took
0.0 secs.
:beam-sdks-java-nexmark:buildDependents (Thread[Task worker for ':' Thread 11,5,main]) started.

> Task :beam-sdks-java-nexmark:buildDependents
Caching disabled for task ':beam-sdks-java-nexmark:buildDependents': Caching has not been
enabled for the task
Task ':beam-sdks-java-nexmark:buildDependents' is not up-to-date because:
  Task has not declared any outputs despite executing actions.
:beam-sdks-java-nexmark:buildDependents (Thread[Task worker for ':' Thread 11,5,main]) completed.
Took 0.001 secs.
:beam-sdks-java-extensions-sql:buildDependents (Thread[Task worker for ':' Thread 11,5,main])
started.
:beam-sdks-java-io-google-cloud-platform:buildDependents (Thread[Task worker for ':' Thread
8,5,main]) started.
:beam-sdks-java-io-kafka:buildDependents (Thread[Daemon worker,5,main]) started.
:beam-sdks-java-test-utils:buildDependents (Thread[Task worker for ':' Thread 7,5,main]) started.

> Task :beam-sdks-java-io-google-cloud-platform:buildDependents
Caching disabled for task ':beam-sdks-java-io-google-cloud-platform:buildDependents': Caching
has not been enabled for the task
Task ':beam-sdks-java-io-google-cloud-platform:buildDependents' is not up-to-date because:
  Task has not declared any outputs despite executing actions.

> Task :beam-sdks-java-io-kafka:buildDependents
Caching disabled for task ':beam-sdks-java-io-kafka:buildDependents': Caching has not been
enabled for the task
Task ':beam-sdks-java-io-kafka:buildDependents' is not up-to-date because:
  Task has not declared any outputs despite executing actions.

> Task :beam-sdks-java-extensions-sql:buildDependents
Caching disabled for task ':beam-sdks-java-extensions-sql:buildDependents': Caching has not
been enabled for the task
Task ':beam-sdks-java-extensions-sql:buildDependents' is not up-to-date because:
  Task has not declared any outputs despite executing actions.

> Task :beam-sdks-java-test-utils:buildDependents
Caching disabled for task ':beam-sdks-java-test-utils:buildDependents': Caching has not been
enabled for the task
Task ':beam-sdks-java-test-utils:buildDependents' is not up-to-date because:
  Task has not declared any outputs despite executing actions.
:beam-sdks-java-io-google-cloud-platform:buildDependents (Thread[Task worker for ':' Thread
8,5,main]) completed. Took 0.002 secs.
:beam-sdks-java-test-utils:buildDependents (Thread[Task worker for ':' Thread 7,5,main]) completed.
Took 0.001 secs.
:beam-sdks-java-io-kafka:buildDependents (Thread[Daemon worker,5,main]) completed. Took 0.002
secs.
:beam-sdks-java-extensions-sql:buildDependents (Thread[Task worker for ':' Thread 11,5,main])
completed. Took 0.002 secs.
:beam-sdks-java-extensions-protobuf:buildDependents (Thread[Task worker for ':' Thread 8,5,main])
started.
:beam-sdks-java-extensions-join-library:buildDependents (Thread[Task worker for ':' Thread
11,5,main]) started.

> Task :beam-sdks-java-extensions-join-library:buildDependents
Caching disabled for task ':beam-sdks-java-extensions-join-library:buildDependents': Caching
has not been enabled for the task
Task ':beam-sdks-java-extensions-join-library:buildDependents' is not up-to-date because:
  Task has not declared any outputs despite executing actions.
:beam-sdks-java-extensions-join-library:buildDependents (Thread[Task worker for ':' Thread
11,5,main]) completed. Took 0.0 secs.
:beam-runners-direct-java:buildDependents (Thread[Task worker for ':' Thread 11,5,main]) started.

> Task :beam-runners-direct-java:buildDependents
Caching disabled for task ':beam-runners-direct-java:buildDependents': Caching has not been
enabled for the task
Task ':beam-runners-direct-java:buildDependents' is not up-to-date because:
  Task has not declared any outputs despite executing actions.
:beam-runners-direct-java:buildDependents (Thread[Task worker for ':' Thread 11,5,main]) completed.
Took 0.003 secs.
:beam-runners-java-fn-execution:buildDependents (Thread[Task worker for ':' Thread 11,5,main])
started.
:beam-runners-local-java-core:buildDependents (Thread[Daemon worker,5,main]) started.

> Task :beam-sdks-java-extensions-protobuf:buildDependents
Caching disabled for task ':beam-sdks-java-extensions-protobuf:buildDependents': Caching has
not been enabled for the task
Task ':beam-sdks-java-extensions-protobuf:buildDependents' is not up-to-date because:
  Task has not declared any outputs despite executing actions.
:beam-sdks-java-extensions-protobuf:buildDependents (Thread[Task worker for ':' Thread 8,5,main])
completed. Took 0.005 secs.

> Task :beam-runners-local-java-core:buildDependents
Caching disabled for task ':beam-runners-local-java-core:buildDependents': Caching has not
been enabled for the task
Task ':beam-runners-local-java-core:buildDependents' is not up-to-date because:
  Task has not declared any outputs despite executing actions.
:beam-runners-local-java-core:buildDependents (Thread[Daemon worker,5,main]) completed. Took
0.002 secs.

> Task :beam-runners-java-fn-execution:buildDependents
Caching disabled for task ':beam-runners-java-fn-execution:buildDependents': Caching has not
been enabled for the task
Task ':beam-runners-java-fn-execution:buildDependents' is not up-to-date because:
  Task has not declared any outputs despite executing actions.
:beam-runners-java-fn-execution:buildDependents (Thread[Task worker for ':' Thread 11,5,main])
completed. Took 0.002 secs.
:beam-sdks-java-harness:buildDependents (Thread[Task worker for ':' Thread 11,5,main]) started.
:beam-vendor-sdks-java-extensions-protobuf:buildDependents (Thread[Task worker for ':' Thread
3,5,main]) started.

> Task :beam-sdks-java-harness:buildDependents
Caching disabled for task ':beam-sdks-java-harness:buildDependents': Caching has not been
enabled for the task
Task ':beam-sdks-java-harness:buildDependents' is not up-to-date because:
  Task has not declared any outputs despite executing actions.

> Task :beam-vendor-sdks-java-extensions-protobuf:buildDependents
Caching disabled for task ':beam-vendor-sdks-java-extensions-protobuf:buildDependents': Caching
has not been enabled for the task
Task ':beam-vendor-sdks-java-extensions-protobuf:buildDependents' is not up-to-date because:
  Task has not declared any outputs despite executing actions.
:beam-sdks-java-harness:buildDependents (Thread[Task worker for ':' Thread 11,5,main]) completed.
Took 0.002 secs.
:beam-vendor-sdks-java-extensions-protobuf:buildDependents (Thread[Task worker for ':' Thread
3,5,main]) completed. Took 0.002 secs.
:beam-sdks-java-extensions-google-cloud-platform-core:buildDependents (Thread[Task worker
for ':' Thread 3,5,main]) started.

> Task :beam-sdks-java-extensions-google-cloud-platform-core:buildDependents
Caching disabled for task ':beam-sdks-java-extensions-google-cloud-platform-core:buildDependents':
Caching has not been enabled for the task
Task ':beam-sdks-java-extensions-google-cloud-platform-core:buildDependents' is not up-to-date
because:
  Task has not declared any outputs despite executing actions.
:beam-sdks-java-extensions-google-cloud-platform-core:buildDependents (Thread[Task worker
for ':' Thread 3,5,main]) completed. Took 0.0 secs.

FAILURE: Build failed with an exception.

* What went wrong:
Execution failed for task ':beam-runners-gearpump:test'.
> There were failing tests. See the report at: file://<https://builds.apache.org/job/beam_PreCommit_Java_Cron/ws/src/runners/gearpump/build/reports/tests/test/index.html>

* Try:
Run with --stacktrace option to get the stack trace. Run with --debug option to get more log
output. Run with --scan to get full insights.

* Get more help at https://help.gradle.org

Deprecated Gradle features were used in this build, making it incompatible with Gradle 5.0.
Use '--warning-mode all' to show the individual deprecation warnings.
See https://docs.gradle.org/4.10.2/userguide/command_line_interface.html#sec:command_line_warnings

BUILD FAILED in 19m 17s
878 actionable tasks: 872 executed, 6 from cache

Publishing build scan...
https://gradle.com/s/fcrtj2nwsnuoc

Closing Git repo: <https://builds.apache.org/job/beam_PreCommit_Java_Cron/ws/src/.git>
Build step 'Invoke Gradle script' changed build result to FAILURE
Build step 'Invoke Gradle script' marked build as failure

---------------------------------------------------------------------
To unsubscribe, e-mail: builds-unsubscribe@beam.apache.org
For additional commands, e-mail: builds-help@beam.apache.org


Mime
View raw message