beam-builds mailing list archives

Site index · List index
Message view « Date » · « Thread »
Top « Date » · « Thread »
From Apache Jenkins Server <jenk...@builds.apache.org>
Subject Build failed in Jenkins: beam_PreCommit_Website_Cron #505
Date Sat, 05 Jan 2019 18:08:02 GMT
See <https://builds.apache.org/job/beam_PreCommit_Website_Cron/505/display/redirect>

------------------------------------------
Started by timer
[EnvInject] - Loading node environment variables.
Building remotely on beam3 (beam) in workspace <https://builds.apache.org/job/beam_PreCommit_Website_Cron/ws/>
 > git rev-parse --is-inside-work-tree # timeout=10
Fetching changes from the remote Git repository
 > git config remote.origin.url https://github.com/apache/beam.git # timeout=10
Fetching upstream changes from https://github.com/apache/beam.git
 > git --version # timeout=10
 > git fetch --tags --progress https://github.com/apache/beam.git +refs/heads/*:refs/remotes/origin/*
+refs/pull/${ghprbPullId}/*:refs/remotes/origin/pr/${ghprbPullId}/*
 > git rev-parse origin/master^{commit} # timeout=10
Checking out Revision 6c024c6400b69a743970f8561e0214e1087a5288 (origin/master)
 > git config core.sparsecheckout # timeout=10
 > git checkout -f 6c024c6400b69a743970f8561e0214e1087a5288
Commit message: "Merge pull request #7292 from bramp/BEAM-6155"
 > git rev-list --no-walk 6c024c6400b69a743970f8561e0214e1087a5288 # timeout=10
Cleaning workspace
 > git rev-parse --verify HEAD # timeout=10
Resetting working tree
 > git reset --hard # timeout=10
 > git clean -fdx # timeout=10
[EnvInject] - Executing scripts and injecting environment variables after the SCM step.
[EnvInject] - Injecting as environment variables the properties content 
SPARK_LOCAL_IP=127.0.0.1

[EnvInject] - Variables injected successfully.
[Gradle] - Launching build.
[src] $ <https://builds.apache.org/job/beam_PreCommit_Website_Cron/ws/src/gradlew> --continue
--max-workers=12 -Dorg.gradle.jvmargs=-Xms2g -Dorg.gradle.jvmargs=-Xmx4g :websitePreCommit
To honour the JVM settings for this build a new JVM will be forked. Please consider using
the daemon: https://docs.gradle.org/4.10.3/userguide/gradle_daemon.html.
Daemon will be stopped at the end of the build stopping after processing
Parallel execution is an incubating feature.
> Task :buildSrc:compileJava NO-SOURCE
> Task :buildSrc:compileGroovy FROM-CACHE
> Task :buildSrc:processResources NO-SOURCE
> Task :buildSrc:classes UP-TO-DATE
> Task :buildSrc:jar
> Task :buildSrc:assemble
> Task :buildSrc:spotlessGroovy
> Task :buildSrc:spotlessGroovyCheck
> Task :buildSrc:spotlessGroovyGradle
> Task :buildSrc:spotlessGroovyGradleCheck
> Task :buildSrc:spotlessCheck
> Task :buildSrc:compileTestJava NO-SOURCE
> Task :buildSrc:compileTestGroovy NO-SOURCE
> Task :buildSrc:processTestResources NO-SOURCE
> Task :buildSrc:testClasses UP-TO-DATE
> Task :buildSrc:test NO-SOURCE
> Task :buildSrc:check
> Task :buildSrc:build
Parallel execution with configuration on demand is an incubating feature.
> Task :beam-website:setupBuildDir

> Task :beam-website:buildDockerImage
Sending build context to Docker daemon  26.38MB
Step 1/7 : FROM ruby:2.5
2.5: Pulling from library/ruby
Digest: sha256:4fe61c638dec4dc1d16935325586166b4a87a3aaa1c5a0a40db39a908eae70c5
Status: Downloaded newer image for ruby:2.5
 ---> 6fc6e4e7a8ee
Step 2/7 : WORKDIR /ruby
 ---> Using cache
 ---> 25d19eaace22
Step 3/7 : RUN gem install bundler
 ---> Using cache
 ---> 6ee2e1b882d3
Step 4/7 : ADD Gemfile Gemfile.lock /ruby/
 ---> Using cache
 ---> 500dfd80fdf6
Step 5/7 : RUN bundle install --deployment --path $GEM_HOME
 ---> Using cache
 ---> 41b4b7b26aeb
Step 6/7 : ENV LC_ALL C.UTF-8
 ---> Using cache
 ---> 80dcc9259da6
Step 7/7 : CMD sleep 3600
 ---> Using cache
 ---> 3c4b3203b02f
Successfully built 3c4b3203b02f
Successfully tagged beam-website:latest

> Task :beam-website:createDockerContainer

> Task :beam-website:startDockerContainer
2347e9d79b74be134c304f3d66ff27ea244c06eeceb3142296fca52f51397167

> Task :beam-website:buildLocalWebsite
`/` is not writable.
Bundler will use `/tmp/bundler/home/unknown' as your home directory temporarily.
Configuration file: /repo/website/_config.yml
Configuration file: /repo/website/_config_test.yml
            Source: /repo/website/src
       Destination: generated-local-content
 Incremental build: enabled
      Generating... 
                    done in 14.572 seconds.
 Auto-regeneration: disabled. Use --watch to enable.

> Task :beam-website:testWebsite
`/` is not writable.
Bundler will use `/tmp/bundler/home/unknown' as your home directory temporarily.
Running ["ImageCheck", "ScriptCheck", "HtmlCheck", "LinkCheck"] on ["./generated-local-content"]
on *.html... 


Checking 805 external links...
Ran on 181 files!


- ./generated-local-content/contribute/postcommits-policies-details/index.html
  *  External link https://lists.apache.org/thread.html/3bb4aa777751da2e2d7e22666aa6a2e18ae31891cb09d91718b75e74@%3Cdev.beam.apache.org%3E
failed: got a time out (response code 0)
rake aborted!
HTML-Proofer found 1 failure!
/usr/local/bundle/ruby/2.5.0/gems/html-proofer-3.9.3/lib/html-proofer/runner.rb:167:in `print_failed_tests'
/usr/local/bundle/ruby/2.5.0/gems/html-proofer-3.9.3/lib/html-proofer/runner.rb:48:in `run'
/repo/build/website/Rakefile:20:in `block in <top (required)>'
/usr/local/bundle/ruby/2.5.0/gems/rake-12.3.0/exe/rake:27:in `<top (required)>'
/usr/local/bundle/bin/bundle:23:in `load'
/usr/local/bundle/bin/bundle:23:in `<main>'
Tasks: TOP => test
(See full trace by running task with --trace)

> Task :beam-website:testWebsite FAILED

> Task :beam-website:stopAndRemoveDockerContainer
2347e9d79b74be134c304f3d66ff27ea244c06eeceb3142296fca52f51397167

FAILURE: Build failed with an exception.

* What went wrong:
Execution failed for task ':beam-website:testWebsite'.
> Process 'command 'docker'' finished with non-zero exit value 1

* Try:
Run with --stacktrace option to get the stack trace. Run with --info or --debug option to
get more log output. Run with --scan to get full insights.

* Get more help at https://help.gradle.org

BUILD FAILED in 3m 23s
7 actionable tasks: 7 executed

Publishing build scan...
https://gradle.com/s/hsqz6itrcfjry

Build step 'Invoke Gradle script' changed build result to FAILURE
Build step 'Invoke Gradle script' marked build as failure

---------------------------------------------------------------------
To unsubscribe, e-mail: builds-unsubscribe@beam.apache.org
For additional commands, e-mail: builds-help@beam.apache.org


Mime
View raw message