beam-builds mailing list archives

Site index · List index
Message view « Date » · « Thread »
Top « Date » · « Thread »
From Apache Jenkins Server <jenk...@builds.apache.org>
Subject Build failed in Jenkins: beam_PostCommit_Python_Verify #7116
Date Fri, 18 Jan 2019 00:25:41 GMT
See <https://builds.apache.org/job/beam_PostCommit_Python_Verify/7116/display/redirect>

------------------------------------------
[...truncated 867.56 KB...]
        "requirements_file": "postcommit_requirements.txt", 
        "runner": "TestDataflowRunner", 
        "runtime_type_check": false, 
        "save_main_session": false, 
        "sdk_location": "build/apache-beam.tar.gz", 
        "sleep_secs": "20", 
        "staging_location": "gs://temp-storage-for-end-to-end-tests/staging-it/beamapp-jenkins-0118001202-161686.1547770322.161809",

        "streaming": false, 
        "style": "scrambled", 
        "temp_location": "gs://temp-storage-for-end-to-end-tests/temp-it/beamapp-jenkins-0118001202-161686.1547770322.161809",

        "type_check_strictness": "DEFAULT_TO_ANY", 
        "update": false
      }
    }, 
    "tempStoragePrefix": "storage.googleapis.com/temp-storage-for-end-to-end-tests/temp-it/beamapp-jenkins-0118001202-161686.1547770322.161809",

    "userAgent": {
      "name": "Apache Beam SDK for Python", 
      "version": "2.11.0.dev"
    }, 
    "version": {
      "job_type": "PYTHON_BATCH", 
      "major": "7"
    }, 
    "workerPools": [
      {
        "autoscalingSettings": {}, 
        "kind": "harness", 
        "numWorkers": 1, 
        "packages": [
          {
            "location": "storage.googleapis.com/temp-storage-for-end-to-end-tests/staging-it/beamapp-jenkins-0118001202-161686.1547770322.161809/requirements.txt",

            "name": "requirements.txt"
          }, 
          {
            "location": "storage.googleapis.com/temp-storage-for-end-to-end-tests/staging-it/beamapp-jenkins-0118001202-161686.1547770322.161809/PyHamcrest-1.9.0.tar.gz",

            "name": "PyHamcrest-1.9.0.tar.gz"
          }, 
          {
            "location": "storage.googleapis.com/temp-storage-for-end-to-end-tests/staging-it/beamapp-jenkins-0118001202-161686.1547770322.161809/pbr-5.1.1.tar.gz",

            "name": "pbr-5.1.1.tar.gz"
          }, 
          {
            "location": "storage.googleapis.com/temp-storage-for-end-to-end-tests/staging-it/beamapp-jenkins-0118001202-161686.1547770322.161809/mock-2.0.0.tar.gz",

            "name": "mock-2.0.0.tar.gz"
          }, 
          {
            "location": "storage.googleapis.com/temp-storage-for-end-to-end-tests/staging-it/beamapp-jenkins-0118001202-161686.1547770322.161809/six-1.12.0.tar.gz",

            "name": "six-1.12.0.tar.gz"
          }, 
          {
            "location": "storage.googleapis.com/temp-storage-for-end-to-end-tests/staging-it/beamapp-jenkins-0118001202-161686.1547770322.161809/six-1.11.0.tar.gz",

            "name": "six-1.11.0.tar.gz"
          }, 
          {
            "location": "storage.googleapis.com/temp-storage-for-end-to-end-tests/staging-it/beamapp-jenkins-0118001202-161686.1547770322.161809/setuptools-40.6.2.zip",

            "name": "setuptools-40.6.2.zip"
          }, 
          {
            "location": "storage.googleapis.com/temp-storage-for-end-to-end-tests/staging-it/beamapp-jenkins-0118001202-161686.1547770322.161809/setuptools-40.6.3.zip",

            "name": "setuptools-40.6.3.zip"
          }, 
          {
            "location": "storage.googleapis.com/temp-storage-for-end-to-end-tests/staging-it/beamapp-jenkins-0118001202-161686.1547770322.161809/funcsigs-1.0.2.tar.gz",

            "name": "funcsigs-1.0.2.tar.gz"
          }, 
          {
            "location": "storage.googleapis.com/temp-storage-for-end-to-end-tests/staging-it/beamapp-jenkins-0118001202-161686.1547770322.161809/dataflow_python_sdk.tar",

            "name": "dataflow_python_sdk.tar"
          }
        ], 
        "taskrunnerSettings": {
          "parallelWorkerSettings": {
            "baseUrl": "https://dataflow.googleapis.com", 
            "servicePath": "https://dataflow.googleapis.com"
          }
        }, 
        "workerHarnessContainerImage": "gcr.io/cloud-dataflow/v1beta3/python:beam-master-20181218"
      }
    ]
  }, 
  "name": "beamapp-jenkins-0118001202-161686", 
  "steps": [
    {
      "kind": "ParallelRead", 
      "name": "s1", 
      "properties": {
        "bigquery_export_format": "FORMAT_AVRO", 
        "bigquery_flatten_results": true, 
        "bigquery_query": "SELECT bytes, date, time FROM [python_query_to_table_15477703219401.python_new_types_table]",

        "bigquery_use_legacy_sql": true, 
        "display_data": [
          {
            "key": "source", 
            "label": "Read Source", 
            "namespace": "apache_beam.io.iobase.Read", 
            "shortValue": "BigQuerySource", 
            "type": "STRING", 
            "value": "apache_beam.io.gcp.bigquery.BigQuerySource"
          }, 
          {
            "key": "query", 
            "label": "Query", 
            "namespace": "apache_beam.io.gcp.bigquery.BigQuerySource", 
            "type": "STRING", 
            "value": "SELECT bytes, date, time FROM [python_query_to_table_15477703219401.python_new_types_table]"
          }, 
          {
            "key": "validation", 
            "label": "Validation Enabled", 
            "namespace": "apache_beam.io.gcp.bigquery.BigQuerySource", 
            "type": "BOOLEAN", 
            "value": false
          }
        ], 
        "format": "bigquery", 
        "output_info": [
          {
            "encoding": {
              "@type": "kind:windowed_value", 
              "component_encodings": [
                {
                  "@type": "FastPrimitivesCoder$eNprYEpOLEhMzkiNT0pNzNVLzk9JLSqGUlxuicUlAUWZuZklmWWpxc4gQa5CBs3GQsbaQqZQ/vi0xJycpMTk7Hiw+kJmPEYFZCZn56RCjWABGsFaW8iWVJykBwDlGS3/",

                  "component_encodings": [
                    {
                      "@type": "FastPrimitivesCoder$eNprYEpOLEhMzkiNT0pNzNVLzk9JLSqGUlxuicUlAUWZuZklmWWpxc4gQa5CBs3GQsbaQqZQ/vi0xJycpMTk7Hiw+kJmPEYFZCZn56RCjWABGsFaW8iWVJykBwDlGS3/",

                      "component_encodings": []
                    }, 
                    {
                      "@type": "FastPrimitivesCoder$eNprYEpOLEhMzkiNT0pNzNVLzk9JLSqGUlxuicUlAUWZuZklmWWpxc4gQa5CBs3GQsbaQqZQ/vi0xJycpMTk7Hiw+kJmPEYFZCZn56RCjWABGsFaW8iWVJykBwDlGS3/",

                      "component_encodings": []
                    }
                  ], 
                  "is_pair_like": true
                }, 
                {
                  "@type": "kind:global_window"
                }
              ], 
              "is_wrapper": true
            }, 
            "output_name": "out", 
            "user_name": "read.out"
          }
        ], 
        "user_name": "read"
      }
    }, 
    {
      "kind": "ParallelWrite", 
      "name": "s2", 
      "properties": {
        "create_disposition": "CREATE_IF_NEEDED", 
        "dataset": "python_query_to_table_15477703219401", 
        "display_data": [], 
        "encoding": {
          "@type": "kind:windowed_value", 
          "component_encodings": [
            {
              "@type": "RowAsDictJsonCoder$eNprYEpOLEhMzkiNT0pNzNXLzNdLTy7QS8pMLyxNLarkCsovdyx2yUwu8SrOz3POT0kt4ipk0GwsZKwtZErSAwCu1BVY",

              "component_encodings": []
            }, 
            {
              "@type": "kind:global_window"
            }
          ], 
          "is_wrapper": true
        }, 
        "format": "bigquery", 
        "parallel_input": {
          "@type": "OutputReference", 
          "output_name": "out", 
          "step_name": "s1"
        }, 
        "schema": "{\"fields\": [{\"type\": \"BYTES\", \"name\": \"bytes\", \"mode\": \"NULLABLE\"},
{\"type\": \"DATE\", \"name\": \"date\", \"mode\": \"NULLABLE\"}, {\"type\": \"TIME\", \"name\":
\"time\", \"mode\": \"NULLABLE\"}]}", 
        "table": "output_table", 
        "user_name": "write/NativeWrite", 
        "write_disposition": "WRITE_EMPTY"
      }
    }
  ], 
  "type": "JOB_TYPE_BATCH"
}
root: INFO: Create job: <Job
 createTime: u'2019-01-18T00:12:08.968153Z'
 currentStateTime: u'1970-01-01T00:00:00Z'
 id: u'2019-01-17_16_12_07-4412783943018440782'
 location: u'us-central1'
 name: u'beamapp-jenkins-0118001202-161686'
 projectId: u'apache-beam-testing'
 stageStates: []
 startTime: u'2019-01-18T00:12:08.968153Z'
 steps: []
 tempFiles: []
 type: TypeValueValuesEnum(JOB_TYPE_BATCH, 1)>
root: INFO: Created job with id: [2019-01-17_16_12_07-4412783943018440782]
root: INFO: To access the Dataflow monitoring console, please navigate to https://console.cloud.google.com/dataflow/jobsDetail/locations/us-central1/jobs/2019-01-17_16_12_07-4412783943018440782?project=apache-beam-testing
--------------------- >> end captured logging << ---------------------

----------------------------------------------------------------------
XML: <https://builds.apache.org/job/beam_PostCommit_Python_Verify/ws/src/sdks/python/nosetests.xml>
----------------------------------------------------------------------
Ran 25 tests in 1291.269s

FAILED (failures=8)
Found: https://console.cloud.google.com/dataflow/jobsDetail/locations/us-central1/jobs/2019-01-17_16_04_18-16804632119502071586?project=apache-beam-testing.
Found: https://console.cloud.google.com/dataflow/jobsDetail/locations/us-central1/jobs/2019-01-17_16_04_16-12760763191063522198?project=apache-beam-testing.
Found: https://console.cloud.google.com/dataflow/jobsDetail/locations/us-central1/jobs/2019-01-17_16_04_18-18191618746181279435?project=apache-beam-testing.
Found: https://console.cloud.google.com/dataflow/jobsDetail/locations/us-central1/jobs/2019-01-17_16_04_16-12918140694649865145?project=apache-beam-testing.
Found: https://console.cloud.google.com/dataflow/jobsDetail/locations/us-central1/jobs/2019-01-17_16_04_16-9635888088084985530?project=apache-beam-testing.
Found: https://console.cloud.google.com/dataflow/jobsDetail/locations/us-central1/jobs/2019-01-17_16_11_34-755563016462798137?project=apache-beam-testing.
Found: https://console.cloud.google.com/dataflow/jobsDetail/locations/us-central1/jobs/2019-01-17_16_11_52-1889716050672244101?project=apache-beam-testing.
Found: https://console.cloud.google.com/dataflow/jobsDetail/locations/us-central1/jobs/2019-01-17_16_12_09-14363867080486947495?project=apache-beam-testing.
Found: https://console.cloud.google.com/dataflow/jobsDetail/locations/us-central1/jobs/2019-01-17_16_12_29-2370891105303115669?project=apache-beam-testing.
Found: https://console.cloud.google.com/dataflow/jobsDetail/locations/us-central1/jobs/2019-01-17_16_19_33-7060234173172080111?project=apache-beam-testing.
Found: https://console.cloud.google.com/dataflow/jobsDetail/locations/us-central1/jobs/2019-01-17_16_04_16-1965060406668124620?project=apache-beam-testing.
Found: https://console.cloud.google.com/dataflow/jobsDetail/locations/us-central1/jobs/2019-01-17_16_11_07-8277688014862390990?project=apache-beam-testing.
Found: https://console.cloud.google.com/dataflow/jobsDetail/locations/us-central1/jobs/2019-01-17_16_11_26-2897248715222607480?project=apache-beam-testing.
Found: https://console.cloud.google.com/dataflow/jobsDetail/locations/us-central1/jobs/2019-01-17_16_11_49-12284167218765056424?project=apache-beam-testing.
Found: https://console.cloud.google.com/dataflow/jobsDetail/locations/us-central1/jobs/2019-01-17_16_12_07-4412783943018440782?project=apache-beam-testing.
Found: https://console.cloud.google.com/dataflow/jobsDetail/locations/us-central1/jobs/2019-01-17_16_12_25-8005582123583050756?project=apache-beam-testing.
Found: https://console.cloud.google.com/dataflow/jobsDetail/locations/us-central1/jobs/2019-01-17_16_04_16-9147254678710814736?project=apache-beam-testing.
Found: https://console.cloud.google.com/dataflow/jobsDetail/locations/us-central1/jobs/2019-01-17_16_04_16-6704069796416735648?project=apache-beam-testing.
Found: https://console.cloud.google.com/dataflow/jobsDetail/locations/us-central1/jobs/2019-01-17_16_12_19-9621842759184983074?project=apache-beam-testing.
Found: https://console.cloud.google.com/dataflow/jobsDetail/locations/us-central1/jobs/2019-01-17_16_12_38-11869066417386640423?project=apache-beam-testing.

> Task :beam-sdks-python:postCommitIT FAILED

FAILURE: Build failed with an exception.

* Where:
Build file '<https://builds.apache.org/job/beam_PostCommit_Python_Verify/ws/src/sdks/python/build.gradle'>
line: 276

* What went wrong:
Execution failed for task ':beam-sdks-python:postCommitIT'.
> Process 'command 'sh'' finished with non-zero exit value 1

* Try:
Run with --stacktrace option to get the stack trace. Run with --info or --debug option to
get more log output. Run with --scan to get full insights.

* Get more help at https://help.gradle.org

BUILD FAILED in 25m 31s
6 actionable tasks: 6 executed

Publishing build scan...
https://gradle.com/s/a5dix6qlqchdo

Build step 'Invoke Gradle script' changed build result to FAILURE
Build step 'Invoke Gradle script' marked build as failure

---------------------------------------------------------------------
To unsubscribe, e-mail: builds-unsubscribe@beam.apache.org
For additional commands, e-mail: builds-help@beam.apache.org


Mime
View raw message