beam-builds mailing list archives

Site index · List index
Message view « Date » · « Thread »
Top « Date » · « Thread »
From Apache Jenkins Server <jenk...@builds.apache.org>
Subject Build failed in Jenkins: beam_PreCommit_Java_Cron #792
Date Sun, 06 Jan 2019 12:19:34 GMT
See <https://builds.apache.org/job/beam_PreCommit_Java_Cron/792/display/redirect?page=changes>

Changes:

[tweise] [BEAM-6009] Modify Github template and README to include Flink PVR for

------------------------------------------
[...truncated 743.56 KB...]
  public static OutboundObserverFactory clientBuffered(ExecutorService executorService) {
                                        ^
<https://builds.apache.org/job/beam_PreCommit_Java_Cron/ws/src/sdks/java/fn-execution/src/main/java/org/apache/beam/sdk/fn/stream/OutboundObserverFactory.java>:33:
warning: no @return
  public static OutboundObserverFactory clientBuffered(ExecutorService executorService) {
                                        ^
<https://builds.apache.org/job/beam_PreCommit_Java_Cron/ws/src/sdks/java/fn-execution/src/main/java/org/apache/beam/sdk/fn/stream/OutboundObserverFactory.java>:41:
warning: no @param for executorService
  public static OutboundObserverFactory clientBuffered(
                                        ^
<https://builds.apache.org/job/beam_PreCommit_Java_Cron/ws/src/sdks/java/fn-execution/src/main/java/org/apache/beam/sdk/fn/stream/OutboundObserverFactory.java>:41:
warning: no @param for bufferSize
  public static OutboundObserverFactory clientBuffered(
                                        ^
<https://builds.apache.org/job/beam_PreCommit_Java_Cron/ws/src/sdks/java/fn-execution/src/main/java/org/apache/beam/sdk/fn/stream/OutboundObserverFactory.java>:41:
warning: no @return
  public static OutboundObserverFactory clientBuffered(
                                        ^
<https://builds.apache.org/job/beam_PreCommit_Java_Cron/ws/src/sdks/java/fn-execution/src/main/java/org/apache/beam/sdk/fn/stream/OutboundObserverFactory.java>:51:
warning: no @return
  public static OutboundObserverFactory clientDirect() {
                                        ^
<https://builds.apache.org/job/beam_PreCommit_Java_Cron/ws/src/sdks/java/fn-execution/src/main/java/org/apache/beam/sdk/fn/stream/OutboundObserverFactory.java>:56:
warning: no @return
  public static OutboundObserverFactory serverDirect() {
                                        ^
<https://builds.apache.org/job/beam_PreCommit_Java_Cron/ws/src/sdks/java/fn-execution/src/main/java/org/apache/beam/sdk/fn/stream/OutboundObserverFactory.java>:64:
warning: no @return
  public static OutboundObserverFactory trivial() {
                                        ^
<https://builds.apache.org/job/beam_PreCommit_Java_Cron/ws/src/sdks/java/fn-execution/src/main/java/org/apache/beam/sdk/fn/stream/OutboundObserverFactory.java>:82:
warning: no @param for <ReqT>
  public abstract <ReqT, RespT> StreamObserver<RespT> outboundObserverFor(
                                                      ^
<https://builds.apache.org/job/beam_PreCommit_Java_Cron/ws/src/sdks/java/fn-execution/src/main/java/org/apache/beam/sdk/fn/stream/OutboundObserverFactory.java>:82:
warning: no @param for <RespT>
  public abstract <ReqT, RespT> StreamObserver<RespT> outboundObserverFor(
                                                      ^
<https://builds.apache.org/job/beam_PreCommit_Java_Cron/ws/src/sdks/java/fn-execution/src/main/java/org/apache/beam/sdk/fn/stream/OutboundObserverFactory.java>:82:
warning: no @return
  public abstract <ReqT, RespT> StreamObserver<RespT> outboundObserverFor(
                                                      ^
<https://builds.apache.org/job/beam_PreCommit_Java_Cron/ws/src/sdks/java/fn-execution/src/main/java/org/apache/beam/sdk/fn/stream/SynchronizedStreamObserver.java>:39:
warning: no @param for <V>
  public static <V> StreamObserver<V> wrapping(StreamObserver<V> underlying)
{
                                      ^
<https://builds.apache.org/job/beam_PreCommit_Java_Cron/ws/src/sdks/java/fn-execution/src/main/java/org/apache/beam/sdk/fn/stream/SynchronizedStreamObserver.java>:39:
warning: no @param for underlying
  public static <V> StreamObserver<V> wrapping(StreamObserver<V> underlying)
{
                                      ^
<https://builds.apache.org/job/beam_PreCommit_Java_Cron/ws/src/sdks/java/fn-execution/src/main/java/org/apache/beam/sdk/fn/stream/SynchronizedStreamObserver.java>:39:
warning: no @return
  public static <V> StreamObserver<V> wrapping(StreamObserver<V> underlying)
{
                                      ^
<https://builds.apache.org/job/beam_PreCommit_Java_Cron/ws/src/sdks/java/fn-execution/src/main/java/org/apache/beam/sdk/fn/IdGenerators.java>:26:
warning: no @return
  public static IdGenerator incrementingLongs() {
                            ^
<https://builds.apache.org/job/beam_PreCommit_Java_Cron/ws/src/sdks/java/fn-execution/src/main/java/org/apache/beam/sdk/fn/IdGenerators.java>:32:
warning: no @return
  public static IdGenerator decrementingLongs() {
                            ^
<https://builds.apache.org/job/beam_PreCommit_Java_Cron/ws/src/sdks/java/fn-execution/src/main/java/org/apache/beam/sdk/fn/data/CloseableFnDataReceiver.java>:32:
warning: no description for @throws
   * @throws Exception
     ^
<https://builds.apache.org/job/beam_PreCommit_Java_Cron/ws/src/sdks/java/fn-execution/src/main/java/org/apache/beam/sdk/fn/data/InboundDataClient.java>:39:
warning: no @return
  boolean isDone();
          ^
<https://builds.apache.org/job/beam_PreCommit_Java_Cron/ws/src/sdks/java/fn-execution/src/main/java/org/apache/beam/sdk/fn/data/CompletableFutureInboundDataClient.java>:28:
warning: no @return
  public static InboundDataClient create() {
                                  ^
<https://builds.apache.org/job/beam_PreCommit_Java_Cron/ws/src/sdks/java/fn-execution/src/main/java/org/apache/beam/sdk/fn/data/RemoteGrpcPortWrite.java>:43:
warning: no @param for inputPCollectionId
  public static RemoteGrpcPortWrite writeToPort(String inputPCollectionId, RemoteGrpcPort
port) {
                                    ^
<https://builds.apache.org/job/beam_PreCommit_Java_Cron/ws/src/sdks/java/fn-execution/src/main/java/org/apache/beam/sdk/fn/data/RemoteGrpcPortWrite.java>:43:
warning: no @param for port
  public static RemoteGrpcPortWrite writeToPort(String inputPCollectionId, RemoteGrpcPort
port) {
                                    ^
<https://builds.apache.org/job/beam_PreCommit_Java_Cron/ws/src/sdks/java/fn-execution/src/main/java/org/apache/beam/sdk/fn/data/RemoteGrpcPortWrite.java>:43:
warning: no @return
  public static RemoteGrpcPortWrite writeToPort(String inputPCollectionId, RemoteGrpcPort
port) {
                                    ^
<https://builds.apache.org/job/beam_PreCommit_Java_Cron/ws/src/sdks/java/fn-execution/src/main/java/org/apache/beam/sdk/fn/channel/ManagedChannelFactory.java>:48:
warning: no @param for descriptor
  protected abstract ManagedChannelBuilder<?> builderFor(ApiServiceDescriptor descriptor);
                                              ^
<https://builds.apache.org/job/beam_PreCommit_Java_Cron/ws/src/sdks/java/fn-execution/src/main/java/org/apache/beam/sdk/fn/channel/ManagedChannelFactory.java>:48:
warning: no @return
  protected abstract ManagedChannelBuilder<?> builderFor(ApiServiceDescriptor descriptor);
                                              ^
<https://builds.apache.org/job/beam_PreCommit_Java_Cron/ws/src/sdks/java/fn-execution/src/main/java/org/apache/beam/sdk/fn/channel/ManagedChannelFactory.java>:54:
warning: no @param for interceptors
  public ManagedChannelFactory withInterceptors(List<ClientInterceptor> interceptors)
{
                               ^
<https://builds.apache.org/job/beam_PreCommit_Java_Cron/ws/src/sdks/java/fn-execution/src/main/java/org/apache/beam/sdk/fn/channel/ManagedChannelFactory.java>:54:
warning: no @return
  public ManagedChannelFactory withInterceptors(List<ClientInterceptor> interceptors)
{
                               ^
<https://builds.apache.org/job/beam_PreCommit_Java_Cron/ws/src/sdks/java/fn-execution/src/main/java/org/apache/beam/sdk/fn/test/TestStreams.java>:31:
warning: no @param for <T>
  public static <T> Builder<T> withOnNext(Consumer<T> onNext) {
                               ^
<https://builds.apache.org/job/beam_PreCommit_Java_Cron/ws/src/sdks/java/fn-execution/src/main/java/org/apache/beam/sdk/fn/test/TestStreams.java>:31:
warning: no @param for onNext
  public static <T> Builder<T> withOnNext(Consumer<T> onNext) {
                               ^
<https://builds.apache.org/job/beam_PreCommit_Java_Cron/ws/src/sdks/java/fn-execution/src/main/java/org/apache/beam/sdk/fn/test/TestStreams.java>:31:
warning: no @return
  public static <T> Builder<T> withOnNext(Consumer<T> onNext) {
                               ^
<https://builds.apache.org/job/beam_PreCommit_Java_Cron/ws/src/sdks/java/fn-execution/src/main/java/org/apache/beam/sdk/fn/test/TestStreams.java>:52:
warning: no @param for isReady
    public Builder<T> withIsReady(Supplier<Boolean> isReady) {
                      ^
<https://builds.apache.org/job/beam_PreCommit_Java_Cron/ws/src/sdks/java/fn-execution/src/main/java/org/apache/beam/sdk/fn/test/TestStreams.java>:52:
warning: no @return
    public Builder<T> withIsReady(Supplier<Boolean> isReady) {
                      ^
<https://builds.apache.org/job/beam_PreCommit_Java_Cron/ws/src/sdks/java/fn-execution/src/main/java/org/apache/beam/sdk/fn/test/TestStreams.java>:62:
warning: no @param for onCompleted
    public Builder<T> withOnCompleted(Runnable onCompleted) {
                      ^
<https://builds.apache.org/job/beam_PreCommit_Java_Cron/ws/src/sdks/java/fn-execution/src/main/java/org/apache/beam/sdk/fn/test/TestStreams.java>:62:
warning: no @return
    public Builder<T> withOnCompleted(Runnable onCompleted) {
                      ^
<https://builds.apache.org/job/beam_PreCommit_Java_Cron/ws/src/sdks/java/fn-execution/src/main/java/org/apache/beam/sdk/fn/test/TestStreams.java>:72:
warning: no @param for onError
    public Builder<T> withOnError(final Runnable onError) {
                      ^
<https://builds.apache.org/job/beam_PreCommit_Java_Cron/ws/src/sdks/java/fn-execution/src/main/java/org/apache/beam/sdk/fn/test/TestStreams.java>:72:
warning: no @return
    public Builder<T> withOnError(final Runnable onError) {
                      ^
<https://builds.apache.org/job/beam_PreCommit_Java_Cron/ws/src/sdks/java/fn-execution/src/main/java/org/apache/beam/sdk/fn/test/TestStreams.java>:82:
warning: no @param for onError
    public Builder<T> withOnError(Consumer<Throwable> onError) {
                      ^
<https://builds.apache.org/job/beam_PreCommit_Java_Cron/ws/src/sdks/java/fn-execution/src/main/java/org/apache/beam/sdk/fn/test/TestStreams.java>:82:
warning: no @return
    public Builder<T> withOnError(Consumer<Throwable> onError) {
                      ^
<https://builds.apache.org/job/beam_PreCommit_Java_Cron/ws/src/sdks/java/fn-execution/src/main/java/org/apache/beam/sdk/fn/channel/SocketAddressFactory.java>:34:
warning: no @param for value
  public static SocketAddress createFrom(String value) {
                              ^
<https://builds.apache.org/job/beam_PreCommit_Java_Cron/ws/src/sdks/java/fn-execution/src/main/java/org/apache/beam/sdk/fn/channel/SocketAddressFactory.java>:34:
warning: no @return
  public static SocketAddress createFrom(String value) {
                              ^
<https://builds.apache.org/job/beam_PreCommit_Java_Cron/ws/src/sdks/java/fn-execution/src/main/java/org/apache/beam/sdk/fn/splittabledofn/RestrictionTrackers.java>:126:
warning: no @param for <RestrictionT>
  public static <RestrictionT, PositionT> RestrictionTracker<RestrictionT, PositionT>
observe(
                                                                                      ^
<https://builds.apache.org/job/beam_PreCommit_Java_Cron/ws/src/sdks/java/fn-execution/src/main/java/org/apache/beam/sdk/fn/splittabledofn/RestrictionTrackers.java>:126:
warning: no @param for <PositionT>
  public static <RestrictionT, PositionT> RestrictionTracker<RestrictionT, PositionT>
observe(
                                                                                      ^
<https://builds.apache.org/job/beam_PreCommit_Java_Cron/ws/src/sdks/java/fn-execution/src/main/java/org/apache/beam/sdk/fn/splittabledofn/RestrictionTrackers.java>:126:
warning: no @param for restrictionTracker
  public static <RestrictionT, PositionT> RestrictionTracker<RestrictionT, PositionT>
observe(
                                                                                      ^
<https://builds.apache.org/job/beam_PreCommit_Java_Cron/ws/src/sdks/java/fn-execution/src/main/java/org/apache/beam/sdk/fn/splittabledofn/RestrictionTrackers.java>:126:
warning: no @param for claimObserver
  public static <RestrictionT, PositionT> RestrictionTracker<RestrictionT, PositionT>
observe(
                                                                                      ^
<https://builds.apache.org/job/beam_PreCommit_Java_Cron/ws/src/sdks/java/fn-execution/src/main/java/org/apache/beam/sdk/fn/splittabledofn/RestrictionTrackers.java>:126:
warning: no @return
  public static <RestrictionT, PositionT> RestrictionTracker<RestrictionT, PositionT>
observe(
                                                                                      ^
<https://builds.apache.org/job/beam_PreCommit_Java_Cron/ws/src/sdks/java/fn-execution/src/main/java/org/apache/beam/sdk/fn/splittabledofn/RestrictionTrackers.java>:31:
warning: no @param for position
    void onClaimed(PositionT position);
         ^
<https://builds.apache.org/job/beam_PreCommit_Java_Cron/ws/src/sdks/java/fn-execution/src/main/java/org/apache/beam/sdk/fn/splittabledofn/RestrictionTrackers.java>:34:
warning: no @param for position
    void onClaimFailed(PositionT position);
         ^
53 warnings

> Task :beam-sdks-java-javadoc:allJavadoc
> Task :beam-sdks-java-extensions-euphoria:test
> Task :beam-sdks-java-extensions-euphoria:check
> Task :beam-sdks-java-extensions-euphoria:build
> Task :beam-sdks-java-extensions-euphoria:buildDependents
> Task :beam-sdks-java-extensions-kryo:buildDependents
> Task :beam-sdks-java-core:validateShadedJarDoesntLeakNonProjectClasses
> Task :beam-sdks-java-core:check
> Task :beam-sdks-java-core:build
> Task :beam-sdks-java-core:buildNeeded
> Task :beam-sdks-java-fn-execution:test
> Task :beam-sdks-java-fn-execution:validateShadedJarDoesntLeakNonProjectClasses
> Task :beam-sdks-java-fn-execution:check
> Task :beam-sdks-java-fn-execution:build
> Task :beam-sdks-java-nexmark:shadowJar
> Task :beam-sdks-java-nexmark:validateShadedJarDoesntLeakNonProjectClasses
> Task :beam-sdks-java-nexmark:check
> Task :beam-sdks-java-nexmark:build
> Task :beam-sdks-java-nexmark:buildDependents
> Task :beam-sdks-java-io-kafka:buildDependents
> Task :beam-sdks-java-test-utils:buildDependents

FAILURE: Build completed with 6 failures.

1: Task failed with an exception.
-----------
* What went wrong:
Execution failed for task ':beam-sdks-java-io-elasticsearch-tests-6:test'.
> Process 'Gradle Test Executor 59' finished with non-zero exit value 1
  This problem might be caused by incorrect test process configuration.
  Please refer to the test execution section in the user guide at https://docs.gradle.org/4.10.3/userguide/java_plugin.html#sec:test_execution

* Try:
Run with --stacktrace option to get the stack trace. Run with --info or --debug option to
get more log output. Run with --scan to get full insights.
==============================================================================

2: Task failed with an exception.
-----------
* What went wrong:
Execution failed for task ':beam-runners-google-cloud-dataflow-java-fn-api-worker:test'.
> Process 'Gradle Test Executor 53' finished with non-zero exit value 1
  This problem might be caused by incorrect test process configuration.
  Please refer to the test execution section in the user guide at https://docs.gradle.org/4.10.3/userguide/java_plugin.html#sec:test_execution

* Try:
Run with --stacktrace option to get the stack trace. Run with --info or --debug option to
get more log output. Run with --scan to get full insights.
==============================================================================

3: Task failed with an exception.
-----------
* What went wrong:
Execution failed for task ':beam-sdks-java-io-hbase:test'.
> Process 'Gradle Test Executor 65' finished with non-zero exit value 1
  This problem might be caused by incorrect test process configuration.
  Please refer to the test execution section in the user guide at https://docs.gradle.org/4.10.3/userguide/java_plugin.html#sec:test_execution

* Try:
Run with --stacktrace option to get the stack trace. Run with --info or --debug option to
get more log output. Run with --scan to get full insights.
==============================================================================

4: Task failed with an exception.
-----------
* What went wrong:
Execution failed for task ':beam-sdks-java-io-hadoop-file-system:test'.
> Process 'Gradle Test Executor 64' finished with non-zero exit value 1
  This problem might be caused by incorrect test process configuration.
  Please refer to the test execution section in the user guide at https://docs.gradle.org/4.10.3/userguide/java_plugin.html#sec:test_execution

* Try:
Run with --stacktrace option to get the stack trace. Run with --info or --debug option to
get more log output. Run with --scan to get full insights.
==============================================================================

5: Task failed with an exception.
-----------
* What went wrong:
Execution failed for task ':beam-sdks-java-extensions-sql:test'.
> Process 'Gradle Test Executor 66' finished with non-zero exit value 1
  This problem might be caused by incorrect test process configuration.
  Please refer to the test execution section in the user guide at https://docs.gradle.org/4.10.3/userguide/java_plugin.html#sec:test_execution

* Try:
Run with --stacktrace option to get the stack trace. Run with --info or --debug option to
get more log output. Run with --scan to get full insights.
==============================================================================

6: Task failed with an exception.
-----------
* What went wrong:
Execution failed for task ':beam-sdks-java-io-google-cloud-platform:test'.
> Process 'Gradle Test Executor 56' finished with non-zero exit value 1
  This problem might be caused by incorrect test process configuration.
  Please refer to the test execution section in the user guide at https://docs.gradle.org/4.10.3/userguide/java_plugin.html#sec:test_execution

* Try:
Run with --stacktrace option to get the stack trace. Run with --info or --debug option to
get more log output. Run with --scan to get full insights.
==============================================================================

* Get more help at https://help.gradle.org

Deprecated Gradle features were used in this build, making it incompatible with Gradle 5.0.
Use '--warning-mode all' to show the individual deprecation warnings.
See https://docs.gradle.org/4.10.3/userguide/command_line_interface.html#sec:command_line_warnings

BUILD FAILED in 19m 11s
859 actionable tasks: 845 executed, 14 from cache

Publishing build scan...
https://gradle.com/s/23wpiv7pne7au

Build step 'Invoke Gradle script' changed build result to FAILURE
Build step 'Invoke Gradle script' marked build as failure

---------------------------------------------------------------------
To unsubscribe, e-mail: builds-unsubscribe@beam.apache.org
For additional commands, e-mail: builds-help@beam.apache.org


Mime
View raw message