beam-builds mailing list archives

Site index · List index
Message view « Date » · « Thread »
Top « Date » · « Thread »
From Apache Jenkins Server <jenk...@builds.apache.org>
Subject Build failed in Jenkins: beam_Release_NightlySnapshot #289
Date Wed, 02 Jan 2019 20:25:56 GMT
See <https://builds.apache.org/job/beam_Release_NightlySnapshot/289/display/redirect?page=changes>

Changes:

[scott] Upgrade vendored gRPC artifact version to 0.2

[robbe.sneyders] Python 3 port io.range_trackers

[robbe.sneyders] Add io.restriction_trackers_test to Python 3 test suite

[scott] [BEAM-6056] Source vendored grpc dependency from Maven central

------------------------------------------
[...truncated 55.23 MB...]
              ^
<https://builds.apache.org/job/beam_Release_NightlySnapshot/ws/src/sdks/java/testing/test-utils/src/main/java/org/apache/beam/sdk/testutils/publishing/BigQueryClient.java>:118:
warning: no @param for table
  public void insertRow(Map<String, ?> row, String table) {
              ^
<https://builds.apache.org/job/beam_Release_NightlySnapshot/ws/src/sdks/java/testing/test-utils/src/main/java/org/apache/beam/sdk/testutils/publishing/BigQueryClient.java>:123:
warning: no @param for rows
  public void insertAll(Collection<Map<String, ?>> rows, String table) {
              ^
<https://builds.apache.org/job/beam_Release_NightlySnapshot/ws/src/sdks/java/testing/test-utils/src/main/java/org/apache/beam/sdk/testutils/publishing/BigQueryClient.java>:123:
warning: no @param for table
  public void insertAll(Collection<Map<String, ?>> rows, String table) {
              ^
<https://builds.apache.org/job/beam_Release_NightlySnapshot/ws/src/sdks/java/testing/test-utils/src/main/java/org/apache/beam/sdk/testutils/metrics/MetricsReader.java>:63:
warning: no @param for name
  public long getCounterMetric(String name) {
              ^
<https://builds.apache.org/job/beam_Release_NightlySnapshot/ws/src/sdks/java/testing/test-utils/src/main/java/org/apache/beam/sdk/testutils/metrics/MetricsReader.java>:63:
warning: no @return
  public long getCounterMetric(String name) {
              ^
<https://builds.apache.org/job/beam_Release_NightlySnapshot/ws/src/sdks/java/testing/test-utils/src/main/java/org/apache/beam/sdk/testutils/metrics/MetricsReader.java>:88:
warning: no @param for name
  public long getStartTimeMetric(String name) {
              ^
<https://builds.apache.org/job/beam_Release_NightlySnapshot/ws/src/sdks/java/testing/test-utils/src/main/java/org/apache/beam/sdk/testutils/metrics/MetricsReader.java>:88:
warning: no @return
  public long getStartTimeMetric(String name) {
              ^
<https://builds.apache.org/job/beam_Release_NightlySnapshot/ws/src/sdks/java/testing/test-utils/src/main/java/org/apache/beam/sdk/testutils/metrics/MetricsReader.java>:107:
warning: no @param for name
  public long getEndTimeMetric(String name) {
              ^
<https://builds.apache.org/job/beam_Release_NightlySnapshot/ws/src/sdks/java/testing/test-utils/src/main/java/org/apache/beam/sdk/testutils/metrics/MetricsReader.java>:107:
warning: no @return
  public long getEndTimeMetric(String name) {
              ^
<https://builds.apache.org/job/beam_Release_NightlySnapshot/ws/src/sdks/java/testing/test-utils/src/main/java/org/apache/beam/sdk/testutils/TestResult.java>:29:
warning: no @return
  Map<String, Object> toMap();
                      ^
16 warnings
Packing task ':beam-sdks-java-test-utils:javadoc'
:beam-sdks-java-test-utils:javadoc (Thread[Task worker for ':' Thread 7,5,main]) completed.
Took 1.079 secs.
:beam-sdks-java-test-utils:javadocJar (Thread[Task worker for ':' Thread 7,5,main]) started.

> Task :beam-sdks-java-test-utils:javadocJar
Build cache key for task ':beam-sdks-java-test-utils:javadocJar' is 85a7e3ecc5a555949ea07b8de0647900
Caching disabled for task ':beam-sdks-java-test-utils:javadocJar': Caching has not been enabled
for the task
Task ':beam-sdks-java-test-utils:javadocJar' is not up-to-date because:
  No history is available.
:beam-sdks-java-test-utils:javadocJar (Thread[Task worker for ':' Thread 7,5,main]) completed.
Took 0.009 secs.
:beam-sdks-java-test-utils:sourcesJar (Thread[Task worker for ':' Thread 7,5,main]) started.

> Task :beam-sdks-java-test-utils:sourcesJar
file or directory '<https://builds.apache.org/job/beam_Release_NightlySnapshot/ws/src/sdks/java/testing/test-utils/src/main/resources',>
not found
Build cache key for task ':beam-sdks-java-test-utils:sourcesJar' is 565136da2b9da02fe8c8f27f16838e63
Caching disabled for task ':beam-sdks-java-test-utils:sourcesJar': Caching has not been enabled
for the task
Task ':beam-sdks-java-test-utils:sourcesJar' is not up-to-date because:
  No history is available.
file or directory '<https://builds.apache.org/job/beam_Release_NightlySnapshot/ws/src/sdks/java/testing/test-utils/src/main/resources',>
not found
:beam-sdks-java-test-utils:sourcesJar (Thread[Task worker for ':' Thread 7,5,main]) completed.
Took 0.006 secs.
:beam-sdks-java-test-utils:testSourcesJar (Thread[Task worker for ':' Thread 7,5,main]) started.

> Task :beam-sdks-java-test-utils:testSourcesJar
file or directory '<https://builds.apache.org/job/beam_Release_NightlySnapshot/ws/src/sdks/java/testing/test-utils/src/test/resources',>
not found
Build cache key for task ':beam-sdks-java-test-utils:testSourcesJar' is 02285a2fd38e17d8a6d0c7d7eb9fbca6
Caching disabled for task ':beam-sdks-java-test-utils:testSourcesJar': Caching has not been
enabled for the task
Task ':beam-sdks-java-test-utils:testSourcesJar' is not up-to-date because:
  No history is available.
file or directory '<https://builds.apache.org/job/beam_Release_NightlySnapshot/ws/src/sdks/java/testing/test-utils/src/test/resources',>
not found
:beam-sdks-java-test-utils:testSourcesJar (Thread[Task worker for ':' Thread 7,5,main]) completed.
Took 0.005 secs.
:beam-sdks-java-test-utils:publishMavenJavaPublicationToMavenRepository (Thread[Task worker
for ':' Thread 7,5,main]) started.

> Task :beam-sdks-java-test-utils:publishMavenJavaPublicationToMavenRepository
Caching disabled for task ':beam-sdks-java-test-utils:publishMavenJavaPublicationToMavenRepository':
Caching has not been enabled for the task
Task ':beam-sdks-java-test-utils:publishMavenJavaPublicationToMavenRepository' is not up-to-date
because:
  Task has not declared any outputs despite executing actions.
Publishing to repository 'maven' (https://repository.apache.org/content/repositories/snapshots)
Deploying to https://repository.apache.org/content/repositories/snapshots
Downloading: org/apache/beam/beam-sdks-java-test-utils/2.10.0-SNAPSHOT/maven-metadata.xml
from repository remote at https://repository.apache.org/content/repositories/snapshots/
Uploading: org/apache/beam/beam-sdks-java-test-utils/2.10.0-SNAPSHOT/beam-sdks-java-test-utils-2.10.0-20190102.202542-26.jar
to repository remote at https://repository.apache.org/content/repositories/snapshots/
Uploading: org/apache/beam/beam-sdks-java-test-utils/2.10.0-SNAPSHOT/beam-sdks-java-test-utils-2.10.0-20190102.202542-26.pom
to repository remote at https://repository.apache.org/content/repositories/snapshots/
Uploading: org/apache/beam/beam-sdks-java-test-utils/2.10.0-SNAPSHOT/beam-sdks-java-test-utils-2.10.0-20190102.202542-26-tests.jar
to repository remote at https://repository.apache.org/content/repositories/snapshots/
Uploading: org/apache/beam/beam-sdks-java-test-utils/2.10.0-SNAPSHOT/beam-sdks-java-test-utils-2.10.0-20190102.202542-26-sources.jar
to repository remote at https://repository.apache.org/content/repositories/snapshots/
Uploading: org/apache/beam/beam-sdks-java-test-utils/2.10.0-SNAPSHOT/beam-sdks-java-test-utils-2.10.0-20190102.202542-26-test-sources.jar
to repository remote at https://repository.apache.org/content/repositories/snapshots/
Uploading: org/apache/beam/beam-sdks-java-test-utils/2.10.0-SNAPSHOT/beam-sdks-java-test-utils-2.10.0-20190102.202542-26-javadoc.jar
to repository remote at https://repository.apache.org/content/repositories/snapshots/
Downloading: org/apache/beam/beam-sdks-java-test-utils/maven-metadata.xml from repository
remote at https://repository.apache.org/content/repositories/snapshots/
Uploading: org/apache/beam/beam-sdks-java-test-utils/2.10.0-SNAPSHOT/maven-metadata.xml to
repository remote at https://repository.apache.org/content/repositories/snapshots/
Uploading: org/apache/beam/beam-sdks-java-test-utils/maven-metadata.xml to repository remote
at https://repository.apache.org/content/repositories/snapshots/
:beam-sdks-java-test-utils:publishMavenJavaPublicationToMavenRepository (Thread[Task worker
for ':' Thread 7,5,main]) completed. Took 5.438 secs.
:beam-sdks-java-test-utils:publishMavenJavaPublicationToTestPublicationLocalRepository (Thread[Task
worker for ':' Thread 7,5,main]) started.

> Task :beam-sdks-java-test-utils:publishMavenJavaPublicationToTestPublicationLocalRepository
Caching disabled for task ':beam-sdks-java-test-utils:publishMavenJavaPublicationToTestPublicationLocalRepository':
Caching has not been enabled for the task
Task ':beam-sdks-java-test-utils:publishMavenJavaPublicationToTestPublicationLocalRepository'
is not up-to-date because:
  Task has not declared any outputs despite executing actions.
Publishing to repository 'testPublicationLocal' (<https://builds.apache.org/job/beam_Release_NightlySnapshot/ws/src/testPublication/)>
Deploying to <https://builds.apache.org/job/beam_Release_NightlySnapshot/ws/src/testPublication/>
Downloading: org/apache/beam/beam-sdks-java-test-utils/2.10.0-SNAPSHOT/maven-metadata.xml
from repository remote at <https://builds.apache.org/job/beam_Release_NightlySnapshot/ws/src/testPublication/>
Could not find metadata org.apache.beam:beam-sdks-java-test-utils:2.10.0-SNAPSHOT/maven-metadata.xml
in remote (<https://builds.apache.org/job/beam_Release_NightlySnapshot/ws/src/testPublication/)>
Uploading: org/apache/beam/beam-sdks-java-test-utils/2.10.0-SNAPSHOT/beam-sdks-java-test-utils-2.10.0-20190102.202547-1.jar
to repository remote at <https://builds.apache.org/job/beam_Release_NightlySnapshot/ws/src/testPublication/>
Uploading: org/apache/beam/beam-sdks-java-test-utils/2.10.0-SNAPSHOT/beam-sdks-java-test-utils-2.10.0-20190102.202547-1.pom
to repository remote at <https://builds.apache.org/job/beam_Release_NightlySnapshot/ws/src/testPublication/>
Uploading: org/apache/beam/beam-sdks-java-test-utils/2.10.0-SNAPSHOT/beam-sdks-java-test-utils-2.10.0-20190102.202547-1-tests.jar
to repository remote at <https://builds.apache.org/job/beam_Release_NightlySnapshot/ws/src/testPublication/>
Uploading: org/apache/beam/beam-sdks-java-test-utils/2.10.0-SNAPSHOT/beam-sdks-java-test-utils-2.10.0-20190102.202547-1-sources.jar
to repository remote at <https://builds.apache.org/job/beam_Release_NightlySnapshot/ws/src/testPublication/>
Uploading: org/apache/beam/beam-sdks-java-test-utils/2.10.0-SNAPSHOT/beam-sdks-java-test-utils-2.10.0-20190102.202547-1-test-sources.jar
to repository remote at <https://builds.apache.org/job/beam_Release_NightlySnapshot/ws/src/testPublication/>
Uploading: org/apache/beam/beam-sdks-java-test-utils/2.10.0-SNAPSHOT/beam-sdks-java-test-utils-2.10.0-20190102.202547-1-javadoc.jar
to repository remote at <https://builds.apache.org/job/beam_Release_NightlySnapshot/ws/src/testPublication/>
Downloading: org/apache/beam/beam-sdks-java-test-utils/maven-metadata.xml from repository
remote at <https://builds.apache.org/job/beam_Release_NightlySnapshot/ws/src/testPublication/>
Could not find metadata org.apache.beam:beam-sdks-java-test-utils/maven-metadata.xml in remote
(<https://builds.apache.org/job/beam_Release_NightlySnapshot/ws/src/testPublication/)>
Uploading: org/apache/beam/beam-sdks-java-test-utils/2.10.0-SNAPSHOT/maven-metadata.xml to
repository remote at <https://builds.apache.org/job/beam_Release_NightlySnapshot/ws/src/testPublication/>
Uploading: org/apache/beam/beam-sdks-java-test-utils/maven-metadata.xml to repository remote
at <https://builds.apache.org/job/beam_Release_NightlySnapshot/ws/src/testPublication/>
:beam-sdks-java-test-utils:publishMavenJavaPublicationToTestPublicationLocalRepository (Thread[Task
worker for ':' Thread 7,5,main]) completed. Took 0.097 secs.
:beam-sdks-java-test-utils:publish (Thread[Task worker for ':' Thread 7,5,main]) started.

> Task :beam-sdks-java-test-utils:publish
Skipping task ':beam-sdks-java-test-utils:publish' as it has no actions.
:beam-sdks-java-test-utils:publish (Thread[Task worker for ':' Thread 7,5,main]) completed.
Took 0.0 secs.
:beam-vendor-sdks-java-extensions-protobuf:javadoc (Thread[Task worker for ':' Thread 7,5,main])
started.

> Task :beam-vendor-sdks-java-extensions-protobuf:javadoc NO-SOURCE
file or directory '<https://builds.apache.org/job/beam_Release_NightlySnapshot/ws/src/vendor/sdks-java-extensions-protobuf/src/main/java',>
not found
Skipping task ':beam-vendor-sdks-java-extensions-protobuf:javadoc' as it has no source files
and no previous output files.
:beam-vendor-sdks-java-extensions-protobuf:javadoc (Thread[Task worker for ':' Thread 7,5,main])
completed. Took 0.0 secs.
:beam-vendor-sdks-java-extensions-protobuf:javadocJar (Thread[Task worker for ':' Thread 7,5,main])
started.

> Task :beam-vendor-sdks-java-extensions-protobuf:javadocJar
Build cache key for task ':beam-vendor-sdks-java-extensions-protobuf:javadocJar' is 2b50c5905885674a697a325a077c7fa7
Caching disabled for task ':beam-vendor-sdks-java-extensions-protobuf:javadocJar': Caching
has not been enabled for the task
Task ':beam-vendor-sdks-java-extensions-protobuf:javadocJar' is not up-to-date because:
  No history is available.
:beam-vendor-sdks-java-extensions-protobuf:javadocJar (Thread[Task worker for ':' Thread 7,5,main])
completed. Took 0.002 secs.
:beam-vendor-sdks-java-extensions-protobuf:compileTestJava (Thread[Task worker for ':' Thread
7,5,main]) started.

> Task :beam-vendor-sdks-java-extensions-protobuf:compileTestJava NO-SOURCE
file or directory '<https://builds.apache.org/job/beam_Release_NightlySnapshot/ws/src/vendor/sdks-java-extensions-protobuf/src/test/java',>
not found
Skipping task ':beam-vendor-sdks-java-extensions-protobuf:compileTestJava' as it has no source
files and no previous output files.
:beam-vendor-sdks-java-extensions-protobuf:compileTestJava (Thread[Task worker for ':' Thread
7,5,main]) completed. Took 0.0 secs.
:beam-vendor-sdks-java-extensions-protobuf:processTestResources (Thread[Task worker for ':'
Thread 7,5,main]) started.

> Task :beam-vendor-sdks-java-extensions-protobuf:processTestResources NO-SOURCE
file or directory '<https://builds.apache.org/job/beam_Release_NightlySnapshot/ws/src/vendor/sdks-java-extensions-protobuf/src/test/resources',>
not found
Skipping task ':beam-vendor-sdks-java-extensions-protobuf:processTestResources' as it has
no source files and no previous output files.
:beam-vendor-sdks-java-extensions-protobuf:processTestResources (Thread[Task worker for ':'
Thread 7,5,main]) completed. Took 0.0 secs.
:beam-vendor-sdks-java-extensions-protobuf:testClasses (Thread[Task worker for ':' Thread
7,5,main]) started.

> Task :beam-vendor-sdks-java-extensions-protobuf:testClasses UP-TO-DATE
Skipping task ':beam-vendor-sdks-java-extensions-protobuf:testClasses' as it has no actions.
:beam-vendor-sdks-java-extensions-protobuf:testClasses (Thread[Task worker for ':' Thread
7,5,main]) completed. Took 0.0 secs.
:beam-vendor-sdks-java-extensions-protobuf:shadowTestJar (Thread[Task worker for ':' Thread
7,5,main]) started.

> Task :beam-vendor-sdks-java-extensions-protobuf:shadowTestJar
Build cache key for task ':beam-vendor-sdks-java-extensions-protobuf:shadowTestJar' is 4a9b8d173063ac46ce9091c1115bca86
Caching disabled for task ':beam-vendor-sdks-java-extensions-protobuf:shadowTestJar': Caching
has not been enabled for the task
Task ':beam-vendor-sdks-java-extensions-protobuf:shadowTestJar' is not up-to-date because:
  No history is available.
*******************
GRADLE SHADOW STATS

Total Jars: 2 (includes project)
Total Time: 1.611s [1611ms]
Average Time/Jar: 0.8055s [805.5ms]
*******************
:beam-vendor-sdks-java-extensions-protobuf:shadowTestJar (Thread[Task worker for ':' Thread
7,5,main]) completed. Took 1.63 secs.
:beam-vendor-sdks-java-extensions-protobuf:sourcesJar (Thread[Task worker for ':' Thread 7,5,main])
started.

> Task :beam-vendor-sdks-java-extensions-protobuf:sourcesJar
file or directory '<https://builds.apache.org/job/beam_Release_NightlySnapshot/ws/src/vendor/sdks-java-extensions-protobuf/src/main/resources',>
not found
file or directory '<https://builds.apache.org/job/beam_Release_NightlySnapshot/ws/src/vendor/sdks-java-extensions-protobuf/src/main/java',>
not found
Build cache key for task ':beam-vendor-sdks-java-extensions-protobuf:sourcesJar' is 2b50c5905885674a697a325a077c7fa7
Caching disabled for task ':beam-vendor-sdks-java-extensions-protobuf:sourcesJar': Caching
has not been enabled for the task
Task ':beam-vendor-sdks-java-extensions-protobuf:sourcesJar' is not up-to-date because:
  No history is available.
file or directory '<https://builds.apache.org/job/beam_Release_NightlySnapshot/ws/src/vendor/sdks-java-extensions-protobuf/src/main/resources',>
not found
file or directory '<https://builds.apache.org/job/beam_Release_NightlySnapshot/ws/src/vendor/sdks-java-extensions-protobuf/src/main/java',>
not found
:beam-vendor-sdks-java-extensions-protobuf:sourcesJar (Thread[Task worker for ':' Thread 7,5,main])
completed. Took 0.003 secs.
:beam-vendor-sdks-java-extensions-protobuf:testSourcesJar (Thread[Task worker for ':' Thread
7,5,main]) started.

> Task :beam-vendor-sdks-java-extensions-protobuf:testSourcesJar
file or directory '<https://builds.apache.org/job/beam_Release_NightlySnapshot/ws/src/vendor/sdks-java-extensions-protobuf/src/test/resources',>
not found
file or directory '<https://builds.apache.org/job/beam_Release_NightlySnapshot/ws/src/vendor/sdks-java-extensions-protobuf/src/test/java',>
not found
Build cache key for task ':beam-vendor-sdks-java-extensions-protobuf:testSourcesJar' is 2b50c5905885674a697a325a077c7fa7
Caching disabled for task ':beam-vendor-sdks-java-extensions-protobuf:testSourcesJar': Caching
has not been enabled for the task
Task ':beam-vendor-sdks-java-extensions-protobuf:testSourcesJar' is not up-to-date because:
  No history is available.
file or directory '<https://builds.apache.org/job/beam_Release_NightlySnapshot/ws/src/vendor/sdks-java-extensions-protobuf/src/test/resources',>
not found
file or directory '<https://builds.apache.org/job/beam_Release_NightlySnapshot/ws/src/vendor/sdks-java-extensions-protobuf/src/test/java',>
not found
:beam-vendor-sdks-java-extensions-protobuf:testSourcesJar (Thread[Task worker for ':' Thread
7,5,main]) completed. Took 0.002 secs.
:beam-vendor-sdks-java-extensions-protobuf:publishMavenJavaPublicationToMavenRepository (Thread[Task
worker for ':' Thread 7,5,main]) started.

> Task :beam-vendor-sdks-java-extensions-protobuf:publishMavenJavaPublicationToMavenRepository
Caching disabled for task ':beam-vendor-sdks-java-extensions-protobuf:publishMavenJavaPublicationToMavenRepository':
Caching has not been enabled for the task
Task ':beam-vendor-sdks-java-extensions-protobuf:publishMavenJavaPublicationToMavenRepository'
is not up-to-date because:
  Task has not declared any outputs despite executing actions.
Publishing to repository 'maven' (https://repository.apache.org/content/repositories/snapshots)
Deploying to https://repository.apache.org/content/repositories/snapshots
Downloading: org/apache/beam/beam-vendor-sdks-java-extensions-protobuf/2.10.0-SNAPSHOT/maven-metadata.xml
from repository remote at https://repository.apache.org/content/repositories/snapshots/
Uploading: org/apache/beam/beam-vendor-sdks-java-extensions-protobuf/2.10.0-SNAPSHOT/beam-vendor-sdks-java-extensions-protobuf-2.10.0-20190102.202549-26.jar
to repository remote at https://repository.apache.org/content/repositories/snapshots/
Uploading: org/apache/beam/beam-vendor-sdks-java-extensions-protobuf/2.10.0-SNAPSHOT/beam-vendor-sdks-java-extensions-protobuf-2.10.0-20190102.202549-26.pom
to repository remote at https://repository.apache.org/content/repositories/snapshots/
Uploading: org/apache/beam/beam-vendor-sdks-java-extensions-protobuf/2.10.0-SNAPSHOT/beam-vendor-sdks-java-extensions-protobuf-2.10.0-20190102.202549-26-tests.jar
to repository remote at https://repository.apache.org/content/repositories/snapshots/
Uploading: org/apache/beam/beam-vendor-sdks-java-extensions-protobuf/2.10.0-SNAPSHOT/beam-vendor-sdks-java-extensions-protobuf-2.10.0-20190102.202549-26-sources.jar
to repository remote at https://repository.apache.org/content/repositories/snapshots/
Uploading: org/apache/beam/beam-vendor-sdks-java-extensions-protobuf/2.10.0-SNAPSHOT/beam-vendor-sdks-java-extensions-protobuf-2.10.0-20190102.202549-26-test-sources.jar
to repository remote at https://repository.apache.org/content/repositories/snapshots/
Uploading: org/apache/beam/beam-vendor-sdks-java-extensions-protobuf/2.10.0-SNAPSHOT/beam-vendor-sdks-java-extensions-protobuf-2.10.0-20190102.202549-26-javadoc.jar
to repository remote at https://repository.apache.org/content/repositories/snapshots/
Downloading: org/apache/beam/beam-vendor-sdks-java-extensions-protobuf/maven-metadata.xml
from repository remote at https://repository.apache.org/content/repositories/snapshots/
Uploading: org/apache/beam/beam-vendor-sdks-java-extensions-protobuf/2.10.0-SNAPSHOT/maven-metadata.xml
to repository remote at https://repository.apache.org/content/repositories/snapshots/
Uploading: org/apache/beam/beam-vendor-sdks-java-extensions-protobuf/maven-metadata.xml to
repository remote at https://repository.apache.org/content/repositories/snapshots/
:beam-vendor-sdks-java-extensions-protobuf:publishMavenJavaPublicationToMavenRepository (Thread[Task
worker for ':' Thread 7,5,main]) completed. Took 5.395 secs.
:beam-vendor-sdks-java-extensions-protobuf:publishMavenJavaPublicationToTestPublicationLocalRepository
(Thread[Task worker for ':' Thread 7,5,main]) started.

> Task :beam-vendor-sdks-java-extensions-protobuf:publishMavenJavaPublicationToTestPublicationLocalRepository
Caching disabled for task ':beam-vendor-sdks-java-extensions-protobuf:publishMavenJavaPublicationToTestPublicationLocalRepository':
Caching has not been enabled for the task
Task ':beam-vendor-sdks-java-extensions-protobuf:publishMavenJavaPublicationToTestPublicationLocalRepository'
is not up-to-date because:
  Task has not declared any outputs despite executing actions.
Publishing to repository 'testPublicationLocal' (<https://builds.apache.org/job/beam_Release_NightlySnapshot/ws/src/testPublication/)>
Deploying to <https://builds.apache.org/job/beam_Release_NightlySnapshot/ws/src/testPublication/>
Downloading: org/apache/beam/beam-vendor-sdks-java-extensions-protobuf/2.10.0-SNAPSHOT/maven-metadata.xml
from repository remote at <https://builds.apache.org/job/beam_Release_NightlySnapshot/ws/src/testPublication/>
Could not find metadata org.apache.beam:beam-vendor-sdks-java-extensions-protobuf:2.10.0-SNAPSHOT/maven-metadata.xml
in remote (<https://builds.apache.org/job/beam_Release_NightlySnapshot/ws/src/testPublication/)>
Uploading: org/apache/beam/beam-vendor-sdks-java-extensions-protobuf/2.10.0-SNAPSHOT/beam-vendor-sdks-java-extensions-protobuf-2.10.0-20190102.202554-1.jar
to repository remote at <https://builds.apache.org/job/beam_Release_NightlySnapshot/ws/src/testPublication/>
Uploading: org/apache/beam/beam-vendor-sdks-java-extensions-protobuf/2.10.0-SNAPSHOT/beam-vendor-sdks-java-extensions-protobuf-2.10.0-20190102.202554-1.pom
to repository remote at <https://builds.apache.org/job/beam_Release_NightlySnapshot/ws/src/testPublication/>
Uploading: org/apache/beam/beam-vendor-sdks-java-extensions-protobuf/2.10.0-SNAPSHOT/beam-vendor-sdks-java-extensions-protobuf-2.10.0-20190102.202554-1-tests.jar
to repository remote at <https://builds.apache.org/job/beam_Release_NightlySnapshot/ws/src/testPublication/>
Uploading: org/apache/beam/beam-vendor-sdks-java-extensions-protobuf/2.10.0-SNAPSHOT/beam-vendor-sdks-java-extensions-protobuf-2.10.0-20190102.202554-1-sources.jar
to repository remote at <https://builds.apache.org/job/beam_Release_NightlySnapshot/ws/src/testPublication/>
Uploading: org/apache/beam/beam-vendor-sdks-java-extensions-protobuf/2.10.0-SNAPSHOT/beam-vendor-sdks-java-extensions-protobuf-2.10.0-20190102.202554-1-test-sources.jar
to repository remote at <https://builds.apache.org/job/beam_Release_NightlySnapshot/ws/src/testPublication/>
Uploading: org/apache/beam/beam-vendor-sdks-java-extensions-protobuf/2.10.0-SNAPSHOT/beam-vendor-sdks-java-extensions-protobuf-2.10.0-20190102.202554-1-javadoc.jar
to repository remote at <https://builds.apache.org/job/beam_Release_NightlySnapshot/ws/src/testPublication/>
Downloading: org/apache/beam/beam-vendor-sdks-java-extensions-protobuf/maven-metadata.xml
from repository remote at <https://builds.apache.org/job/beam_Release_NightlySnapshot/ws/src/testPublication/>
Could not find metadata org.apache.beam:beam-vendor-sdks-java-extensions-protobuf/maven-metadata.xml
in remote (<https://builds.apache.org/job/beam_Release_NightlySnapshot/ws/src/testPublication/)>
Uploading: org/apache/beam/beam-vendor-sdks-java-extensions-protobuf/2.10.0-SNAPSHOT/maven-metadata.xml
to repository remote at <https://builds.apache.org/job/beam_Release_NightlySnapshot/ws/src/testPublication/>
Uploading: org/apache/beam/beam-vendor-sdks-java-extensions-protobuf/maven-metadata.xml to
repository remote at <https://builds.apache.org/job/beam_Release_NightlySnapshot/ws/src/testPublication/>
:beam-vendor-sdks-java-extensions-protobuf:publishMavenJavaPublicationToTestPublicationLocalRepository
(Thread[Task worker for ':' Thread 7,5,main]) completed. Took 0.093 secs.
:beam-vendor-sdks-java-extensions-protobuf:publish (Thread[Task worker for ':' Thread 7,5,main])
started.

> Task :beam-vendor-sdks-java-extensions-protobuf:publish
Skipping task ':beam-vendor-sdks-java-extensions-protobuf:publish' as it has no actions.
:beam-vendor-sdks-java-extensions-protobuf:publish (Thread[Task worker for ':' Thread 7,5,main])
completed. Took 0.0 secs.

FAILURE: Build failed with an exception.

* What went wrong:
Execution failed for task ':beam-sdks-java-fn-execution:publishMavenJavaPublicationToMavenRepository'.
> Failed to publish publication 'mavenJava' to repository 'maven'
   > Could not write to resource 'https://repository.apache.org/content/repositories/snapshots/org/apache/beam/beam-sdks-java-fn-execution/2.10.0-SNAPSHOT/beam-sdks-java-fn-execution-2.10.0-20190102.201905-26-sources.jar'.
      > repository.apache.org:443 failed to respond

* Try:
Run with --stacktrace option to get the stack trace. Run with --debug option to get more log
output. Run with --scan to get full insights.

* Get more help at https://help.gradle.org

Deprecated Gradle features were used in this build, making it incompatible with Gradle 5.0.
Use '--warning-mode all' to show the individual deprecation warnings.
See https://docs.gradle.org/4.10.2/userguide/command_line_interface.html#sec:command_line_warnings

BUILD FAILED in 17m 50s
905 actionable tasks: 720 executed, 185 up-to-date

Publishing build scan...
https://gradle.com/s/767oxl327py44

Closing Git repo: <https://builds.apache.org/job/beam_Release_NightlySnapshot/ws/src/.git>
Build step 'Invoke Gradle script' changed build result to FAILURE
Build step 'Invoke Gradle script' marked build as failure

---------------------------------------------------------------------
To unsubscribe, e-mail: builds-unsubscribe@beam.apache.org
For additional commands, e-mail: builds-help@beam.apache.org


Mime
View raw message