beam-builds mailing list archives

Site index · List index
Message view « Date » · « Thread »
Top « Date » · « Thread »
From Apache Jenkins Server <jenk...@builds.apache.org>
Subject Build failed in Jenkins: beam_PostRelease_NightlySnapshot #481
Date Thu, 03 Jan 2019 23:51:33 GMT
See <https://builds.apache.org/job/beam_PostRelease_NightlySnapshot/481/display/redirect?page=changes>

Changes:

[huangry] Add paddedcell fix to spotlessJava rules.

[scott] Upgrade html-proofer and dependencies to latest

[scott] Remove broken links to datatorrent.com

[scott] Fix pydoc link to GoogleCloudOptions

[scott] Remove broken link to atrato.io

[scott] Fix link to internal anchor

[scott] Remove stale exclusions from HTML link checker.

[echauchot] split SerializablePipelineOptions into serialization utils and instance

[gleb] Disable UsesMetricsPusher tests for direct-runner

[gleb] Fix SplittableDoFnTest#testBoundedness

[gleb] [BEAM-6352] Ignore tests using Watch PTransform

[gleb] [BEAM-6353] Fix TFRecordIOTest

[gleb] [BEAM-6354] Add timeout and ignore hanging tests

[gleb] Add :beam-runners-direct-java:needsRunnerTests to javaPreCommit

[ehudm] [BEAM-5959] Reorder methods according to convention

------------------------------------------
[...truncated 3.94 MB...]
[INFO] Downloaded from central: https://repo.maven.apache.org/maven2/org/codehaus/plexus/plexus-component-annotations/1.6/plexus-component-annotations-1.6.jar
(4.3 kB at 79 kB/s)
[INFO] Downloading from central: https://repo.maven.apache.org/maven2/jdom/jdom/1.0/jdom-1.0.jar
[INFO] Downloaded from central: https://repo.maven.apache.org/maven2/xml-apis/xml-apis/1.0.b2/xml-apis-1.0.b2.jar
(109 kB at 2.0 MB/s)
[INFO] Downloading from central: https://repo.maven.apache.org/maven2/org/apache/maven/maven-artifact/3.0/maven-artifact-3.0.jar
[INFO] Downloaded from central: https://repo.maven.apache.org/maven2/net/sourceforge/jchardet/jchardet/1.0/jchardet-1.0.jar
(27 kB at 429 kB/s)
[INFO] Downloading from central: https://repo.maven.apache.org/maven2/org/apache/maven/maven-settings-builder/3.0/maven-settings-builder-3.0.jar
[INFO] Downloaded from central: https://repo.maven.apache.org/maven2/org/apache/maven/maven-artifact/3.0/maven-artifact-3.0.jar
(52 kB at 625 kB/s)
[INFO] Downloading from central: https://repo.maven.apache.org/maven2/commons-io/commons-io/2.2/commons-io-2.2.jar
[INFO] Downloaded from central: https://repo.maven.apache.org/maven2/dom4j/dom4j/1.6.1/dom4j-1.6.1.jar
(314 kB at 3.7 MB/s)
[INFO] Downloading from central: https://repo.maven.apache.org/maven2/org/codehaus/plexus/plexus-velocity/1.1.8/plexus-velocity-1.1.8.jar
[INFO] Downloaded from central: https://repo.maven.apache.org/maven2/org/apache/maven/maven-settings-builder/3.0/maven-settings-builder-3.0.jar
(38 kB at 429 kB/s)
[INFO] Downloading from central: https://repo.maven.apache.org/maven2/org/apache/velocity/velocity/1.7/velocity-1.7.jar
[INFO] Downloaded from central: https://repo.maven.apache.org/maven2/org/apache/maven/archetype/archetype-common/3.0.1/archetype-common-3.0.1.jar
(331 kB at 3.1 MB/s)
[INFO] Downloading from central: https://repo.maven.apache.org/maven2/commons-lang/commons-lang/2.4/commons-lang-2.4.jar
[INFO] Downloaded from central: https://repo.maven.apache.org/maven2/org/codehaus/plexus/plexus-velocity/1.1.8/plexus-velocity-1.1.8.jar
(7.9 kB at 70 kB/s)
[INFO] Downloading from central: https://repo.maven.apache.org/maven2/org/apache/maven/wagon/wagon-provider-api/2.8/wagon-provider-api-2.8.jar
[INFO] Downloaded from central: https://repo.maven.apache.org/maven2/jdom/jdom/1.0/jdom-1.0.jar
(153 kB at 1.4 MB/s)
[INFO] Downloading from central: https://repo.maven.apache.org/maven2/org/codehaus/groovy/groovy/1.8.3/groovy-1.8.3.jar
[INFO] Downloaded from central: https://repo.maven.apache.org/maven2/commons-io/commons-io/2.2/commons-io-2.2.jar
(174 kB at 1.5 MB/s)
[INFO] Downloading from central: https://repo.maven.apache.org/maven2/antlr/antlr/2.7.7/antlr-2.7.7.jar
[INFO] Downloaded from central: https://repo.maven.apache.org/maven2/org/apache/maven/wagon/wagon-provider-api/2.8/wagon-provider-api-2.8.jar
(53 kB at 368 kB/s)
[INFO] Downloading from central: https://repo.maven.apache.org/maven2/asm/asm/3.2/asm-3.2.jar
[INFO] Downloaded from central: https://repo.maven.apache.org/maven2/commons-lang/commons-lang/2.4/commons-lang-2.4.jar
(262 kB at 1.8 MB/s)
[INFO] Downloading from central: https://repo.maven.apache.org/maven2/asm/asm-commons/3.2/asm-commons-3.2.jar
[INFO] Downloaded from central: https://repo.maven.apache.org/maven2/org/apache/velocity/velocity/1.7/velocity-1.7.jar
(450 kB at 3.0 MB/s)
[INFO] Downloading from central: https://repo.maven.apache.org/maven2/asm/asm-util/3.2/asm-util-3.2.jar
[INFO] Downloaded from central: https://repo.maven.apache.org/maven2/asm/asm/3.2/asm-3.2.jar
(43 kB at 258 kB/s)
[INFO] Downloading from central: https://repo.maven.apache.org/maven2/asm/asm-analysis/3.2/asm-analysis-3.2.jar
[INFO] Downloaded from central: https://repo.maven.apache.org/maven2/asm/asm-commons/3.2/asm-commons-3.2.jar
(33 kB at 195 kB/s)
[INFO] Downloaded from central: https://repo.maven.apache.org/maven2/antlr/antlr/2.7.7/antlr-2.7.7.jar
(445 kB at 2.6 MB/s)
[INFO] Downloading from central: https://repo.maven.apache.org/maven2/asm/asm-tree/3.2/asm-tree-3.2.jar
[INFO] Downloading from central: https://repo.maven.apache.org/maven2/org/codehaus/plexus/plexus-utils/3.0.21/plexus-utils-3.0.21.jar
[INFO] Downloaded from central: https://repo.maven.apache.org/maven2/asm/asm-util/3.2/asm-util-3.2.jar
(37 kB at 208 kB/s)
[INFO] Downloading from central: https://repo.maven.apache.org/maven2/org/codehaus/plexus/plexus-interactivity-api/1.0-alpha-6/plexus-interactivity-api-1.0-alpha-6.jar
[INFO] Downloaded from central: https://repo.maven.apache.org/maven2/asm/asm-analysis/3.2/asm-analysis-3.2.jar
(18 kB at 93 kB/s)
[INFO] Downloading from central: https://repo.maven.apache.org/maven2/org/apache/maven/maven-plugin-api/3.0/maven-plugin-api-3.0.jar
[INFO] Downloaded from central: https://repo.maven.apache.org/maven2/asm/asm-tree/3.2/asm-tree-3.2.jar
(22 kB at 112 kB/s)
[INFO] Downloading from central: https://repo.maven.apache.org/maven2/org/sonatype/sisu/sisu-inject-plexus/1.4.2/sisu-inject-plexus-1.4.2.jar
[INFO] Downloaded from central: https://repo.maven.apache.org/maven2/org/codehaus/plexus/plexus-interactivity-api/1.0-alpha-6/plexus-interactivity-api-1.0-alpha-6.jar
(12 kB at 58 kB/s)
[INFO] Downloading from central: https://repo.maven.apache.org/maven2/org/sonatype/sisu/sisu-inject-bean/1.4.2/sisu-inject-bean-1.4.2.jar
[INFO] Downloaded from central: https://repo.maven.apache.org/maven2/org/codehaus/plexus/plexus-utils/3.0.21/plexus-utils-3.0.21.jar
(245 kB at 1.2 MB/s)
[INFO] Downloading from central: https://repo.maven.apache.org/maven2/org/sonatype/sisu/sisu-guice/2.1.7/sisu-guice-2.1.7-noaop.jar
[INFO] Downloaded from central: https://repo.maven.apache.org/maven2/org/apache/maven/maven-plugin-api/3.0/maven-plugin-api-3.0.jar
(49 kB at 221 kB/s)
[INFO] Downloading from central: https://repo.maven.apache.org/maven2/org/apache/maven/maven-core/3.0/maven-core-3.0.jar
[INFO] Downloaded from central: https://repo.maven.apache.org/maven2/org/sonatype/sisu/sisu-inject-plexus/1.4.2/sisu-inject-plexus-1.4.2.jar
(202 kB at 862 kB/s)
[INFO] Downloading from central: https://repo.maven.apache.org/maven2/org/apache/maven/maven-repository-metadata/3.0/maven-repository-metadata-3.0.jar
[INFO] Downloaded from central: https://repo.maven.apache.org/maven2/org/sonatype/sisu/sisu-inject-bean/1.4.2/sisu-inject-bean-1.4.2.jar
(153 kB at 643 kB/s)
[INFO] Downloading from central: https://repo.maven.apache.org/maven2/org/apache/maven/maven-model-builder/3.0/maven-model-builder-3.0.jar
[INFO] Downloaded from central: https://repo.maven.apache.org/maven2/org/sonatype/sisu/sisu-guice/2.1.7/sisu-guice-2.1.7-noaop.jar
(472 kB at 1.8 MB/s)
[INFO] Downloading from central: https://repo.maven.apache.org/maven2/org/apache/maven/maven-aether-provider/3.0/maven-aether-provider-3.0.jar
[INFO] Downloaded from central: https://repo.maven.apache.org/maven2/org/apache/maven/maven-repository-metadata/3.0/maven-repository-metadata-3.0.jar
(30 kB at 115 kB/s)
[INFO] Downloading from central: https://repo.maven.apache.org/maven2/org/sonatype/aether/aether-impl/1.7/aether-impl-1.7.jar
[INFO] Downloaded from central: https://repo.maven.apache.org/maven2/org/apache/maven/maven-model-builder/3.0/maven-model-builder-3.0.jar
(148 kB at 546 kB/s)
[INFO] Downloading from central: https://repo.maven.apache.org/maven2/org/sonatype/aether/aether-spi/1.7/aether-spi-1.7.jar
[INFO] Downloaded from central: https://repo.maven.apache.org/maven2/org/apache/maven/maven-core/3.0/maven-core-3.0.jar
(527 kB at 1.8 MB/s)
[INFO] Downloading from central: https://repo.maven.apache.org/maven2/org/sonatype/aether/aether-api/1.7/aether-api-1.7.jar
[INFO] Downloaded from central: https://repo.maven.apache.org/maven2/org/apache/maven/maven-aether-provider/3.0/maven-aether-provider-3.0.jar
(51 kB at 177 kB/s)
[INFO] Downloading from central: https://repo.maven.apache.org/maven2/org/sonatype/aether/aether-util/1.7/aether-util-1.7.jar
[INFO] Downloaded from central: https://repo.maven.apache.org/maven2/org/sonatype/aether/aether-impl/1.7/aether-impl-1.7.jar
(106 kB at 363 kB/s)
[INFO] Downloading from central: https://repo.maven.apache.org/maven2/org/codehaus/plexus/plexus-interpolation/1.14/plexus-interpolation-1.14.jar
[INFO] Downloaded from central: https://repo.maven.apache.org/maven2/org/sonatype/aether/aether-spi/1.7/aether-spi-1.7.jar
(14 kB at 46 kB/s)
[INFO] Downloading from central: https://repo.maven.apache.org/maven2/org/codehaus/plexus/plexus-classworlds/2.2.3/plexus-classworlds-2.2.3.jar
[INFO] Downloaded from central: https://repo.maven.apache.org/maven2/org/sonatype/aether/aether-api/1.7/aether-api-1.7.jar
(74 kB at 235 kB/s)
[INFO] Downloading from central: https://repo.maven.apache.org/maven2/org/sonatype/plexus/plexus-sec-dispatcher/1.3/plexus-sec-dispatcher-1.3.jar
[INFO] Downloaded from central: https://repo.maven.apache.org/maven2/org/sonatype/aether/aether-util/1.7/aether-util-1.7.jar
(108 kB at 334 kB/s)
[INFO] Downloading from central: https://repo.maven.apache.org/maven2/org/sonatype/plexus/plexus-cipher/1.4/plexus-cipher-1.4.jar
[INFO] Downloaded from central: https://repo.maven.apache.org/maven2/org/codehaus/plexus/plexus-interpolation/1.14/plexus-interpolation-1.14.jar
(61 kB at 189 kB/s)
[INFO] Downloading from central: https://repo.maven.apache.org/maven2/org/apache/maven/maven-model/3.0/maven-model-3.0.jar
[INFO] Downloaded from central: https://repo.maven.apache.org/maven2/org/codehaus/plexus/plexus-classworlds/2.2.3/plexus-classworlds-2.2.3.jar
(46 kB at 142 kB/s)
[INFO] Downloading from central: https://repo.maven.apache.org/maven2/org/apache/maven/maven-settings/3.0/maven-settings-3.0.jar
[INFO] Downloaded from central: https://repo.maven.apache.org/maven2/org/sonatype/plexus/plexus-sec-dispatcher/1.3/plexus-sec-dispatcher-1.3.jar
(29 kB at 84 kB/s)
[INFO] Downloading from central: https://repo.maven.apache.org/maven2/org/apache/maven/shared/maven-invoker/2.2/maven-invoker-2.2.jar
[INFO] Downloaded from central: https://repo.maven.apache.org/maven2/org/sonatype/plexus/plexus-cipher/1.4/plexus-cipher-1.4.jar
(13 kB at 39 kB/s)
[INFO] Downloading from central: https://repo.maven.apache.org/maven2/org/apache/maven/shared/maven-artifact-transfer/0.9.0/maven-artifact-transfer-0.9.0.jar
[INFO] Downloaded from central: https://repo.maven.apache.org/maven2/org/apache/maven/maven-settings/3.0/maven-settings-3.0.jar
(47 kB at 132 kB/s)
[INFO] Downloading from central: https://repo.maven.apache.org/maven2/org/apache/maven/shared/maven-common-artifact-filters/3.0.0/maven-common-artifact-filters-3.0.0.jar
[INFO] Downloaded from central: https://repo.maven.apache.org/maven2/org/apache/maven/maven-model/3.0/maven-model-3.0.jar
(165 kB at 460 kB/s)
[INFO] Downloading from central: https://repo.maven.apache.org/maven2/org/apache/maven/shared/maven-shared-utils/3.0.0/maven-shared-utils-3.0.0.jar
[INFO] Downloaded from central: https://repo.maven.apache.org/maven2/org/apache/maven/shared/maven-invoker/2.2/maven-invoker-2.2.jar
(30 kB at 82 kB/s)
[INFO] Downloading from central: https://repo.maven.apache.org/maven2/com/google/code/findbugs/jsr305/2.0.1/jsr305-2.0.1.jar
[INFO] Downloaded from central: https://repo.maven.apache.org/maven2/org/apache/maven/shared/maven-common-artifact-filters/3.0.0/maven-common-artifact-filters-3.0.0.jar
(57 kB at 150 kB/s)
[INFO] Downloading from central: https://repo.maven.apache.org/maven2/commons-codec/commons-codec/1.6/commons-codec-1.6.jar
[INFO] Downloaded from central: https://repo.maven.apache.org/maven2/org/apache/maven/shared/maven-artifact-transfer/0.9.0/maven-artifact-transfer-0.9.0.jar
(123 kB at 322 kB/s)
[INFO] Downloading from central: https://repo.maven.apache.org/maven2/org/slf4j/slf4j-api/1.7.5/slf4j-api-1.7.5.jar
[INFO] Downloaded from central: https://repo.maven.apache.org/maven2/org/apache/maven/shared/maven-shared-utils/3.0.0/maven-shared-utils-3.0.0.jar
(155 kB at 396 kB/s)
[INFO] Downloading from central: https://repo.maven.apache.org/maven2/commons-collections/commons-collections/3.2.1/commons-collections-3.2.1.jar
[INFO] Downloaded from central: https://repo.maven.apache.org/maven2/com/google/code/findbugs/jsr305/2.0.1/jsr305-2.0.1.jar
(32 kB at 81 kB/s)
[INFO] Downloading from central: https://repo.maven.apache.org/maven2/org/apache/maven/shared/maven-script-interpreter/1.0/maven-script-interpreter-1.0.jar
[INFO] Downloaded from central: https://repo.maven.apache.org/maven2/org/slf4j/slf4j-api/1.7.5/slf4j-api-1.7.5.jar
(26 kB at 63 kB/s)
[INFO] Downloading from central: https://repo.maven.apache.org/maven2/org/beanshell/bsh/2.0b4/bsh-2.0b4.jar
[INFO] Downloaded from central: https://repo.maven.apache.org/maven2/commons-codec/commons-codec/1.6/commons-codec-1.6.jar
(233 kB at 556 kB/s)
[INFO] Downloading from central: https://repo.maven.apache.org/maven2/org/apache/ant/ant/1.8.1/ant-1.8.1.jar
[INFO] Downloaded from central: https://repo.maven.apache.org/maven2/org/apache/maven/shared/maven-script-interpreter/1.0/maven-script-interpreter-1.0.jar
(21 kB at 49 kB/s)
[INFO] Downloaded from central: https://repo.maven.apache.org/maven2/org/codehaus/groovy/groovy/1.8.3/groovy-1.8.3.jar
(5.5 MB at 13 MB/s)
[INFO] Downloaded from central: https://repo.maven.apache.org/maven2/commons-collections/commons-collections/3.2.1/commons-collections-3.2.1.jar
(575 kB at 1.3 MB/s)
[INFO] Downloaded from central: https://repo.maven.apache.org/maven2/org/beanshell/bsh/2.0b4/bsh-2.0b4.jar
(282 kB at 615 kB/s)
[INFO] Downloaded from central: https://repo.maven.apache.org/maven2/org/apache/ant/ant/1.8.1/ant-1.8.1.jar
(1.5 MB at 2.9 MB/s)
[INFO] Generating project in Batch mode
[INFO] Archetype repository not defined. Using the one from [org.apache.beam:beam-sdks-java-maven-archetypes-examples:2.9.0]
found in catalog remote
[INFO] Downloading from test.release: https://repository.apache.org/content/repositories/snapshots/org/apache/beam/beam-sdks-java-maven-archetypes-examples/2.10.0-SNAPSHOT/maven-metadata.xml
[INFO] Downloaded from test.release: https://repository.apache.org/content/repositories/snapshots/org/apache/beam/beam-sdks-java-maven-archetypes-examples/2.10.0-SNAPSHOT/maven-metadata.xml
(1.7 kB at 4.8 kB/s)
[INFO] Downloading from test.release: https://repository.apache.org/content/repositories/snapshots/org/apache/beam/beam-sdks-java-maven-archetypes-examples/2.10.0-SNAPSHOT/beam-sdks-java-maven-archetypes-examples-2.10.0-20190103.083623-27.pom
[INFO] Downloaded from test.release: https://repository.apache.org/content/repositories/snapshots/org/apache/beam/beam-sdks-java-maven-archetypes-examples/2.10.0-SNAPSHOT/beam-sdks-java-maven-archetypes-examples-2.10.0-20190103.083623-27.pom
(4.3 kB at 13 kB/s)
[INFO] Downloading from test.release: https://repository.apache.org/content/repositories/snapshots/org/apache/beam/beam-sdks-java-maven-archetypes-examples/2.10.0-SNAPSHOT/beam-sdks-java-maven-archetypes-examples-2.10.0-20190103.083623-27.jar
[INFO] Downloaded from test.release: https://repository.apache.org/content/repositories/snapshots/org/apache/beam/beam-sdks-java-maven-archetypes-examples/2.10.0-SNAPSHOT/beam-sdks-java-maven-archetypes-examples-2.10.0-20190103.083623-27.jar
(3.0 MB at 5.0 MB/s)
[INFO] ----------------------------------------------------------------------------
[INFO] Using following parameters for creating project from Archetype: beam-sdks-java-maven-archetypes-examples:2.10.0-SNAPSHOT
[INFO] ----------------------------------------------------------------------------
[INFO] Parameter: groupId, Value: org.example
[INFO] Parameter: artifactId, Value: word-count-beam
[INFO] Parameter: version, Value: 0.1
[INFO] Parameter: package, Value: org.apache.beam.examples
[INFO] Parameter: packageInPathFormat, Value: org/apache/beam/examples
[INFO] Parameter: package, Value: org.apache.beam.examples
[INFO] Parameter: version, Value: 0.1
[INFO] Parameter: groupId, Value: org.example
[INFO] Parameter: targetPlatform, Value: 1.8
[INFO] Parameter: artifactId, Value: word-count-beam
[INFO] Project created from Archetype in dir: /tmp/groovy-generated-6039701744734921446-tmpdir/word-count-beam
[INFO] ------------------------------------------------------------------------
[INFO] BUILD SUCCESS
[INFO] ------------------------------------------------------------------------
[INFO] Total time: 8.968 s
[INFO] Finished at: 2019-01-03T23:50:14Z
[INFO] Final Memory: 24M/1170M
[INFO] ------------------------------------------------------------------------
Verified [INFO] BUILD SUCCESS
cd word-count-beam
ls
pom.xml
src
Verified pom.xml
Verified src
ls src/main/java/org/apache/beam/examples/
common
complete
DebuggingWordCount.java
MinimalWordCount.java
subprocess
WindowedWordCount.java
WordCount.java
Verified WordCount.java
ls src/main/java/org/apache/beam/examples/complete/game/
GameStats.java
HourlyTeamScore.java
injector
LeaderBoard.java
StatefulTeamScore.java
UserScore.java
utils
Verified UserScore.java

**************************************
* Test: Runs the WordCount Code with Direct runner
**************************************

mvn compile exec:java -q       -Dexec.mainClass=org.apache.beam.examples.WordCount       -Dexec.args="--inputFile=pom.xml
--output=counts"       -Pdirect-runner
Using maven /home/jenkins/tools/maven/apache-maven-3.5.2
Jan 03, 2019 11:51:27 PM org.apache.beam.sdk.io.FileBasedSource getEstimatedSizeBytes
INFO: Filepattern pom.xml matched 1 files with total size 16450
Jan 03, 2019 11:51:27 PM org.apache.beam.sdk.io.FileBasedSource split
INFO: Splitting filepattern pom.xml into bundles of size 1028 took 1 ms and produced 1 files
and 16 bundles
Jan 03, 2019 11:51:29 PM org.apache.beam.sdk.io.WriteFiles$WriteShardsIntoTempFilesFn processElement
INFO: Opening writer 8a863d38-1773-415a-ad8e-864fdb8fe8df for window org.apache.beam.sdk.transforms.windowing.GlobalWindow@47dbb6f2
pane PaneInfo{isFirst=true, isLast=true, timing=ON_TIME, index=0, onTimeIndex=0} destination
null
Jan 03, 2019 11:51:29 PM org.apache.beam.sdk.io.WriteFiles$WriteShardsIntoTempFilesFn processElement
INFO: Opening writer 2dd278e6-8be1-4e61-b23c-23b9528bf8d1 for window org.apache.beam.sdk.transforms.windowing.GlobalWindow@47dbb6f2
pane PaneInfo{isFirst=true, isLast=true, timing=ON_TIME, index=0, onTimeIndex=0} destination
null
Jan 03, 2019 11:51:29 PM org.apache.beam.sdk.io.WriteFiles$WriteShardsIntoTempFilesFn processElement
INFO: Opening writer c2ac476e-be4e-40c5-9964-4d849d85714c for window org.apache.beam.sdk.transforms.windowing.GlobalWindow@47dbb6f2
pane PaneInfo{isFirst=true, isLast=true, timing=ON_TIME, index=0, onTimeIndex=0} destination
null
Jan 03, 2019 11:51:29 PM org.apache.beam.sdk.io.WriteFiles$WriteShardsIntoTempFilesFn processElement
INFO: Opening writer 11fabf10-13df-4c63-8fb5-37e67c2935f1 for window org.apache.beam.sdk.transforms.windowing.GlobalWindow@47dbb6f2
pane PaneInfo{isFirst=true, isLast=true, timing=ON_TIME, index=0, onTimeIndex=0} destination
null
Jan 03, 2019 11:51:29 PM org.apache.beam.sdk.io.FileBasedSink$Writer close
INFO: Successfully wrote temporary file /tmp/groovy-generated-6039701744734921446-tmpdir/word-count-beam/.temp-beam-2019-01-03_23-51-26-1/11fabf10-13df-4c63-8fb5-37e67c2935f1
Jan 03, 2019 11:51:29 PM org.apache.beam.sdk.io.FileBasedSink$Writer close
INFO: Successfully wrote temporary file /tmp/groovy-generated-6039701744734921446-tmpdir/word-count-beam/.temp-beam-2019-01-03_23-51-26-1/2dd278e6-8be1-4e61-b23c-23b9528bf8d1
Jan 03, 2019 11:51:29 PM org.apache.beam.sdk.io.WriteFiles$WriteShardsIntoTempFilesFn processElement
INFO: Opening writer 9d6363a2-136f-4f53-aace-b575856d423b for window org.apache.beam.sdk.transforms.windowing.GlobalWindow@47dbb6f2
pane PaneInfo{isFirst=true, isLast=true, timing=ON_TIME, index=0, onTimeIndex=0} destination
null
Jan 03, 2019 11:51:29 PM org.apache.beam.sdk.io.FileBasedSink$Writer close
INFO: Successfully wrote temporary file /tmp/groovy-generated-6039701744734921446-tmpdir/word-count-beam/.temp-beam-2019-01-03_23-51-26-1/9d6363a2-136f-4f53-aace-b575856d423b
Jan 03, 2019 11:51:29 PM org.apache.beam.sdk.io.FileBasedSink$Writer close
INFO: Successfully wrote temporary file /tmp/groovy-generated-6039701744734921446-tmpdir/word-count-beam/.temp-beam-2019-01-03_23-51-26-1/c2ac476e-be4e-40c5-9964-4d849d85714c
Jan 03, 2019 11:51:29 PM org.apache.beam.sdk.io.FileBasedSink$Writer close
INFO: Successfully wrote temporary file /tmp/groovy-generated-6039701744734921446-tmpdir/word-count-beam/.temp-beam-2019-01-03_23-51-26-1/8a863d38-1773-415a-ad8e-864fdb8fe8df
Jan 03, 2019 11:51:29 PM org.apache.beam.sdk.io.WriteFiles$FinalizeTempFileBundles$FinalizeFn
process
INFO: Finalizing 5 file results
Jan 03, 2019 11:51:29 PM org.apache.beam.sdk.io.FileBasedSink$WriteOperation createMissingEmptyShards
INFO: Finalizing for destination null num shards 5.
Jan 03, 2019 11:51:29 PM org.apache.beam.sdk.io.FileBasedSink$WriteOperation moveToOutputFiles
INFO: Will copy temporary file FileResult{tempFilename=/tmp/groovy-generated-6039701744734921446-tmpdir/word-count-beam/.temp-beam-2019-01-03_23-51-26-1/11fabf10-13df-4c63-8fb5-37e67c2935f1,
shard=1, window=org.apache.beam.sdk.transforms.windowing.GlobalWindow@47dbb6f2, paneInfo=PaneInfo{isFirst=true,
isLast=true, timing=ON_TIME, index=0, onTimeIndex=0}} to final location /tmp/groovy-generated-6039701744734921446-tmpdir/word-count-beam/counts-00001-of-00005
Jan 03, 2019 11:51:29 PM org.apache.beam.sdk.io.FileBasedSink$WriteOperation moveToOutputFiles
INFO: Will copy temporary file FileResult{tempFilename=/tmp/groovy-generated-6039701744734921446-tmpdir/word-count-beam/.temp-beam-2019-01-03_23-51-26-1/2dd278e6-8be1-4e61-b23c-23b9528bf8d1,
shard=2, window=org.apache.beam.sdk.transforms.windowing.GlobalWindow@47dbb6f2, paneInfo=PaneInfo{isFirst=true,
isLast=true, timing=ON_TIME, index=0, onTimeIndex=0}} to final location /tmp/groovy-generated-6039701744734921446-tmpdir/word-count-beam/counts-00002-of-00005
Jan 03, 2019 11:51:29 PM org.apache.beam.sdk.io.FileBasedSink$WriteOperation moveToOutputFiles
INFO: Will copy temporary file FileResult{tempFilename=/tmp/groovy-generated-6039701744734921446-tmpdir/word-count-beam/.temp-beam-2019-01-03_23-51-26-1/9d6363a2-136f-4f53-aace-b575856d423b,
shard=0, window=org.apache.beam.sdk.transforms.windowing.GlobalWindow@47dbb6f2, paneInfo=PaneInfo{isFirst=true,
isLast=true, timing=ON_TIME, index=0, onTimeIndex=0}} to final location /tmp/groovy-generated-6039701744734921446-tmpdir/word-count-beam/counts-00000-of-00005
Jan 03, 2019 11:51:29 PM org.apache.beam.sdk.io.FileBasedSink$WriteOperation moveToOutputFiles
INFO: Will copy temporary file FileResult{tempFilename=/tmp/groovy-generated-6039701744734921446-tmpdir/word-count-beam/.temp-beam-2019-01-03_23-51-26-1/c2ac476e-be4e-40c5-9964-4d849d85714c,
shard=4, window=org.apache.beam.sdk.transforms.windowing.GlobalWindow@47dbb6f2, paneInfo=PaneInfo{isFirst=true,
isLast=true, timing=ON_TIME, index=0, onTimeIndex=0}} to final location /tmp/groovy-generated-6039701744734921446-tmpdir/word-count-beam/counts-00004-of-00005
Jan 03, 2019 11:51:29 PM org.apache.beam.sdk.io.FileBasedSink$WriteOperation moveToOutputFiles
INFO: Will copy temporary file FileResult{tempFilename=/tmp/groovy-generated-6039701744734921446-tmpdir/word-count-beam/.temp-beam-2019-01-03_23-51-26-1/8a863d38-1773-415a-ad8e-864fdb8fe8df,
shard=3, window=org.apache.beam.sdk.transforms.windowing.GlobalWindow@47dbb6f2, paneInfo=PaneInfo{isFirst=true,
isLast=true, timing=ON_TIME, index=0, onTimeIndex=0}} to final location /tmp/groovy-generated-6039701744734921446-tmpdir/word-count-beam/counts-00003-of-00005
Jan 03, 2019 11:51:29 PM org.apache.beam.sdk.io.FileBasedSink$WriteOperation removeTemporaryFiles
INFO: Will remove known temporary file /tmp/groovy-generated-6039701744734921446-tmpdir/word-count-beam/.temp-beam-2019-01-03_23-51-26-1/11fabf10-13df-4c63-8fb5-37e67c2935f1
Jan 03, 2019 11:51:29 PM org.apache.beam.sdk.io.FileBasedSink$WriteOperation removeTemporaryFiles
INFO: Will remove known temporary file /tmp/groovy-generated-6039701744734921446-tmpdir/word-count-beam/.temp-beam-2019-01-03_23-51-26-1/c2ac476e-be4e-40c5-9964-4d849d85714c
Jan 03, 2019 11:51:29 PM org.apache.beam.sdk.io.FileBasedSink$WriteOperation removeTemporaryFiles
INFO: Will remove known temporary file /tmp/groovy-generated-6039701744734921446-tmpdir/word-count-beam/.temp-beam-2019-01-03_23-51-26-1/8a863d38-1773-415a-ad8e-864fdb8fe8df
Jan 03, 2019 11:51:29 PM org.apache.beam.sdk.io.FileBasedSink$WriteOperation removeTemporaryFiles
INFO: Will remove known temporary file /tmp/groovy-generated-6039701744734921446-tmpdir/word-count-beam/.temp-beam-2019-01-03_23-51-26-1/9d6363a2-136f-4f53-aace-b575856d423b
Jan 03, 2019 11:51:29 PM org.apache.beam.sdk.io.FileBasedSink$WriteOperation removeTemporaryFiles
INFO: Will remove known temporary file /tmp/groovy-generated-6039701744734921446-tmpdir/word-count-beam/.temp-beam-2019-01-03_23-51-26-1/2dd278e6-8be1-4e61-b23c-23b9528bf8d1
Jan 03, 2019 11:51:29 PM org.apache.beam.sdk.io.FileBasedSink$WriteOperation removeTemporaryFiles
WARNING: Failed to match temporary files under: [/tmp/groovy-generated-6039701744734921446-tmpdir/word-count-beam/.temp-beam-2019-01-03_23-51-26-1/].
grep Foundation counts*
counts-00001-of-00005:Foundation: 1
Verified Foundation: 1
[SUCCESS]

FAILURE: Build completed with 2 failures.

1: Task failed with an exception.
-----------
* What went wrong:
Execution failed for task ':beam-runners-google-cloud-dataflow-java:runMobileGamingJavaDataflow'.
> Process 'command '/usr/local/asfpackages/java/jdk1.8.0_191/bin/java'' finished with non-zero
exit value 1

* Try:
Run with --stacktrace option to get the stack trace. Run with --info or --debug option to
get more log output. Run with --scan to get full insights.
==============================================================================

2: Task failed with an exception.
-----------
* What went wrong:
Execution failed for task ':beam-runners-google-cloud-dataflow-java:runQuickstartJavaDataflow'.
> Process 'command '/usr/local/asfpackages/java/jdk1.8.0_191/bin/java'' finished with non-zero
exit value 1

* Try:
Run with --stacktrace option to get the stack trace. Run with --info or --debug option to
get more log output. Run with --scan to get full insights.
==============================================================================

* Get more help at https://help.gradle.org

Deprecated Gradle features were used in this build, making it incompatible with Gradle 5.0.
Use '--warning-mode all' to show the individual deprecation warnings.
See https://docs.gradle.org/4.10.2/userguide/command_line_interface.html#sec:command_line_warnings

BUILD FAILED in 15m 45s
8 actionable tasks: 7 executed, 1 from cache

Publishing build scan...
https://gradle.com/s/s2oxjyse34sb6

Build step 'Invoke Gradle script' changed build result to FAILURE
Build step 'Invoke Gradle script' marked build as failure

---------------------------------------------------------------------
To unsubscribe, e-mail: builds-unsubscribe@beam.apache.org
For additional commands, e-mail: builds-help@beam.apache.org


Mime
View raw message