beam-builds mailing list archives

Site index · List index
Message view « Date » · « Thread »
Top « Date » · « Thread »
From Apache Jenkins Server <jenk...@builds.apache.org>
Subject Build failed in Jenkins: beam_Release_NightlySnapshot #295
Date Mon, 07 Jan 2019 08:21:09 GMT
See <https://builds.apache.org/job/beam_Release_NightlySnapshot/295/display/redirect>

------------------------------------------
[...truncated 2.76 MB...]
test_read_range_at_end (apache_beam.io.filebasedsource_test.TestSingleFileSource) ... ok
test_read_range_at_middle (apache_beam.io.filebasedsource_test.TestSingleFileSource) ... ok
test_source_creation_display_data (apache_beam.io.filebasedsource_test.TestSingleFileSource)
... ok
test_source_creation_fails_for_non_number_offsets (apache_beam.io.filebasedsource_test.TestSingleFileSource)
... ok
test_source_creation_fails_if_start_lg_stop (apache_beam.io.filebasedsource_test.TestSingleFileSource)
... ok

----------------------------------------------------------------------
XML: <https://builds.apache.org/job/beam_Release_NightlySnapshot/ws/src/sdks/python/nosetests.xml>
----------------------------------------------------------------------
Ran 1469 tests in 139.397s

OK (SKIP=329)
py3 runtests: commands[4] | <https://builds.apache.org/job/beam_Release_NightlySnapshot/ws/src/sdks/python/scripts/run_tox_cleanup.sh>
___________________________________ summary ____________________________________
  py3: commands succeeded
  congratulations :)

> Task :beam-sdks-python:test
> Task :beam-sdks-python:check
> Task :beam-sdks-python:build

> Task :beam-sdks-python-container:prepare
Use project GOPATH: <https://builds.apache.org/job/beam_Release_NightlySnapshot/ws/src/sdks/python/container/.gogradle/project_gopath>

> Task :beam-sdks-python-container:resolveBuildDependencies
Resolving ./github.com/apache/beam/sdks/go@<https://builds.apache.org/job/beam_Release_NightlySnapshot/ws/src/sdks/go>

> Task :beam-sdks-python-container:installDependencies
> Task :beam-sdks-python-container:buildDarwinAmd64
> Task :beam-sdks-python-container:buildLinuxAmd64
> Task :beam-sdks-python-container:build
> Task :beam-sdks-python-precommit-dataflow:setupVirtualenv UP-TO-DATE

> Task :beam-sdks-python-precommit-dataflow:sdist
<https://builds.apache.org/job/beam_Release_NightlySnapshot/ws/src/build/gradleenv/103898054/local/lib/python2.7/site-packages/setuptools/dist.py>:470:
UserWarning: Normalizing '2.10.0.dev' to '2.10.0.dev0'
  normalized_version,
running sdist
running egg_info
creating apache_beam.egg-info
writing requirements to apache_beam.egg-info/requires.txt
writing apache_beam.egg-info/PKG-INFO
writing top-level names to apache_beam.egg-info/top_level.txt
writing dependency_links to apache_beam.egg-info/dependency_links.txt
writing entry points to apache_beam.egg-info/entry_points.txt
writing manifest file 'apache_beam.egg-info/SOURCES.txt'
reading manifest file 'apache_beam.egg-info/SOURCES.txt'
writing manifest file 'apache_beam.egg-info/SOURCES.txt'
running check
warning: cmd: standard file not found: should have one of README, README.rst, README.txt,
README.md

creating apache-beam-2.10.0.dev0
creating apache-beam-2.10.0.dev0/apache_beam.egg-info
copying files to apache-beam-2.10.0.dev0...
copying apache_beam.egg-info/PKG-INFO -> apache-beam-2.10.0.dev0/apache_beam.egg-info
copying apache_beam.egg-info/SOURCES.txt -> apache-beam-2.10.0.dev0/apache_beam.egg-info
copying apache_beam.egg-info/dependency_links.txt -> apache-beam-2.10.0.dev0/apache_beam.egg-info
copying apache_beam.egg-info/entry_points.txt -> apache-beam-2.10.0.dev0/apache_beam.egg-info
copying apache_beam.egg-info/not-zip-safe -> apache-beam-2.10.0.dev0/apache_beam.egg-info
copying apache_beam.egg-info/requires.txt -> apache-beam-2.10.0.dev0/apache_beam.egg-info
copying apache_beam.egg-info/top_level.txt -> apache-beam-2.10.0.dev0/apache_beam.egg-info
Writing apache-beam-2.10.0.dev0/setup.cfg
creating <https://builds.apache.org/job/beam_Release_NightlySnapshot/ws/src/sdks/python/precommit/dataflow/build>
creating '<https://builds.apache.org/job/beam_Release_NightlySnapshot/ws/src/sdks/python/precommit/dataflow/build/apache-beam-2.10.0.dev0.zip'>
and adding 'apache-beam-2.10.0.dev0' to it
adding 'apache-beam-2.10.0.dev0/setup.cfg'
adding 'apache-beam-2.10.0.dev0/PKG-INFO'
adding 'apache-beam-2.10.0.dev0/apache_beam.egg-info/SOURCES.txt'
adding 'apache-beam-2.10.0.dev0/apache_beam.egg-info/dependency_links.txt'
adding 'apache-beam-2.10.0.dev0/apache_beam.egg-info/entry_points.txt'
adding 'apache-beam-2.10.0.dev0/apache_beam.egg-info/PKG-INFO'
adding 'apache-beam-2.10.0.dev0/apache_beam.egg-info/requires.txt'
adding 'apache-beam-2.10.0.dev0/apache_beam.egg-info/not-zip-safe'
adding 'apache-beam-2.10.0.dev0/apache_beam.egg-info/top_level.txt'
Creating tar archive
removing 'apache-beam-2.10.0.dev0' (and everything under it)
sdist archive name: <https://builds.apache.org/job/beam_Release_NightlySnapshot/ws/src/sdks/python/precommit/dataflow/build/apache-beam-2.10.0.dev0.tar.gz>

> Task :beam-sdks-python-precommit-dataflow:assemble
> Task :beam-sdks-python-precommit-dataflow:test UP-TO-DATE
> Task :beam-sdks-python-precommit-dataflow:check UP-TO-DATE
> Task :beam-sdks-python-precommit-dataflow:build
> Task :beam-test-infra-metrics:compileJava NO-SOURCE
> Task :beam-test-infra-metrics:compileGroovy NO-SOURCE
> Task :beam-test-infra-metrics:processResources NO-SOURCE
> Task :beam-test-infra-metrics:classes UP-TO-DATE
> Task :beam-test-infra-metrics:jar
> Task :beam-test-infra-metrics:assemble
> Task :beam-test-infra-metrics:spotlessGroovy
> Task :beam-test-infra-metrics:spotlessGroovyCheck
> Task :beam-test-infra-metrics:spotlessGroovyGradle
> Task :beam-test-infra-metrics:spotlessGroovyGradleCheck
> Task :beam-test-infra-metrics:spotlessCheck
> Task :beam-test-infra-metrics:compileTestJava NO-SOURCE
> Task :beam-test-infra-metrics:compileTestGroovy
> Task :beam-test-infra-metrics:processTestResources NO-SOURCE
> Task :beam-test-infra-metrics:testClasses

> Task :beam-test-infra-metrics:test FAILED

org.apache.beam.testinfra.metrics.ProberTests > CheckGrafanaStalenessAlerts FAILED
    java.lang.AssertionError at ProberTests.groovy:47

2 tests completed, 1 failed

> Task :beam-vendor-grpc-1_13_1:compileJava NO-SOURCE
> Task :beam-vendor-grpc-1_13_1:processResources NO-SOURCE
> Task :beam-vendor-grpc-1_13_1:classes UP-TO-DATE
> Task :beam-vendor-grpc-1_13_1:jar SKIPPED
> Task :beam-vendor-grpc-1_13_1:shadowJar
> Task :beam-vendor-grpc-1_13_1:assemble
> Task :beam-vendor-grpc-1_13_1:compileTestJava NO-SOURCE
> Task :beam-vendor-grpc-1_13_1:processTestResources NO-SOURCE
> Task :beam-vendor-grpc-1_13_1:testClasses UP-TO-DATE
> Task :beam-vendor-grpc-1_13_1:test NO-SOURCE
> Task :beam-vendor-grpc-1_13_1:validateVendoring
> Task :beam-vendor-grpc-1_13_1:check
> Task :beam-vendor-grpc-1_13_1:build
> Task :beam-vendor-guava-20_0:compileJava NO-SOURCE
> Task :beam-vendor-guava-20_0:processResources NO-SOURCE
> Task :beam-vendor-guava-20_0:classes UP-TO-DATE
> Task :beam-vendor-guava-20_0:jar SKIPPED
> Task :beam-vendor-guava-20_0:shadowJar
> Task :beam-vendor-guava-20_0:assemble
> Task :beam-vendor-guava-20_0:compileTestJava NO-SOURCE
> Task :beam-vendor-guava-20_0:processTestResources NO-SOURCE
> Task :beam-vendor-guava-20_0:testClasses UP-TO-DATE
> Task :beam-vendor-guava-20_0:test NO-SOURCE
> Task :beam-vendor-guava-20_0:validateVendoring
> Task :beam-vendor-guava-20_0:check
> Task :beam-vendor-guava-20_0:build
> Task :beam-vendor-sdks-java-extensions-protobuf:jar
> Task :beam-vendor-sdks-java-extensions-protobuf:compileTestJava NO-SOURCE
> Task :beam-vendor-sdks-java-extensions-protobuf:processTestResources NO-SOURCE
> Task :beam-vendor-sdks-java-extensions-protobuf:testClasses UP-TO-DATE
> Task :beam-vendor-sdks-java-extensions-protobuf:packageTests
> Task :beam-vendor-sdks-java-extensions-protobuf:assemble
> Task :beam-vendor-sdks-java-extensions-protobuf:checkstyleMain NO-SOURCE
> Task :beam-vendor-sdks-java-extensions-protobuf:checkstyleTest NO-SOURCE
> Task :beam-vendor-sdks-java-extensions-protobuf:findbugsMain
> Task :beam-vendor-sdks-java-extensions-protobuf:javadoc NO-SOURCE
> Task :beam-vendor-sdks-java-extensions-protobuf:spotlessJava
> Task :beam-vendor-sdks-java-extensions-protobuf:spotlessJavaCheck
> Task :beam-vendor-sdks-java-extensions-protobuf:spotlessCheck
> Task :beam-vendor-sdks-java-extensions-protobuf:test NO-SOURCE
> Task :beam-vendor-sdks-java-extensions-protobuf:validateShadedJarDoesntLeakNonProjectClasses
> Task :beam-vendor-sdks-java-extensions-protobuf:check
> Task :beam-vendor-sdks-java-extensions-protobuf:build
> Task :beam-website:assemble UP-TO-DATE
> Task :beam-website:setupBuildDir

> Task :beam-website:buildDockerImage
Sending build context to Docker daemon  26.38MB
Step 1/7 : FROM ruby:2.5
2.5: Pulling from library/ruby
Digest: sha256:4fe61c638dec4dc1d16935325586166b4a87a3aaa1c5a0a40db39a908eae70c5
Status: Downloaded newer image for ruby:2.5
 ---> 6fc6e4e7a8ee
Step 2/7 : WORKDIR /ruby
 ---> Using cache
 ---> b1c92c9d07c2
Step 3/7 : RUN gem install bundler
 ---> Using cache
 ---> 2c48948cf068
Step 4/7 : ADD Gemfile Gemfile.lock /ruby/
 ---> Using cache
 ---> 56ca26dd5ecc
Step 5/7 : RUN bundle install --deployment --path $GEM_HOME
 ---> Using cache
 ---> c36025cb8f04
Step 6/7 : ENV LC_ALL C.UTF-8
 ---> Using cache
 ---> 05c06d4db242
Step 7/7 : CMD sleep 3600
 ---> Using cache
 ---> 6a75e55cffc6
Successfully built 6a75e55cffc6
Successfully tagged beam-website:latest

> Task :beam-website:createDockerContainer

> Task :beam-website:startDockerContainer
4531f1171b4e4b427a76f4c0b977030a1a3ba93101c7c264117d686d507c4562

> Task :beam-website:buildLocalWebsite
`/` is not writable.
Bundler will use `/tmp/bundler/home/unknown' as your home directory temporarily.
Configuration file: /repo/website/_config.yml
Configuration file: /repo/website/_config_test.yml
            Source: /repo/website/src
       Destination: generated-local-content
 Incremental build: enabled
      Generating... 
                    done in 13.005 seconds.
 Auto-regeneration: disabled. Use --watch to enable.

> Task :beam-website:testWebsite
`/` is not writable.
Bundler will use `/tmp/bundler/home/unknown' as your home directory temporarily.
Running ["ScriptCheck", "ImageCheck", "HtmlCheck", "LinkCheck"] on ["./generated-local-content"]
on *.html... 


Checking 805 external links...
Ran on 181 files!


HTML-Proofer finished successfully.

> Task :beam-website:stopAndRemoveDockerContainer
4531f1171b4e4b427a76f4c0b977030a1a3ba93101c7c264117d686d507c4562

> Task :beam-website:buildWebsite
> Task :beam-website:check
> Task :beam-website:build
> Task :release:compileJava NO-SOURCE
> Task :release:compileGroovy
> Task :release:processResources NO-SOURCE
> Task :release:classes
> Task :release:jar
> Task :release:assemble
> Task :release:compileTestJava NO-SOURCE
> Task :release:compileTestGroovy NO-SOURCE
> Task :release:processTestResources NO-SOURCE
> Task :release:testClasses UP-TO-DATE
> Task :release:test NO-SOURCE
> Task :release:check UP-TO-DATE
> Task :release:build

FAILURE: Build failed with an exception.

* What went wrong:
Execution failed for task ':beam-test-infra-metrics:test'.
> There were failing tests. See the report at: file://<https://builds.apache.org/job/beam_Release_NightlySnapshot/ws/src/.test-infra/metrics/build/reports/tests/test/index.html>

* Try:
Run with --stacktrace option to get the stack trace. Run with --info or --debug option to
get more log output. Run with --scan to get full insights.

* Get more help at https://help.gradle.org

Deprecated Gradle features were used in this build, making it incompatible with Gradle 5.0.
Use '--warning-mode all' to show the individual deprecation warnings.
See https://docs.gradle.org/4.10.3/userguide/command_line_interface.html#sec:command_line_warnings

BUILD FAILED in 1h 20m 25s
958 actionable tasks: 951 executed, 5 from cache, 2 up-to-date

Publishing build scan...
https://gradle.com/s/cvp2a2ngeiomg

Build step 'Invoke Gradle script' changed build result to FAILURE
Build step 'Invoke Gradle script' marked build as failure

---------------------------------------------------------------------
To unsubscribe, e-mail: builds-unsubscribe@beam.apache.org
For additional commands, e-mail: builds-help@beam.apache.org


Mime
View raw message