beam-builds mailing list archives

Site index · List index
Message view « Date » · « Thread »
Top « Date » · « Thread »
From Apache Jenkins Server <jenk...@builds.apache.org>
Subject Build failed in Jenkins: beam_PostCommit_Python_Verify #6993
Date Fri, 04 Jan 2019 23:37:22 GMT
See <https://builds.apache.org/job/beam_PostCommit_Python_Verify/6993/display/redirect?page=changes>

Changes:

[github] Reduce days to keep Jenkins job logs to 14

------------------------------------------
[...truncated 408.39 KB...]
                          "@type": "FastPrimitivesCoder$eNprYEpOLEhMzkiNT0pNzNVLzk9JLSqGUlxuicUlAUWZuZklmWWpxc4gQa5CBs3GQsbaQqZQ/vi0xJycpMTk7Hiw+kJmPEYFZCZn56RCjWABGsFaW8iWVJykBwDlGS3/",

                          "component_encodings": []
                        }, 
                        {
                          "@type": "FastPrimitivesCoder$eNprYEpOLEhMzkiNT0pNzNVLzk9JLSqGUlxuicUlAUWZuZklmWWpxc4gQa5CBs3GQsbaQqZQ/vi0xJycpMTk7Hiw+kJmPEYFZCZn56RCjWABGsFaW8iWVJykBwDlGS3/",

                          "component_encodings": []
                        }
                      ], 
                      "is_pair_like": true
                    }, 
                    {
                      "@type": "kind:global_window"
                    }
                  ], 
                  "is_wrapper": true
                }
              ], 
              "is_stream_like": {
                "value": true
              }
            }, 
            "output_name": "out", 
            "user_name": "write/Write/WriteImpl/FinalizeWrite/_UnpickledSideInput(PreFinalize.out.0).output"
          }
        ], 
        "parallel_input": {
          "@type": "OutputReference", 
          "output_name": "out", 
          "step_name": "s22"
        }, 
        "user_name": "write/Write/WriteImpl/FinalizeWrite/_UnpickledSideInput(PreFinalize.out.0)",

        "windowing_strategy": "%0AD%22B%0A%1Dref_Coder_GlobalWindowCoder_1%12%21%0A%1F%0A%1D%0A%1Bbeam%3Acoder%3Aglobal_window%3Av1jT%0A%25%0A%23%0A%21beam%3Awindowfn%3Aglobal_windows%3Av0.1%10%01%1A%1Dref_Coder_GlobalWindowCoder_1%22%02%3A%00%28%010%018%01H%01"
      }
    }, 
    {
      "kind": "ParallelDo", 
      "name": "s26", 
      "properties": {
        "display_data": [
          {
            "key": "fn", 
            "label": "Transform Function", 
            "namespace": "apache_beam.transforms.core.CallableWrapperDoFn", 
            "type": "STRING", 
            "value": "_finalize_write"
          }, 
          {
            "key": "fn", 
            "label": "Transform Function", 
            "namespace": "apache_beam.transforms.core.ParDo", 
            "shortValue": "CallableWrapperDoFn", 
            "type": "STRING", 
            "value": "apache_beam.transforms.core.CallableWrapperDoFn"
          }
        ], 
        "non_parallel_inputs": {
          "side0-write/Write/WriteImpl/FinalizeWrite": {
            "@type": "OutputReference", 
            "output_name": "out", 
            "step_name": "SideInput-s23"
          }, 
          "side1-write/Write/WriteImpl/FinalizeWrite": {
            "@type": "OutputReference", 
            "output_name": "out", 
            "step_name": "SideInput-s24"
          }, 
          "side2-write/Write/WriteImpl/FinalizeWrite": {
            "@type": "OutputReference", 
            "output_name": "out", 
            "step_name": "SideInput-s25"
          }
        }, 
        "output_info": [
          {
            "encoding": {
              "@type": "kind:windowed_value", 
              "component_encodings": [
                {
                  "@type": "FastPrimitivesCoder$eNprYEpOLEhMzkiNT0pNzNVLzk9JLSqGUlxuicUlAUWZuZklmWWpxc4gQa5CBs3GQsbaQqZQ/vi0xJycpMTk7Hiw+kJmPEYFZCZn56RCjWABGsFaW8iWVJykBwDlGS3/",

                  "component_encodings": [
                    {
                      "@type": "FastPrimitivesCoder$eNprYEpOLEhMzkiNT0pNzNVLzk9JLSqGUlxuicUlAUWZuZklmWWpxc4gQa5CBs3GQsbaQqZQ/vi0xJycpMTk7Hiw+kJmPEYFZCZn56RCjWABGsFaW8iWVJykBwDlGS3/",

                      "component_encodings": []
                    }, 
                    {
                      "@type": "FastPrimitivesCoder$eNprYEpOLEhMzkiNT0pNzNVLzk9JLSqGUlxuicUlAUWZuZklmWWpxc4gQa5CBs3GQsbaQqZQ/vi0xJycpMTk7Hiw+kJmPEYFZCZn56RCjWABGsFaW8iWVJykBwDlGS3/",

                      "component_encodings": []
                    }
                  ], 
                  "is_pair_like": true
                }, 
                {
                  "@type": "kind:global_window"
                }
              ], 
              "is_wrapper": true
            }, 
            "output_name": "out", 
            "user_name": "write/Write/WriteImpl/FinalizeWrite.out"
          }
        ], 
        "parallel_input": {
          "@type": "OutputReference", 
          "output_name": "out", 
          "step_name": "s12"
        }, 
        "serialized_fn": "<string of 2376 bytes>", 
        "user_name": "write/Write/WriteImpl/FinalizeWrite/FinalizeWrite"
      }
    }
  ], 
  "type": "JOB_TYPE_BATCH"
}
root: INFO: Create job: <Job
 createTime: u'2019-01-04T22:35:27.267243Z'
 currentStateTime: u'1970-01-01T00:00:00Z'
 id: u'2019-01-04_14_35_26-18345953193406420025'
 location: u'us-central1'
 name: u'beamapp-jenkins-0104223520-492681'
 projectId: u'apache-beam-testing'
 stageStates: []
 startTime: u'2019-01-04T22:35:27.267243Z'
 steps: []
 tempFiles: []
 type: TypeValueValuesEnum(JOB_TYPE_BATCH, 1)>
root: INFO: Created job with id: [2019-01-04_14_35_26-18345953193406420025]
root: INFO: To access the Dataflow monitoring console, please navigate to https://console.cloud.google.com/dataflow/jobsDetail/locations/us-central1/jobs/2019-01-04_14_35_26-18345953193406420025?project=apache-beam-testing
root: INFO: Job 2019-01-04_14_35_26-18345953193406420025 is in state JOB_STATE_RUNNING
root: INFO: 2019-01-04T22:35:26.482Z: JOB_MESSAGE_DETAILED: Autoscaling is enabled for job
2019-01-04_14_35_26-18345953193406420025. The number of workers will be between 1 and 1000.
root: INFO: 2019-01-04T22:35:26.526Z: JOB_MESSAGE_DETAILED: Autoscaling was automatically
enabled for job 2019-01-04_14_35_26-18345953193406420025.
root: INFO: 2019-01-04T22:35:29.285Z: JOB_MESSAGE_DETAILED: Checking permissions granted to
controller Service Account.
root: INFO: 2019-01-04T22:35:30.268Z: JOB_MESSAGE_BASIC: Worker configuration: n1-standard-1
in us-central1-b.
root: INFO: 2019-01-04T22:35:30.815Z: JOB_MESSAGE_DETAILED: Expanding CoGroupByKey operations
into optimizable parts.
root: INFO: 2019-01-04T22:35:30.865Z: JOB_MESSAGE_DEBUG: Combiner lifting skipped for step
write/Write/WriteImpl/GroupByKey: GroupByKey not followed by a combiner.
root: INFO: 2019-01-04T22:35:30.909Z: JOB_MESSAGE_DEBUG: Combiner lifting skipped for step
group: GroupByKey not followed by a combiner.
root: INFO: 2019-01-04T22:35:30.949Z: JOB_MESSAGE_DEBUG: Combiner lifting skipped for step
read from datastore/GroupByKey: GroupByKey not followed by a combiner.
root: INFO: 2019-01-04T22:35:30.993Z: JOB_MESSAGE_DETAILED: Expanding GroupByKey operations
into optimizable parts.
root: INFO: 2019-01-04T22:35:31.039Z: JOB_MESSAGE_DETAILED: Lifting ValueCombiningMappingFns
into MergeBucketsMappingFns
root: INFO: 2019-01-04T22:35:31.209Z: JOB_MESSAGE_DEBUG: Annotating graph with Autotuner information.
root: INFO: 2019-01-04T22:35:31.265Z: JOB_MESSAGE_DETAILED: Fusing adjacent ParDo, Read, Write,
and Flatten operations
root: INFO: 2019-01-04T22:35:31.302Z: JOB_MESSAGE_DETAILED: Fusing consumer read from datastore/SplitQuery
into read from datastore/UserQuery/Read
root: INFO: 2019-01-04T22:35:31.348Z: JOB_MESSAGE_DETAILED: Fusing consumer read from datastore/Values
into read from datastore/GroupByKey/GroupByWindow
root: INFO: 2019-01-04T22:35:31.395Z: JOB_MESSAGE_DETAILED: Fusing consumer count into group/GroupByWindow
root: INFO: 2019-01-04T22:35:31.442Z: JOB_MESSAGE_DETAILED: Fusing consumer group/GroupByWindow
into group/Read
root: INFO: 2019-01-04T22:35:31.489Z: JOB_MESSAGE_DETAILED: Fusing consumer read from datastore/GroupByKey/GroupByWindow
into read from datastore/GroupByKey/Read
root: INFO: 2019-01-04T22:35:31.539Z: JOB_MESSAGE_DETAILED: Fusing consumer group/Write into
group/Reify
root: INFO: 2019-01-04T22:35:31.584Z: JOB_MESSAGE_DETAILED: Fusing consumer write/Write/WriteImpl/Extract
into write/Write/WriteImpl/GroupByKey/GroupByWindow
root: INFO: 2019-01-04T22:35:31.622Z: JOB_MESSAGE_DETAILED: Fusing consumer write/Write/WriteImpl/GroupByKey/GroupByWindow
into write/Write/WriteImpl/GroupByKey/Read
root: INFO: 2019-01-04T22:35:31.658Z: JOB_MESSAGE_DETAILED: Fusing consumer write/Write/WriteImpl/GroupByKey/Write
into write/Write/WriteImpl/GroupByKey/Reify
root: INFO: 2019-01-04T22:35:31.696Z: JOB_MESSAGE_DETAILED: Fusing consumer write/Write/WriteImpl/GroupByKey/Reify
into write/Write/WriteImpl/WindowInto(WindowIntoFn)
root: INFO: 2019-01-04T22:35:31.733Z: JOB_MESSAGE_DETAILED: Fusing consumer write/Write/WriteImpl/WindowInto(WindowIntoFn)
into write/Write/WriteImpl/Pair
root: INFO: 2019-01-04T22:35:31.777Z: JOB_MESSAGE_DETAILED: Fusing consumer write/Write/WriteImpl/Pair
into write/Write/WriteImpl/WriteBundles/WriteBundles
root: INFO: 2019-01-04T22:35:31.825Z: JOB_MESSAGE_DETAILED: Fusing consumer write/Write/WriteImpl/WriteBundles/WriteBundles
into format
root: INFO: 2019-01-04T22:35:31.860Z: JOB_MESSAGE_DETAILED: Fusing consumer group/Reify into
pair_with_one
root: INFO: 2019-01-04T22:35:31.905Z: JOB_MESSAGE_DETAILED: Fusing consumer read from datastore/GroupByKey/Reify
into read from datastore/SplitQuery
root: INFO: 2019-01-04T22:35:31.942Z: JOB_MESSAGE_DETAILED: Fusing consumer read from datastore/GroupByKey/Write
into read from datastore/GroupByKey/Reify
root: INFO: 2019-01-04T22:35:31.991Z: JOB_MESSAGE_DETAILED: Fusing consumer pair_with_one
into split
root: INFO: 2019-01-04T22:35:32.028Z: JOB_MESSAGE_DETAILED: Fusing consumer split into read
from datastore/Read
root: INFO: 2019-01-04T22:35:32.066Z: JOB_MESSAGE_DETAILED: Fusing consumer read from datastore/Flatten
into read from datastore/Values
root: INFO: 2019-01-04T22:35:32.110Z: JOB_MESSAGE_DETAILED: Fusing consumer format into count
root: INFO: 2019-01-04T22:35:32.157Z: JOB_MESSAGE_DETAILED: Fusing consumer read from datastore/Read
into read from datastore/Flatten
root: INFO: 2019-01-04T22:35:32.214Z: JOB_MESSAGE_DETAILED: Fusing consumer write/Write/WriteImpl/InitializeWrite
into write/Write/WriteImpl/DoOnce/Read
root: INFO: 2019-01-04T22:35:32.254Z: JOB_MESSAGE_DEBUG: Workflow config is missing a default
resource spec.
root: INFO: 2019-01-04T22:35:32.300Z: JOB_MESSAGE_DEBUG: Adding StepResource setup and teardown
to workflow graph.
root: INFO: 2019-01-04T22:35:32.335Z: JOB_MESSAGE_DEBUG: Adding workflow start and stop steps.
root: INFO: 2019-01-04T22:35:32.372Z: JOB_MESSAGE_DEBUG: Assigning stage ids.
root: INFO: 2019-01-04T22:35:32.570Z: JOB_MESSAGE_DEBUG: Executing wait step start36
root: INFO: 2019-01-04T22:35:32.661Z: JOB_MESSAGE_BASIC: Executing operation write/Write/WriteImpl/DoOnce/Read+write/Write/WriteImpl/InitializeWrite
root: INFO: 2019-01-04T22:35:32.701Z: JOB_MESSAGE_BASIC: Executing operation write/Write/WriteImpl/GroupByKey/Create
root: INFO: 2019-01-04T22:35:32.712Z: JOB_MESSAGE_DEBUG: Starting worker pool setup.
root: INFO: 2019-01-04T22:35:32.736Z: JOB_MESSAGE_BASIC: Executing operation read from datastore/GroupByKey/Create
root: INFO: 2019-01-04T22:35:32.758Z: JOB_MESSAGE_BASIC: Starting 1 workers in us-central1-b...
root: INFO: 2019-01-04T22:35:32.771Z: JOB_MESSAGE_BASIC: Executing operation group/Create
root: INFO: 2019-01-04T22:35:32.867Z: JOB_MESSAGE_DEBUG: Value "group/Session" materialized.
root: INFO: 2019-01-04T22:35:32.905Z: JOB_MESSAGE_DEBUG: Value "write/Write/WriteImpl/GroupByKey/Session"
materialized.
root: INFO: 2019-01-04T22:35:32.941Z: JOB_MESSAGE_DEBUG: Value "read from datastore/GroupByKey/Session"
materialized.
root: INFO: 2019-01-04T22:35:33.037Z: JOB_MESSAGE_BASIC: Executing operation read from datastore/UserQuery/Read+read
from datastore/SplitQuery+read from datastore/GroupByKey/Reify+read from datastore/GroupByKey/Write
root: INFO: 2019-01-04T22:35:45.085Z: JOB_MESSAGE_DETAILED: Autoscaling: Raised the number
of workers to 0 based on the rate of progress in the currently running step(s).
root: INFO: 2019-01-04T22:36:18.340Z: JOB_MESSAGE_DETAILED: Autoscaling: Raised the number
of workers to 1 based on the rate of progress in the currently running step(s).
root: INFO: 2019-01-04T22:38:07.701Z: JOB_MESSAGE_DETAILED: Workers have started successfully.
root: INFO: 2019-01-04T22:38:07.743Z: JOB_MESSAGE_DETAILED: Workers have started successfully.
oauth2client.transport: INFO: Refreshing due to a 401 (attempt 1/2)
root: INFO: 2019-01-04T23:35:32.998Z: JOB_MESSAGE_ERROR: Workflow failed. Causes: The Dataflow
job appears to be stuck because no worker activity has been seen in the last 1h. You can get
help with Cloud Dataflow at https://cloud.google.com/dataflow/support.
root: INFO: 2019-01-04T23:35:33.151Z: JOB_MESSAGE_BASIC: Cancel request is committed for workflow
job: 2019-01-04_14_35_26-18345953193406420025.
root: INFO: 2019-01-04T23:35:33.255Z: JOB_MESSAGE_DETAILED: Cleaning up.
root: INFO: 2019-01-04T23:35:33.323Z: JOB_MESSAGE_DEBUG: Starting worker pool teardown.
root: INFO: 2019-01-04T23:35:33.360Z: JOB_MESSAGE_BASIC: Stopping worker pool...
root: INFO: 2019-01-04T23:37:08.366Z: JOB_MESSAGE_DETAILED: Autoscaling: Reduced the number
of workers to 0 based on the rate of progress in the currently running step(s).
root: INFO: 2019-01-04T23:37:08.416Z: JOB_MESSAGE_BASIC: Worker pool stopped.
root: INFO: 2019-01-04T23:37:08.435Z: JOB_MESSAGE_DEBUG: Tearing down pending resources...
root: INFO: Job 2019-01-04_14_35_26-18345953193406420025 is in state JOB_STATE_FAILED
--------------------- >> end captured logging << ---------------------

----------------------------------------------------------------------
XML: <https://builds.apache.org/job/beam_PostCommit_Python_Verify/ws/src/sdks/python/nosetests.xml>
----------------------------------------------------------------------
Ran 25 tests in 3721.947s

FAILED (errors=1)
Found: https://console.cloud.google.com/dataflow/jobsDetail/locations/us-central1/jobs/2019-01-04_14_35_28-14868791863359564453?project=apache-beam-testing.
Found: https://console.cloud.google.com/dataflow/jobsDetail/locations/us-central1/jobs/2019-01-04_14_49_53-4081742059841080676?project=apache-beam-testing.
Found: https://console.cloud.google.com/dataflow/jobsDetail/locations/us-central1/jobs/2019-01-04_14_55_45-11055017731694926883?project=apache-beam-testing.
Found: https://console.cloud.google.com/dataflow/jobsDetail/locations/us-central1/jobs/2019-01-04_15_03_34-5392678531387838515?project=apache-beam-testing.
Found: https://console.cloud.google.com/dataflow/jobsDetail/locations/us-central1/jobs/2019-01-04_15_10_11-17757611471314273319?project=apache-beam-testing.
Found: https://console.cloud.google.com/dataflow/jobsDetail/locations/us-central1/jobs/2019-01-04_15_17_04-4492550820475236295?project=apache-beam-testing.
Found: https://console.cloud.google.com/dataflow/jobsDetail/locations/us-central1/jobs/2019-01-04_14_35_26-13559344147365325231?project=apache-beam-testing.
Found: https://console.cloud.google.com/dataflow/jobsDetail/locations/us-central1/jobs/2019-01-04_14_53_50-5728256378011583954?project=apache-beam-testing.
Found: https://console.cloud.google.com/dataflow/jobsDetail/locations/us-central1/jobs/2019-01-04_14_35_26-18345953193406420025?project=apache-beam-testing.
Found: https://console.cloud.google.com/dataflow/jobsDetail/locations/us-central1/jobs/2019-01-04_14_35_27-2534531774848615896?project=apache-beam-testing.
Found: https://console.cloud.google.com/dataflow/jobsDetail/locations/us-central1/jobs/2019-01-04_14_48_19-823856960095459546?project=apache-beam-testing.
Found: https://console.cloud.google.com/dataflow/jobsDetail/locations/us-central1/jobs/2019-01-04_14_35_26-14054967447684728049?project=apache-beam-testing.
Found: https://console.cloud.google.com/dataflow/jobsDetail/locations/us-central1/jobs/2019-01-04_14_53_31-2801930928414483608?project=apache-beam-testing.
Found: https://console.cloud.google.com/dataflow/jobsDetail/locations/us-central1/jobs/2019-01-04_14_59_39-15601523163130370333?project=apache-beam-testing.
Found: https://console.cloud.google.com/dataflow/jobsDetail/locations/us-central1/jobs/2019-01-04_14_35_26-1223198672377480610?project=apache-beam-testing.
Found: https://console.cloud.google.com/dataflow/jobsDetail/locations/us-central1/jobs/2019-01-04_14_42_14-9238385786230685515?project=apache-beam-testing.
Found: https://console.cloud.google.com/dataflow/jobsDetail/locations/us-central1/jobs/2019-01-04_14_49_07-9331742554838313212?project=apache-beam-testing.
Found: https://console.cloud.google.com/dataflow/jobsDetail/locations/us-central1/jobs/2019-01-04_14_55_06-3039288152210779139?project=apache-beam-testing.
Found: https://console.cloud.google.com/dataflow/jobsDetail/locations/us-central1/jobs/2019-01-04_15_02_04-7697595968030142696?project=apache-beam-testing.
Found: https://console.cloud.google.com/dataflow/jobsDetail/locations/us-central1/jobs/2019-01-04_14_35_25-16623118919270376775?project=apache-beam-testing.
Found: https://console.cloud.google.com/dataflow/jobsDetail/locations/us-central1/jobs/2019-01-04_14_41_39-10200531690824619174?project=apache-beam-testing.
Found: https://console.cloud.google.com/dataflow/jobsDetail/locations/us-central1/jobs/2019-01-04_14_49_18-6053203074738450635?project=apache-beam-testing.
Found: https://console.cloud.google.com/dataflow/jobsDetail/locations/us-central1/jobs/2019-01-04_14_35_26-1507272367995548289?project=apache-beam-testing.
Found: https://console.cloud.google.com/dataflow/jobsDetail/locations/us-central1/jobs/2019-01-04_14_42_33-8511331523668242023?project=apache-beam-testing.

> Task :beam-sdks-python:postCommitIT FAILED
:beam-sdks-python:postCommitIT (Thread[Task worker for ':',5,main]) completed. Took 1 hrs
2 mins 2.791 secs.

FAILURE: Build failed with an exception.

* Where:
Build file '<https://builds.apache.org/job/beam_PostCommit_Python_Verify/ws/src/sdks/python/build.gradle'>
line: 276

* What went wrong:
Execution failed for task ':beam-sdks-python:postCommitIT'.
> Process 'command 'sh'' finished with non-zero exit value 1

* Try:
Run with --stacktrace option to get the stack trace. Run with --debug option to get more log
output. Run with --scan to get full insights.

* Get more help at https://help.gradle.org

BUILD FAILED in 1h 6m 7s
6 actionable tasks: 6 executed

Publishing build scan...
https://gradle.com/s/oyolatwstebg6

Build step 'Invoke Gradle script' changed build result to FAILURE
Build step 'Invoke Gradle script' marked build as failure

---------------------------------------------------------------------
To unsubscribe, e-mail: builds-unsubscribe@beam.apache.org
For additional commands, e-mail: builds-help@beam.apache.org


Mime
View raw message