beam-builds mailing list archives

Site index · List index
Message view « Date » · « Thread »
Top « Date » · « Thread »
From Apache Jenkins Server <jenk...@builds.apache.org>
Subject Build failed in Jenkins: beam_PerformanceTests_XmlIOIT #1420
Date Fri, 01 Mar 2019 18:10:09 GMT
See <https://builds.apache.org/job/beam_PerformanceTests_XmlIOIT/1420/display/redirect?page=changes>

Changes:

[ehudm] Allow setting dataflow_endpoint for Python ITs

[github] Merge pull request #7353: [BEAM-4461] Support inner and outer style

------------------------------------------
[...truncated 241.82 KB...]
    INFO: Uploading /home/jenkins/.gradle/caches/modules-2/files-2.1/joda-time/joda-time/2.4/89e9725439adffbbd41c5f5c215c136082b34a7f/joda-time-2.4.jar
to gs://temp-storage-for-perf-tests/xmlioit0writethenreadall-jenkins-0301181000-abb6e691/output/results/staging/joda-time-2.4-EjHD4J3mql1rbZmCwCJOIA.jar
    Mar 01, 2019 6:10:04 PM org.apache.beam.runners.dataflow.util.PackageUtil tryStagePackage
    INFO: Uploading /home/jenkins/.gradle/caches/modules-2/files-2.1/io.opencensus/opencensus-api/0.17.0/b9c91321f9c9f20f3a4627bfd9e3097164f85e6/opencensus-api-0.17.0.jar
to gs://temp-storage-for-perf-tests/xmlioit0writethenreadall-jenkins-0301181000-abb6e691/output/results/staging/opencensus-api-0.17.0-9IouD4K_H9V8K0WPWsY-3Q.jar
    Mar 01, 2019 6:10:04 PM org.apache.beam.runners.dataflow.util.PackageUtil tryStagePackage
    INFO: Uploading /home/jenkins/.gradle/caches/modules-2/files-2.1/io.netty/netty-handler-proxy/4.1.30.Final/1baa1568fa936caddca0fae96fdf127fd5cbad16/netty-handler-proxy-4.1.30.Final.jar
to gs://temp-storage-for-perf-tests/xmlioit0writethenreadall-jenkins-0301181000-abb6e691/output/results/staging/netty-handler-proxy-4.1.30.Final-lCIjvadnkbjk1NVm_E895w.jar
    Mar 01, 2019 6:10:04 PM org.apache.beam.runners.dataflow.util.PackageUtil tryStagePackage
    INFO: Uploading /home/jenkins/.gradle/caches/modules-2/files-2.1/io.netty/netty/3.7.0.Final/7a8c35599c68c0bf383df74469aa3e03d9aca87/netty-3.7.0.Final.jar
to gs://temp-storage-for-perf-tests/xmlioit0writethenreadall-jenkins-0301181000-abb6e691/output/results/staging/netty-3.7.0.Final-ye87LzfVgeUAqdbB78SraQ.jar
    Mar 01, 2019 6:10:04 PM org.apache.beam.runners.dataflow.util.PackageUtil tryStagePackage
    INFO: Uploading /home/jenkins/.gradle/caches/modules-2/files-2.1/com.google.protobuf.nano/protobuf-javanano/3.0.0-alpha-5/357e60f95cebb87c72151e49ba1f570d899734f8/protobuf-javanano-3.0.0-alpha-5.jar
to gs://temp-storage-for-perf-tests/xmlioit0writethenreadall-jenkins-0301181000-abb6e691/output/results/staging/protobuf-javanano-3.0.0-alpha-5-SsS7fZe7brffHbAGUgRrnw.jar
    Mar 01, 2019 6:10:04 PM org.apache.beam.runners.dataflow.util.PackageUtil tryStagePackage
    INFO: Uploading /home/jenkins/.gradle/caches/modules-2/files-2.1/com.squareup.okio/okio/1.13.0/a9283170b7305c8d92d25aff02a6ab7e45d06cbe/okio-1.13.0.jar
to gs://temp-storage-for-perf-tests/xmlioit0writethenreadall-jenkins-0301181000-abb6e691/output/results/staging/okio-1.13.0-ibM9N9YWEQH1hh-US4U7jQ.jar
    Mar 01, 2019 6:10:04 PM org.apache.beam.runners.dataflow.util.PackageUtil tryStagePackage
    INFO: Uploading /home/jenkins/.gradle/caches/modules-2/files-2.1/io.netty/netty-codec/4.1.30.Final/515c8f609aaca28a94f984d89a9667dd3359c1b1/netty-codec-4.1.30.Final.jar
to gs://temp-storage-for-perf-tests/xmlioit0writethenreadall-jenkins-0301181000-abb6e691/output/results/staging/netty-codec-4.1.30.Final-x4vcMCRY_egm-VkASqrGgQ.jar
    Mar 01, 2019 6:10:04 PM org.apache.beam.runners.dataflow.util.PackageUtil tryStagePackage
    INFO: Uploading /home/jenkins/.gradle/caches/modules-2/files-2.1/xml-apis/xml-apis/1.3.04/90b215f48fe42776c8c7f6e3509ec54e84fd65ef/xml-apis-1.3.04.jar
to gs://temp-storage-for-perf-tests/xmlioit0writethenreadall-jenkins-0301181000-abb6e691/output/results/staging/xml-apis-1.3.04-munCnkSX_DWj6t4ebdC76w.jar
    Mar 01, 2019 6:10:04 PM org.apache.beam.runners.dataflow.util.PackageUtil tryStagePackage
    INFO: Uploading /home/jenkins/.gradle/caches/modules-2/files-2.1/io.netty/netty-resolver/4.1.30.Final/5106fd687066ffd712e5295d32af4e2ac6482613/netty-resolver-4.1.30.Final.jar
to gs://temp-storage-for-perf-tests/xmlioit0writethenreadall-jenkins-0301181000-abb6e691/output/results/staging/netty-resolver-4.1.30.Final-7KrLkR97h5adoKWkeiDUgQ.jar
    Mar 01, 2019 6:10:04 PM org.apache.beam.runners.dataflow.util.PackageUtil tryStagePackage
    INFO: Uploading /home/jenkins/.gradle/caches/modules-2/files-2.1/io.netty/netty-buffer/4.1.30.Final/597adb653306470fb3ec1af3c0f3f30a37b1310a/netty-buffer-4.1.30.Final.jar
to gs://temp-storage-for-perf-tests/xmlioit0writethenreadall-jenkins-0301181000-abb6e691/output/results/staging/netty-buffer-4.1.30.Final-mYBmhCN5yGpDEs5G7F6ejg.jar
    Mar 01, 2019 6:10:04 PM org.apache.beam.runners.dataflow.util.PackageUtil tryStagePackage
    INFO: Uploading /home/jenkins/.gradle/caches/modules-2/files-2.1/org.threeten/threetenbp/1.3.3/3ea31c96676ff12ab56be0b1af6fff61d1a4f1f2/threetenbp-1.3.3.jar
to gs://temp-storage-for-perf-tests/xmlioit0writethenreadall-jenkins-0301181000-abb6e691/output/results/staging/threetenbp-1.3.3-bEXFSgaAYiXSdUtR-98IjQ.jar
    Mar 01, 2019 6:10:04 PM org.apache.beam.runners.dataflow.util.PackageUtil tryStagePackage
    INFO: Uploading /home/jenkins/.gradle/caches/modules-2/files-2.1/javax.inject/javax.inject/1/6975da39a7040257bd51d21a231b76c915872d38/javax.inject-1.jar
to gs://temp-storage-for-perf-tests/xmlioit0writethenreadall-jenkins-0301181000-abb6e691/output/results/staging/javax.inject-1-KJB15IuQnp505skVs2MdLg.jar
    Mar 01, 2019 6:10:04 PM org.apache.beam.runners.dataflow.util.PackageUtil tryStagePackage
    INFO: Uploading /home/jenkins/.gradle/caches/modules-2/files-2.1/io.netty/netty-all/4.0.23.Final/294104aaf1781d6a56a07d561e792c5d0c95f45/netty-all-4.0.23.Final.jar
to gs://temp-storage-for-perf-tests/xmlioit0writethenreadall-jenkins-0301181000-abb6e691/output/results/staging/netty-all-4.0.23.Final-RyWCbKe6NxPbZ0jujzkGww.jar
    Mar 01, 2019 6:10:04 PM org.apache.beam.runners.dataflow.util.PackageUtil tryStagePackage
    INFO: Uploading /home/jenkins/.gradle/caches/modules-2/files-2.1/org.beanshell/bsh/2.0b4/a05f0a0feefa8d8467ac80e16e7de071489f0d9c/bsh-2.0b4.jar
to gs://temp-storage-for-perf-tests/xmlioit0writethenreadall-jenkins-0301181000-abb6e691/output/results/staging/bsh-2.0b4-ocYKqDycmmyyORwcG4XrAA.jar
    Mar 01, 2019 6:10:04 PM org.apache.beam.runners.dataflow.util.PackageUtil tryStagePackage
    INFO: Uploading /home/jenkins/.gradle/caches/modules-2/files-2.1/aopalliance/aopalliance/1.0/235ba8b489512805ac13a8f9ea77a1ca5ebe3e8/aopalliance-1.0.jar
to gs://temp-storage-for-perf-tests/xmlioit0writethenreadall-jenkins-0301181000-abb6e691/output/results/staging/aopalliance-1.0-BBdwVOGA0J45mICO-gQBxw.jar
    Mar 01, 2019 6:10:04 PM org.apache.beam.runners.dataflow.util.PackageUtil tryStagePackage
    INFO: Uploading /home/jenkins/.gradle/caches/modules-2/files-2.1/com.beust/jcommander/1.27/58c9cbf0f1fa296f93c712f2cf46de50471920f9/jcommander-1.27.jar
to gs://temp-storage-for-perf-tests/xmlioit0writethenreadall-jenkins-0301181000-abb6e691/output/results/staging/jcommander-1.27-YxYbyOYD5gurYr1hw0nzcA.jar
    Mar 01, 2019 6:10:04 PM org.apache.beam.runners.dataflow.util.PackageUtil tryStagePackage
    INFO: Uploading /home/jenkins/.gradle/caches/modules-2/files-2.1/org.apache.commons/commons-lang3/3.6/9d28a6b23650e8a7e9063c04588ace6cf7012c17/commons-lang3-3.6.jar
to gs://temp-storage-for-perf-tests/xmlioit0writethenreadall-jenkins-0301181000-abb6e691/output/results/staging/commons-lang3-3.6-XRj2i1Ei_TmMEY31OrTPVQ.jar
    Mar 01, 2019 6:10:04 PM org.apache.beam.runners.dataflow.util.PackageUtil tryStagePackage
    INFO: Uploading /home/jenkins/.gradle/caches/modules-2/files-2.1/com.squareup.okhttp/okhttp/2.5.0/4de2b4ed3445c37ec1720a7d214712e845a24636/okhttp-2.5.0.jar
to gs://temp-storage-for-perf-tests/xmlioit0writethenreadall-jenkins-0301181000-abb6e691/output/results/staging/okhttp-2.5.0-64v0X4G_nxfR_PsuymOqpg.jar
    Mar 01, 2019 6:10:04 PM org.apache.beam.runners.dataflow.util.PackageUtil tryStagePackage
    INFO: Uploading /home/jenkins/.gradle/caches/modules-2/files-2.1/io.netty/netty-transport/4.1.30.Final/3d27bb432a3b125167ac161b26415ad29ec17f02/netty-transport-4.1.30.Final.jar
to gs://temp-storage-for-perf-tests/xmlioit0writethenreadall-jenkins-0301181000-abb6e691/output/results/staging/netty-transport-4.1.30.Final-x3QJT81qSgvsv4fipL84Ug.jar
    Mar 01, 2019 6:10:04 PM org.apache.beam.runners.dataflow.util.PackageUtil tryStagePackage
    INFO: Uploading /home/jenkins/.gradle/caches/modules-2/files-2.1/io.netty/netty-common/4.1.30.Final/5dca0c34d8f38af51a2398614e81888f51cf811a/netty-common-4.1.30.Final.jar
to gs://temp-storage-for-perf-tests/xmlioit0writethenreadall-jenkins-0301181000-abb6e691/output/results/staging/netty-common-4.1.30.Final-emDBw4o_oU476QrF0LK1jA.jar
    Mar 01, 2019 6:10:04 PM org.apache.beam.runners.dataflow.util.PackageUtil tryStagePackage
    INFO: Uploading /home/jenkins/.gradle/caches/modules-2/files-2.1/io.netty/netty-codec-http/4.1.30.Final/1384c630e8a0eeef33ad12a28791dce6e1d8767c/netty-codec-http-4.1.30.Final.jar
to gs://temp-storage-for-perf-tests/xmlioit0writethenreadall-jenkins-0301181000-abb6e691/output/results/staging/netty-codec-http-4.1.30.Final-AwxItf4Cqo2SMwSuXhxusg.jar
    Mar 01, 2019 6:10:04 PM org.apache.beam.runners.dataflow.util.PackageUtil tryStagePackage
    INFO: Uploading /home/jenkins/.gradle/caches/modules-2/files-2.1/com.google.cloud.bigdataoss/gcsio/1.9.16/7efb0484bcdfb23038d651704b02a5a1cdb2eab0/gcsio-1.9.16.jar
to gs://temp-storage-for-perf-tests/xmlioit0writethenreadall-jenkins-0301181000-abb6e691/output/results/staging/gcsio-1.9.16-iBTmtmP7wvXHVlGNaBCuzg.jar
    Mar 01, 2019 6:10:04 PM org.apache.beam.runners.dataflow.util.PackageUtil tryStagePackage
    INFO: Uploading /home/jenkins/.gradle/caches/modules-2/files-2.1/org.testng/testng/6.8.21/15e02d8d7be3c3640b585b97eda56026fdb5bf4d/testng-6.8.21.jar
to gs://temp-storage-for-perf-tests/xmlioit0writethenreadall-jenkins-0301181000-abb6e691/output/results/staging/testng-6.8.21-4nE6Pd5l58HFjEGfLzL88Q.jar
    Mar 01, 2019 6:10:04 PM org.apache.beam.runners.dataflow.util.PackageUtil tryStagePackage
    INFO: Uploading /home/jenkins/.gradle/caches/modules-2/files-2.1/com.google.auto.value/auto-value/1.4/6d1448fcd13074bd3658ef915022410b7c48343b/auto-value-1.4.jar
to gs://temp-storage-for-perf-tests/xmlioit0writethenreadall-jenkins-0301181000-abb6e691/output/results/staging/auto-value-1.4-_7tYdqNvCowycFIDpBenFw.jar
    Mar 01, 2019 6:10:04 PM org.apache.beam.runners.dataflow.util.PackageUtil tryStagePackage
    INFO: Uploading /home/jenkins/.gradle/caches/modules-2/files-2.1/org.fusesource.leveldbjni/leveldbjni-all/1.8/707350a2eeb1fa2ed77a32ddb3893ed308e941db/leveldbjni-all-1.8.jar
to gs://temp-storage-for-perf-tests/xmlioit0writethenreadall-jenkins-0301181000-abb6e691/output/results/staging/leveldbjni-all-1.8-aUTpvAPHk4ho5TyWcmrpFA.jar
    Mar 01, 2019 6:10:04 PM org.apache.beam.runners.dataflow.util.PackageUtil tryStagePackage
    INFO: Uploading /home/jenkins/.gradle/caches/modules-2/files-2.1/org.apache.hadoop/hadoop-client/2.7.3/2df5858abb96b09ea24554b786a8eb704d0436be/hadoop-client-2.7.3.jar
to gs://temp-storage-for-perf-tests/xmlioit0writethenreadall-jenkins-0301181000-abb6e691/output/results/staging/hadoop-client-2.7.3-tM3V01dIPrNeV21sPQ9Pgg.jar
    Mar 01, 2019 6:10:04 PM org.apache.beam.runners.dataflow.util.PackageUtil tryStagePackage
    INFO: Uploading /home/jenkins/.gradle/caches/modules-2/files-2.1/io.netty/netty-tcnative-boringssl-static/2.0.17.Final/b1e5acbde8c444c656131238ac6ab9e73f694300/netty-tcnative-boringssl-static-2.0.17.Final.jar
to gs://temp-storage-for-perf-tests/xmlioit0writethenreadall-jenkins-0301181000-abb6e691/output/results/staging/netty-tcnative-boringssl-static-2.0.17.Final-YPiL4Pp2vC0bifcXJZEEQQ.jar
    Mar 01, 2019 6:10:04 PM org.apache.beam.runners.dataflow.util.PackageUtil tryStagePackage
    INFO: Uploading /home/jenkins/.gradle/caches/modules-2/files-2.1/org.mortbay.jetty/jetty/6.1.26/2f546e289fddd5b1fab1d4199fbb6e9ef43ee4b0/jetty-6.1.26.jar
to gs://temp-storage-for-perf-tests/xmlioit0writethenreadall-jenkins-0301181000-abb6e691/output/results/staging/jetty-6.1.26-ErZUOLuvIlEC0DlsISNgUg.jar
    Mar 01, 2019 6:10:04 PM org.apache.beam.runners.dataflow.util.PackageUtil tryStagePackage
    INFO: Uploading <https://builds.apache.org/job/beam_PerformanceTests_XmlIOIT/ws/src/runners/direct-java/build/libs/beam-runners-direct-java-2.12.0-SNAPSHOT-tests.jar>
to gs://temp-storage-for-perf-tests/xmlioit0writethenreadall-jenkins-0301181000-abb6e691/output/results/staging/beam-runners-direct-java-2.12.0-SNAPSHOT-tests-zXFKgiO8YiJfF-gVjSaTsA.jar
    Mar 01, 2019 6:10:04 PM org.apache.beam.runners.dataflow.util.PackageUtil tryStagePackage
    INFO: Uploading /home/jenkins/.gradle/caches/modules-2/files-2.1/org.apache.hadoop/hadoop-hdfs/2.7.3/524d360c632c8cbe788b5411b00ed00770e52c3e/hadoop-hdfs-2.7.3.jar
to gs://temp-storage-for-perf-tests/xmlioit0writethenreadall-jenkins-0301181000-abb6e691/output/results/staging/hadoop-hdfs-2.7.3-LZHu4msrmckte_sxLa7bfg.jar
    Mar 01, 2019 6:10:04 PM org.apache.beam.runners.dataflow.util.PackageUtil tryStagePackage
    INFO: Uploading /home/jenkins/.gradle/caches/modules-2/files-2.1/org.apache.beam/beam-vendor-grpc-1_13_1/0.2/249a9a576fc6541d87972e2dc24cf11ea8129b8f/beam-vendor-grpc-1_13_1-0.2.jar
to gs://temp-storage-for-perf-tests/xmlioit0writethenreadall-jenkins-0301181000-abb6e691/output/results/staging/beam-vendor-grpc-1_13_1-0.2-2fE94kZQ2ONeR3ea5r0PvA.jar
    Mar 01, 2019 6:10:04 PM org.apache.beam.runners.dataflow.util.PackageUtil tryStagePackage
    INFO: Uploading /home/jenkins/.gradle/caches/modules-2/files-2.1/it.unimi.dsi/fastutil/7.0.13/1fa6d6dcaedbf4e7d324e27977a71116692aac58/fastutil-7.0.13.jar
to gs://temp-storage-for-perf-tests/xmlioit0writethenreadall-jenkins-0301181000-abb6e691/output/results/staging/fastutil-7.0.13-Zn1UmrvrnqdROyuRkC4XZg.jar
    Mar 01, 2019 6:10:04 PM org.apache.beam.runners.dataflow.util.PackageUtil tryStagePackage
    INFO: Uploading /home/jenkins/.gradle/caches/modules-2/files-2.1/org.codehaus.jackson/jackson-xc/1.9.13/e3480072bc95c202476ffa1de99ff7ee9149f29c/jackson-xc-1.9.13.jar
to gs://temp-storage-for-perf-tests/xmlioit0writethenreadall-jenkins-0301181000-abb6e691/output/results/staging/jackson-xc-1.9.13-SfanNbrjB0Xc9ezsJwkHIA.jar
    Mar 01, 2019 6:10:04 PM org.apache.beam.runners.dataflow.util.PackageUtil tryStagePackage
    INFO: Uploading /home/jenkins/.gradle/caches/modules-2/files-2.1/com.ibm.icu/icu4j/58.2/db9fd4b4c189cf1518db14c67d14a2cfcfbe59f6/icu4j-58.2.jar
to gs://temp-storage-for-perf-tests/xmlioit0writethenreadall-jenkins-0301181000-abb6e691/output/results/staging/icu4j-58.2-YF2KAnaigP9jMsO9JgcRgA.jar

Gradle Test Executor 1 finished executing tests.

> Task :beam-sdks-java-io-file-based-io-tests:integrationTest

org.apache.beam.sdk.io.xml.XmlIOIT > writeThenReadAll FAILED
    java.lang.RuntimeException: Error while staging packages
        at org.apache.beam.runners.dataflow.util.PackageUtil.stageClasspathElements(PackageUtil.java:403)
        at org.apache.beam.runners.dataflow.util.PackageUtil.stageClasspathElements(PackageUtil.java:273)
        at org.apache.beam.runners.dataflow.util.GcsStager.stageFiles(GcsStager.java:82)
        at org.apache.beam.runners.dataflow.util.GcsStager.stageDefaultFiles(GcsStager.java:70)
        at org.apache.beam.runners.dataflow.DataflowRunner.run(DataflowRunner.java:713)
        at org.apache.beam.runners.dataflow.TestDataflowRunner.run(TestDataflowRunner.java:98)
        at org.apache.beam.runners.dataflow.TestDataflowRunner.run(TestDataflowRunner.java:90)
        at org.apache.beam.runners.dataflow.TestDataflowRunner.run(TestDataflowRunner.java:55)
        at org.apache.beam.sdk.Pipeline.run(Pipeline.java:313)
        at org.apache.beam.sdk.testing.TestPipeline.run(TestPipeline.java:350)
        at org.apache.beam.sdk.testing.TestPipeline.run(TestPipeline.java:331)
        at org.apache.beam.sdk.io.xml.XmlIOIT.writeThenReadAll(XmlIOIT.java:147)

        Caused by:
        java.lang.OutOfMemoryError: unable to create new native thread
Finished generating test XML results (0.018 secs) into: <https://builds.apache.org/job/beam_PerformanceTests_XmlIOIT/ws/src/sdks/java/io/file-based-io-tests/build/test-results/integrationTest>
Generating HTML test report...
Finished generating test html results (0.031 secs) into: <https://builds.apache.org/job/beam_PerformanceTests_XmlIOIT/ws/src/sdks/java/io/file-based-io-tests/build/reports/tests/integrationTest>

> Task :beam-sdks-java-io-file-based-io-tests:integrationTest FAILED
:beam-sdks-java-io-file-based-io-tests:integrationTest (Thread[Execution worker for ':' Thread
10,5,main]) completed. Took 12.529 secs.

Deprecated Gradle features were used in this build, making it incompatible with Gradle 6.0.
Use '--warning-mode all' to show the individual deprecation warnings.
See https://docs.gradle.org/5.2.1/userguide/command_line_interface.html#sec:command_line_warnings
89 actionable tasks: 1 executed, 88 up-to-date

Publishing build scan...
https://gradle.com/s/kz3ohrixt53wo


STDERR: 
1 test completed, 1 failed

FAILURE: Build failed with an exception.

* What went wrong:
Execution failed for task ':beam-sdks-java-io-file-based-io-tests:integrationTest'.
> There were failing tests. See the report at: file://<https://builds.apache.org/job/beam_PerformanceTests_XmlIOIT/ws/src/sdks/java/io/file-based-io-tests/build/reports/tests/integrationTest/index.html>

* Try:
Run with --debug option to get more log output. Run with --scan to get full insights.

* Exception is:
org.gradle.api.tasks.TaskExecutionException: Execution failed for task ':beam-sdks-java-io-file-based-io-tests:integrationTest'.
	at org.gradle.api.internal.tasks.execution.ExecuteActionsTaskExecuter$2.accept(ExecuteActionsTaskExecuter.java:121)
	at org.gradle.api.internal.tasks.execution.ExecuteActionsTaskExecuter$2.accept(ExecuteActionsTaskExecuter.java:117)
	at org.gradle.internal.Try$Failure.ifSuccessfulOrElse(Try.java:184)
	at org.gradle.api.internal.tasks.execution.ExecuteActionsTaskExecuter.execute(ExecuteActionsTaskExecuter.java:110)
	at org.gradle.api.internal.tasks.execution.ResolveIncrementalChangesTaskExecuter.execute(ResolveIncrementalChangesTaskExecuter.java:84)
	at org.gradle.api.internal.tasks.execution.ResolveTaskOutputCachingStateExecuter.execute(ResolveTaskOutputCachingStateExecuter.java:91)
	at org.gradle.api.internal.tasks.execution.FinishSnapshotTaskInputsBuildOperationTaskExecuter.execute(FinishSnapshotTaskInputsBuildOperationTaskExecuter.java:51)
	at org.gradle.api.internal.tasks.execution.ResolveBuildCacheKeyExecuter.execute(ResolveBuildCacheKeyExecuter.java:102)
	at org.gradle.api.internal.tasks.execution.ResolveBeforeExecutionStateTaskExecuter.execute(ResolveBeforeExecutionStateTaskExecuter.java:74)
	at org.gradle.api.internal.tasks.execution.ValidatingTaskExecuter.execute(ValidatingTaskExecuter.java:58)
	at org.gradle.api.internal.tasks.execution.SkipEmptySourceFilesTaskExecuter.execute(SkipEmptySourceFilesTaskExecuter.java:109)
	at org.gradle.api.internal.tasks.execution.ResolveBeforeExecutionOutputsTaskExecuter.execute(ResolveBeforeExecutionOutputsTaskExecuter.java:67)
	at org.gradle.api.internal.tasks.execution.StartSnapshotTaskInputsBuildOperationTaskExecuter.execute(StartSnapshotTaskInputsBuildOperationTaskExecuter.java:52)
	at org.gradle.api.internal.tasks.execution.ResolveAfterPreviousExecutionStateTaskExecuter.execute(ResolveAfterPreviousExecutionStateTaskExecuter.java:46)
	at org.gradle.api.internal.tasks.execution.CleanupStaleOutputsExecuter.execute(CleanupStaleOutputsExecuter.java:93)
	at org.gradle.api.internal.tasks.execution.FinalizePropertiesTaskExecuter.execute(FinalizePropertiesTaskExecuter.java:45)
	at org.gradle.api.internal.tasks.execution.ResolveTaskExecutionModeExecuter.execute(ResolveTaskExecutionModeExecuter.java:94)
	at org.gradle.api.internal.tasks.execution.SkipTaskWithNoActionsExecuter.execute(SkipTaskWithNoActionsExecuter.java:57)
	at org.gradle.api.internal.tasks.execution.SkipOnlyIfTaskExecuter.execute(SkipOnlyIfTaskExecuter.java:56)
	at org.gradle.api.internal.tasks.execution.CatchExceptionTaskExecuter.execute(CatchExceptionTaskExecuter.java:36)
	at org.gradle.api.internal.tasks.execution.EventFiringTaskExecuter$1.executeTask(EventFiringTaskExecuter.java:63)
	at org.gradle.api.internal.tasks.execution.EventFiringTaskExecuter$1.call(EventFiringTaskExecuter.java:49)
	at org.gradle.api.internal.tasks.execution.EventFiringTaskExecuter$1.call(EventFiringTaskExecuter.java:46)
	at org.gradle.internal.operations.DefaultBuildOperationExecutor$CallableBuildOperationWorker.execute(DefaultBuildOperationExecutor.java:416)
	at org.gradle.internal.operations.DefaultBuildOperationExecutor$CallableBuildOperationWorker.execute(DefaultBuildOperationExecutor.java:406)
	at org.gradle.internal.operations.DefaultBuildOperationExecutor$1.execute(DefaultBuildOperationExecutor.java:165)
	at org.gradle.internal.operations.DefaultBuildOperationExecutor.execute(DefaultBuildOperationExecutor.java:250)
	at org.gradle.internal.operations.DefaultBuildOperationExecutor.execute(DefaultBuildOperationExecutor.java:158)
	at org.gradle.internal.operations.DefaultBuildOperationExecutor.call(DefaultBuildOperationExecutor.java:102)
	at org.gradle.internal.operations.DelegatingBuildOperationExecutor.call(DelegatingBuildOperationExecutor.java:36)
	at org.gradle.api.internal.tasks.execution.EventFiringTaskExecuter.execute(EventFiringTaskExecuter.java:46)
	at org.gradle.execution.plan.LocalTaskNodeExecutor.execute(LocalTaskNodeExecutor.java:43)
	at org.gradle.execution.taskgraph.DefaultTaskExecutionGraph$InvokeNodeExecutorsAction.execute(DefaultTaskExecutionGraph.java:355)
	at org.gradle.execution.taskgraph.DefaultTaskExecutionGraph$InvokeNodeExecutorsAction.execute(DefaultTaskExecutionGraph.java:343)
	at org.gradle.execution.taskgraph.DefaultTaskExecutionGraph$BuildOperationAwareExecutionAction.execute(DefaultTaskExecutionGraph.java:336)
	at org.gradle.execution.taskgraph.DefaultTaskExecutionGraph$BuildOperationAwareExecutionAction.execute(DefaultTaskExecutionGraph.java:322)
	at org.gradle.execution.plan.DefaultPlanExecutor$ExecutorWorker$1.execute(DefaultPlanExecutor.java:134)
	at org.gradle.execution.plan.DefaultPlanExecutor$ExecutorWorker$1.execute(DefaultPlanExecutor.java:129)
	at org.gradle.execution.plan.DefaultPlanExecutor$ExecutorWorker.execute(DefaultPlanExecutor.java:202)
	at org.gradle.execution.plan.DefaultPlanExecutor$ExecutorWorker.executeNextNode(DefaultPlanExecutor.java:193)
	at org.gradle.execution.plan.DefaultPlanExecutor$ExecutorWorker.run(DefaultPlanExecutor.java:129)
	at org.gradle.internal.concurrent.ExecutorPolicy$CatchAndRecordFailures.onExecute(ExecutorPolicy.java:63)
	at org.gradle.internal.concurrent.ManagedExecutorImpl$1.run(ManagedExecutorImpl.java:46)
	at org.gradle.internal.concurrent.ThreadFactoryImpl$ManagedThreadRunnable.run(ThreadFactoryImpl.java:55)
Caused by: org.gradle.api.GradleException: There were failing tests. See the report at: file://<https://builds.apache.org/job/beam_PerformanceTests_XmlIOIT/ws/src/sdks/java/io/file-based-io-tests/build/reports/tests/integrationTest/index.html>
	at org.gradle.api.tasks.testing.AbstractTestTask.handleTestFailures(AbstractTestTask.java:626)
	at org.gradle.api.tasks.testing.AbstractTestTask.executeTests(AbstractTestTask.java:498)
	at org.gradle.api.tasks.testing.Test.executeTests(Test.java:587)
	at org.gradle.internal.reflect.JavaMethod.invoke(JavaMethod.java:103)
	at org.gradle.api.internal.project.taskfactory.StandardTaskAction.doExecute(StandardTaskAction.java:48)
	at org.gradle.api.internal.project.taskfactory.StandardTaskAction.execute(StandardTaskAction.java:41)
	at org.gradle.api.internal.project.taskfactory.StandardTaskAction.execute(StandardTaskAction.java:28)
	at org.gradle.api.internal.AbstractTask$TaskActionWrapper.execute(AbstractTask.java:705)
	at org.gradle.api.internal.AbstractTask$TaskActionWrapper.execute(AbstractTask.java:672)
	at org.gradle.api.internal.tasks.execution.ExecuteActionsTaskExecuter$4.run(ExecuteActionsTaskExecuter.java:338)
	at org.gradle.internal.operations.DefaultBuildOperationExecutor$RunnableBuildOperationWorker.execute(DefaultBuildOperationExecutor.java:402)
	at org.gradle.internal.operations.DefaultBuildOperationExecutor$RunnableBuildOperationWorker.execute(DefaultBuildOperationExecutor.java:394)
	at org.gradle.internal.operations.DefaultBuildOperationExecutor$1.execute(DefaultBuildOperationExecutor.java:165)
	at org.gradle.internal.operations.DefaultBuildOperationExecutor.execute(DefaultBuildOperationExecutor.java:250)
	at org.gradle.internal.operations.DefaultBuildOperationExecutor.execute(DefaultBuildOperationExecutor.java:158)
	at org.gradle.internal.operations.DefaultBuildOperationExecutor.run(DefaultBuildOperationExecutor.java:92)
	at org.gradle.internal.operations.DelegatingBuildOperationExecutor.run(DelegatingBuildOperationExecutor.java:31)
	at org.gradle.api.internal.tasks.execution.ExecuteActionsTaskExecuter.executeAction(ExecuteActionsTaskExecuter.java:327)
	at org.gradle.api.internal.tasks.execution.ExecuteActionsTaskExecuter.executeActions(ExecuteActionsTaskExecuter.java:312)
	at org.gradle.api.internal.tasks.execution.ExecuteActionsTaskExecuter.access$200(ExecuteActionsTaskExecuter.java:75)
	at org.gradle.api.internal.tasks.execution.ExecuteActionsTaskExecuter$TaskExecution.execute(ExecuteActionsTaskExecuter.java:158)
	at org.gradle.internal.execution.impl.steps.ExecuteStep.execute(ExecuteStep.java:46)
	at org.gradle.internal.execution.impl.steps.CancelExecutionStep.execute(CancelExecutionStep.java:34)
	at org.gradle.internal.execution.impl.steps.TimeoutStep.executeWithoutTimeout(TimeoutStep.java:69)
	at org.gradle.internal.execution.impl.steps.TimeoutStep.execute(TimeoutStep.java:49)
	at org.gradle.internal.execution.impl.steps.CatchExceptionStep.execute(CatchExceptionStep.java:34)
	at org.gradle.internal.execution.impl.steps.CreateOutputsStep.execute(CreateOutputsStep.java:49)
	at org.gradle.internal.execution.impl.steps.SnapshotOutputStep.execute(SnapshotOutputStep.java:42)
	at org.gradle.internal.execution.impl.steps.SnapshotOutputStep.execute(SnapshotOutputStep.java:28)
	at org.gradle.internal.execution.impl.steps.CacheStep.executeWithoutCache(CacheStep.java:133)
	at org.gradle.internal.execution.impl.steps.CacheStep.lambda$execute$5(CacheStep.java:83)
	at org.gradle.internal.execution.impl.steps.CacheStep.execute(CacheStep.java:82)
	at org.gradle.internal.execution.impl.steps.CacheStep.execute(CacheStep.java:37)
	at org.gradle.internal.execution.impl.steps.PrepareCachingStep.execute(PrepareCachingStep.java:33)
	at org.gradle.internal.execution.impl.steps.StoreSnapshotsStep.execute(StoreSnapshotsStep.java:38)
	at org.gradle.internal.execution.impl.steps.StoreSnapshotsStep.execute(StoreSnapshotsStep.java:23)
	at org.gradle.internal.execution.impl.steps.SkipUpToDateStep.executeBecause(SkipUpToDateStep.java:95)
	at org.gradle.internal.execution.impl.steps.SkipUpToDateStep.lambda$execute$0(SkipUpToDateStep.java:88)
	at org.gradle.internal.execution.impl.steps.SkipUpToDateStep.execute(SkipUpToDateStep.java:52)
	at org.gradle.internal.execution.impl.steps.SkipUpToDateStep.execute(SkipUpToDateStep.java:36)
	at org.gradle.internal.execution.impl.DefaultWorkExecutor.execute(DefaultWorkExecutor.java:34)
	at org.gradle.api.internal.tasks.execution.ExecuteActionsTaskExecuter.execute(ExecuteActionsTaskExecuter.java:109)
	... 40 more


* Get more help at https://help.gradle.org

BUILD FAILED in 26s

2019-03-01 18:10:08,725 fe2da9db MainThread beam_integration_benchmark(1/1) ERROR    Error
during benchmark beam_integration_benchmark
Traceback (most recent call last):
  File "<https://builds.apache.org/job/beam_PerformanceTests_XmlIOIT/ws/PerfKitBenchmarker/perfkitbenchmarker/pkb.py",>
line 734, in RunBenchmark
    DoRunPhase(spec, collector, detailed_timer)
  File "<https://builds.apache.org/job/beam_PerformanceTests_XmlIOIT/ws/PerfKitBenchmarker/perfkitbenchmarker/pkb.py",>
line 589, in DoRunPhase
    samples = spec.BenchmarkRun(spec)
  File "<https://builds.apache.org/job/beam_PerformanceTests_XmlIOIT/ws/PerfKitBenchmarker/perfkitbenchmarker/linux_benchmarks/beam_integration_benchmark.py",>
line 160, in Run
    job_type=job_type)
  File "<https://builds.apache.org/job/beam_PerformanceTests_XmlIOIT/ws/PerfKitBenchmarker/perfkitbenchmarker/providers/gcp/gcp_dpb_dataflow.py",>
line 90, in SubmitJob
    assert retcode == 0, "Integration Test Failed."
AssertionError: Integration Test Failed.
2019-03-01 18:10:08,726 fe2da9db MainThread beam_integration_benchmark(1/1) INFO     Cleaning
up benchmark beam_integration_benchmark
2019-03-01 18:10:08,727 fe2da9db MainThread beam_integration_benchmark(1/1) ERROR    Exception
running benchmark
Traceback (most recent call last):
  File "<https://builds.apache.org/job/beam_PerformanceTests_XmlIOIT/ws/PerfKitBenchmarker/perfkitbenchmarker/pkb.py",>
line 874, in RunBenchmarkTask
    RunBenchmark(spec, collector)
  File "<https://builds.apache.org/job/beam_PerformanceTests_XmlIOIT/ws/PerfKitBenchmarker/perfkitbenchmarker/pkb.py",>
line 734, in RunBenchmark
    DoRunPhase(spec, collector, detailed_timer)
  File "<https://builds.apache.org/job/beam_PerformanceTests_XmlIOIT/ws/PerfKitBenchmarker/perfkitbenchmarker/pkb.py",>
line 589, in DoRunPhase
    samples = spec.BenchmarkRun(spec)
  File "<https://builds.apache.org/job/beam_PerformanceTests_XmlIOIT/ws/PerfKitBenchmarker/perfkitbenchmarker/linux_benchmarks/beam_integration_benchmark.py",>
line 160, in Run
    job_type=job_type)
  File "<https://builds.apache.org/job/beam_PerformanceTests_XmlIOIT/ws/PerfKitBenchmarker/perfkitbenchmarker/providers/gcp/gcp_dpb_dataflow.py",>
line 90, in SubmitJob
    assert retcode == 0, "Integration Test Failed."
AssertionError: Integration Test Failed.
2019-03-01 18:10:08,728 fe2da9db MainThread beam_integration_benchmark(1/1) ERROR    Benchmark
1/1 beam_integration_benchmark (UID: beam_integration_benchmark0) failed. Execution will continue.
2019-03-01 18:10:08,728 fe2da9db MainThread beam_integration_benchmark(1/1) INFO     Benchmark
run statuses:
---------------------------------------------------------------------------------
Name                        UID                          Status  Failed Substatus
---------------------------------------------------------------------------------
beam_integration_benchmark  beam_integration_benchmark0  FAILED                  
---------------------------------------------------------------------------------
Success rate: 0.00% (0/1)
2019-03-01 18:10:08,728 fe2da9db MainThread beam_integration_benchmark(1/1) INFO     Complete
logs can be found at: <https://builds.apache.org/job/beam_PerformanceTests_XmlIOIT/ws/runs/fe2da9db/pkb.log>
2019-03-01 18:10:08,728 fe2da9db MainThread beam_integration_benchmark(1/1) INFO     Completion
statuses can be found at: <https://builds.apache.org/job/beam_PerformanceTests_XmlIOIT/ws/runs/fe2da9db/completion_statuses.json>
Build step 'Execute shell' marked build as failure

---------------------------------------------------------------------
To unsubscribe, e-mail: builds-unsubscribe@beam.apache.org
For additional commands, e-mail: builds-help@beam.apache.org


Mime
View raw message