beam-builds mailing list archives

Site index · List index
Message view « Date » · « Thread »
Top « Date » · « Thread »
From Apache Jenkins Server <jenk...@builds.apache.org>
Subject Build failed in Jenkins: beam_PostCommit_Py_ValCont #2756
Date Thu, 28 Mar 2019 16:04:28 GMT
See <https://builds.apache.org/job/beam_PostCommit_Py_ValCont/2756/display/redirect?page=changes>

Changes:

[apilloud] Moving to 2.13.0-SNAPSHOT on master branch.

------------------------------------------
[...truncated 283.54 KB...]
copying apache_beam/runners/worker/bundle_processor.py -> apache-beam-2.13.0.dev0/apache_beam/runners/worker
copying apache_beam/runners/worker/channel_factory.py -> apache-beam-2.13.0.dev0/apache_beam/runners/worker
copying apache_beam/runners/worker/data_plane.py -> apache-beam-2.13.0.dev0/apache_beam/runners/worker
copying apache_beam/runners/worker/data_plane_test.py -> apache-beam-2.13.0.dev0/apache_beam/runners/worker
copying apache_beam/runners/worker/log_handler.py -> apache-beam-2.13.0.dev0/apache_beam/runners/worker
copying apache_beam/runners/worker/log_handler_test.py -> apache-beam-2.13.0.dev0/apache_beam/runners/worker
copying apache_beam/runners/worker/logger.py -> apache-beam-2.13.0.dev0/apache_beam/runners/worker
copying apache_beam/runners/worker/logger_test.py -> apache-beam-2.13.0.dev0/apache_beam/runners/worker
copying apache_beam/runners/worker/opcounters.pxd -> apache-beam-2.13.0.dev0/apache_beam/runners/worker
copying apache_beam/runners/worker/opcounters.py -> apache-beam-2.13.0.dev0/apache_beam/runners/worker
copying apache_beam/runners/worker/opcounters_test.py -> apache-beam-2.13.0.dev0/apache_beam/runners/worker
copying apache_beam/runners/worker/operation_specs.py -> apache-beam-2.13.0.dev0/apache_beam/runners/worker
copying apache_beam/runners/worker/operations.pxd -> apache-beam-2.13.0.dev0/apache_beam/runners/worker
copying apache_beam/runners/worker/operations.py -> apache-beam-2.13.0.dev0/apache_beam/runners/worker
copying apache_beam/runners/worker/sdk_worker.py -> apache-beam-2.13.0.dev0/apache_beam/runners/worker
copying apache_beam/runners/worker/sdk_worker_main.py -> apache-beam-2.13.0.dev0/apache_beam/runners/worker
copying apache_beam/runners/worker/sdk_worker_main_test.py -> apache-beam-2.13.0.dev0/apache_beam/runners/worker
copying apache_beam/runners/worker/sdk_worker_test.py -> apache-beam-2.13.0.dev0/apache_beam/runners/worker
copying apache_beam/runners/worker/sideinputs.py -> apache-beam-2.13.0.dev0/apache_beam/runners/worker
copying apache_beam/runners/worker/sideinputs_test.py -> apache-beam-2.13.0.dev0/apache_beam/runners/worker
copying apache_beam/runners/worker/statesampler.py -> apache-beam-2.13.0.dev0/apache_beam/runners/worker
copying apache_beam/runners/worker/statesampler_fast.pxd -> apache-beam-2.13.0.dev0/apache_beam/runners/worker
copying apache_beam/runners/worker/statesampler_fast.pyx -> apache-beam-2.13.0.dev0/apache_beam/runners/worker
copying apache_beam/runners/worker/statesampler_slow.py -> apache-beam-2.13.0.dev0/apache_beam/runners/worker
copying apache_beam/runners/worker/statesampler_test.py -> apache-beam-2.13.0.dev0/apache_beam/runners/worker
copying apache_beam/runners/worker/worker_id_interceptor.py -> apache-beam-2.13.0.dev0/apache_beam/runners/worker
copying apache_beam/runners/worker/worker_id_interceptor_test.py -> apache-beam-2.13.0.dev0/apache_beam/runners/worker
copying apache_beam/testing/__init__.py -> apache-beam-2.13.0.dev0/apache_beam/testing
copying apache_beam/testing/metric_result_matchers.py -> apache-beam-2.13.0.dev0/apache_beam/testing
copying apache_beam/testing/metric_result_matchers_test.py -> apache-beam-2.13.0.dev0/apache_beam/testing
copying apache_beam/testing/pipeline_verifiers.py -> apache-beam-2.13.0.dev0/apache_beam/testing
copying apache_beam/testing/pipeline_verifiers_test.py -> apache-beam-2.13.0.dev0/apache_beam/testing
copying apache_beam/testing/synthetic_pipeline.py -> apache-beam-2.13.0.dev0/apache_beam/testing
copying apache_beam/testing/synthetic_pipeline_test.py -> apache-beam-2.13.0.dev0/apache_beam/testing
copying apache_beam/testing/test_pipeline.py -> apache-beam-2.13.0.dev0/apache_beam/testing
copying apache_beam/testing/test_pipeline_test.py -> apache-beam-2.13.0.dev0/apache_beam/testing
copying apache_beam/testing/test_stream.py -> apache-beam-2.13.0.dev0/apache_beam/testing
copying apache_beam/testing/test_stream_test.py -> apache-beam-2.13.0.dev0/apache_beam/testing
copying apache_beam/testing/test_utils.py -> apache-beam-2.13.0.dev0/apache_beam/testing
copying apache_beam/testing/test_utils_test.py -> apache-beam-2.13.0.dev0/apache_beam/testing
copying apache_beam/testing/util.py -> apache-beam-2.13.0.dev0/apache_beam/testing
copying apache_beam/testing/util_test.py -> apache-beam-2.13.0.dev0/apache_beam/testing
copying apache_beam/testing/benchmarks/__init__.py -> apache-beam-2.13.0.dev0/apache_beam/testing/benchmarks
copying apache_beam/testing/benchmarks/nexmark/__init__.py -> apache-beam-2.13.0.dev0/apache_beam/testing/benchmarks/nexmark
copying apache_beam/testing/benchmarks/nexmark/nexmark_launcher.py -> apache-beam-2.13.0.dev0/apache_beam/testing/benchmarks/nexmark
copying apache_beam/testing/benchmarks/nexmark/nexmark_util.py -> apache-beam-2.13.0.dev0/apache_beam/testing/benchmarks/nexmark
copying apache_beam/testing/benchmarks/nexmark/models/__init__.py -> apache-beam-2.13.0.dev0/apache_beam/testing/benchmarks/nexmark/models
copying apache_beam/testing/benchmarks/nexmark/models/nexmark_model.py -> apache-beam-2.13.0.dev0/apache_beam/testing/benchmarks/nexmark/models
copying apache_beam/testing/benchmarks/nexmark/queries/__init__.py -> apache-beam-2.13.0.dev0/apache_beam/testing/benchmarks/nexmark/queries
copying apache_beam/testing/benchmarks/nexmark/queries/query0.py -> apache-beam-2.13.0.dev0/apache_beam/testing/benchmarks/nexmark/queries
copying apache_beam/testing/benchmarks/nexmark/queries/query1.py -> apache-beam-2.13.0.dev0/apache_beam/testing/benchmarks/nexmark/queries
copying apache_beam/testing/benchmarks/nexmark/queries/query2.py -> apache-beam-2.13.0.dev0/apache_beam/testing/benchmarks/nexmark/queries
copying apache_beam/testing/data/standard_coders.yaml -> apache-beam-2.13.0.dev0/apache_beam/testing/data
copying apache_beam/testing/data/trigger_transcripts.yaml -> apache-beam-2.13.0.dev0/apache_beam/testing/data
copying apache_beam/testing/load_tests/__init__.py -> apache-beam-2.13.0.dev0/apache_beam/testing/load_tests
copying apache_beam/testing/load_tests/co_group_by_key_test.py -> apache-beam-2.13.0.dev0/apache_beam/testing/load_tests
copying apache_beam/testing/load_tests/combine_test.py -> apache-beam-2.13.0.dev0/apache_beam/testing/load_tests
copying apache_beam/testing/load_tests/group_by_key_test.py -> apache-beam-2.13.0.dev0/apache_beam/testing/load_tests
copying apache_beam/testing/load_tests/load_test.py -> apache-beam-2.13.0.dev0/apache_beam/testing/load_tests
copying apache_beam/testing/load_tests/load_test_metrics_utils.py -> apache-beam-2.13.0.dev0/apache_beam/testing/load_tests
copying apache_beam/testing/load_tests/pardo_test.py -> apache-beam-2.13.0.dev0/apache_beam/testing/load_tests
copying apache_beam/testing/load_tests/sideinput_test.py -> apache-beam-2.13.0.dev0/apache_beam/testing/load_tests
copying apache_beam/tools/__init__.py -> apache-beam-2.13.0.dev0/apache_beam/tools
copying apache_beam/tools/coders_microbenchmark.py -> apache-beam-2.13.0.dev0/apache_beam/tools
copying apache_beam/tools/distribution_counter_microbenchmark.py -> apache-beam-2.13.0.dev0/apache_beam/tools
copying apache_beam/tools/map_fn_microbenchmark.py -> apache-beam-2.13.0.dev0/apache_beam/tools
copying apache_beam/tools/microbenchmarks_test.py -> apache-beam-2.13.0.dev0/apache_beam/tools
copying apache_beam/tools/sideinput_microbenchmark.py -> apache-beam-2.13.0.dev0/apache_beam/tools
copying apache_beam/tools/utils.py -> apache-beam-2.13.0.dev0/apache_beam/tools
copying apache_beam/transforms/__init__.py -> apache-beam-2.13.0.dev0/apache_beam/transforms
copying apache_beam/transforms/combiners.py -> apache-beam-2.13.0.dev0/apache_beam/transforms
copying apache_beam/transforms/combiners_test.py -> apache-beam-2.13.0.dev0/apache_beam/transforms
copying apache_beam/transforms/core.py -> apache-beam-2.13.0.dev0/apache_beam/transforms
copying apache_beam/transforms/create_source.py -> apache-beam-2.13.0.dev0/apache_beam/transforms
copying apache_beam/transforms/create_test.py -> apache-beam-2.13.0.dev0/apache_beam/transforms
copying apache_beam/transforms/cy_combiners.pxd -> apache-beam-2.13.0.dev0/apache_beam/transforms
copying apache_beam/transforms/cy_combiners.py -> apache-beam-2.13.0.dev0/apache_beam/transforms
copying apache_beam/transforms/cy_dataflow_distribution_counter.pxd -> apache-beam-2.13.0.dev0/apache_beam/transforms
copying apache_beam/transforms/cy_dataflow_distribution_counter.pyx -> apache-beam-2.13.0.dev0/apache_beam/transforms
copying apache_beam/transforms/dataflow_distribution_counter_test.py -> apache-beam-2.13.0.dev0/apache_beam/transforms
copying apache_beam/transforms/display.py -> apache-beam-2.13.0.dev0/apache_beam/transforms
copying apache_beam/transforms/display_test.py -> apache-beam-2.13.0.dev0/apache_beam/transforms
copying apache_beam/transforms/external.py -> apache-beam-2.13.0.dev0/apache_beam/transforms
copying apache_beam/transforms/external_test.py -> apache-beam-2.13.0.dev0/apache_beam/transforms
copying apache_beam/transforms/ptransform.py -> apache-beam-2.13.0.dev0/apache_beam/transforms
copying apache_beam/transforms/ptransform_test.py -> apache-beam-2.13.0.dev0/apache_beam/transforms
copying apache_beam/transforms/py_dataflow_distribution_counter.py -> apache-beam-2.13.0.dev0/apache_beam/transforms
copying apache_beam/transforms/sideinputs.py -> apache-beam-2.13.0.dev0/apache_beam/transforms
copying apache_beam/transforms/sideinputs_test.py -> apache-beam-2.13.0.dev0/apache_beam/transforms
copying apache_beam/transforms/timeutil.py -> apache-beam-2.13.0.dev0/apache_beam/transforms
copying apache_beam/transforms/trigger.py -> apache-beam-2.13.0.dev0/apache_beam/transforms
copying apache_beam/transforms/trigger_test.py -> apache-beam-2.13.0.dev0/apache_beam/transforms
copying apache_beam/transforms/userstate.py -> apache-beam-2.13.0.dev0/apache_beam/transforms
copying apache_beam/transforms/userstate_test.py -> apache-beam-2.13.0.dev0/apache_beam/transforms
copying apache_beam/transforms/util.py -> apache-beam-2.13.0.dev0/apache_beam/transforms
copying apache_beam/transforms/util_test.py -> apache-beam-2.13.0.dev0/apache_beam/transforms
copying apache_beam/transforms/window.py -> apache-beam-2.13.0.dev0/apache_beam/transforms
copying apache_beam/transforms/window_test.py -> apache-beam-2.13.0.dev0/apache_beam/transforms
copying apache_beam/transforms/write_ptransform_test.py -> apache-beam-2.13.0.dev0/apache_beam/transforms
copying apache_beam/typehints/__init__.py -> apache-beam-2.13.0.dev0/apache_beam/typehints
copying apache_beam/typehints/decorators.py -> apache-beam-2.13.0.dev0/apache_beam/typehints
copying apache_beam/typehints/native_type_compatibility.py -> apache-beam-2.13.0.dev0/apache_beam/typehints
copying apache_beam/typehints/native_type_compatibility_test.py -> apache-beam-2.13.0.dev0/apache_beam/typehints
copying apache_beam/typehints/opcodes.py -> apache-beam-2.13.0.dev0/apache_beam/typehints
copying apache_beam/typehints/trivial_inference.py -> apache-beam-2.13.0.dev0/apache_beam/typehints
copying apache_beam/typehints/trivial_inference_test.py -> apache-beam-2.13.0.dev0/apache_beam/typehints
copying apache_beam/typehints/typecheck.py -> apache-beam-2.13.0.dev0/apache_beam/typehints
copying apache_beam/typehints/typed_pipeline_test.py -> apache-beam-2.13.0.dev0/apache_beam/typehints
copying apache_beam/typehints/typehints.py -> apache-beam-2.13.0.dev0/apache_beam/typehints
copying apache_beam/typehints/typehints_test.py -> apache-beam-2.13.0.dev0/apache_beam/typehints
copying apache_beam/utils/__init__.py -> apache-beam-2.13.0.dev0/apache_beam/utils
copying apache_beam/utils/annotations.py -> apache-beam-2.13.0.dev0/apache_beam/utils
copying apache_beam/utils/annotations_test.py -> apache-beam-2.13.0.dev0/apache_beam/utils
copying apache_beam/utils/counters.pxd -> apache-beam-2.13.0.dev0/apache_beam/utils
copying apache_beam/utils/counters.py -> apache-beam-2.13.0.dev0/apache_beam/utils
copying apache_beam/utils/counters_test.py -> apache-beam-2.13.0.dev0/apache_beam/utils
copying apache_beam/utils/plugin.py -> apache-beam-2.13.0.dev0/apache_beam/utils
copying apache_beam/utils/processes.py -> apache-beam-2.13.0.dev0/apache_beam/utils
copying apache_beam/utils/processes_test.py -> apache-beam-2.13.0.dev0/apache_beam/utils
copying apache_beam/utils/profiler.py -> apache-beam-2.13.0.dev0/apache_beam/utils
copying apache_beam/utils/proto_utils.py -> apache-beam-2.13.0.dev0/apache_beam/utils
copying apache_beam/utils/retry.py -> apache-beam-2.13.0.dev0/apache_beam/utils
copying apache_beam/utils/retry_test.py -> apache-beam-2.13.0.dev0/apache_beam/utils
copying apache_beam/utils/timestamp.py -> apache-beam-2.13.0.dev0/apache_beam/utils
copying apache_beam/utils/timestamp_test.py -> apache-beam-2.13.0.dev0/apache_beam/utils
copying apache_beam/utils/urns.py -> apache-beam-2.13.0.dev0/apache_beam/utils
copying apache_beam/utils/windowed_value.pxd -> apache-beam-2.13.0.dev0/apache_beam/utils
copying apache_beam/utils/windowed_value.py -> apache-beam-2.13.0.dev0/apache_beam/utils
copying apache_beam/utils/windowed_value_test.py -> apache-beam-2.13.0.dev0/apache_beam/utils
Writing apache-beam-2.13.0.dev0/setup.cfg
creating dist
Creating tar archive
removing 'apache-beam-2.13.0.dev0' (and everything under it)
SDK_LOCATION=$(find dist/apache-beam-*.tar.gz)
find dist/apache-beam-*.tar.gz

# Run ValidatesRunner tests on Google Cloud Dataflow service
echo ">>> RUNNING DATAFLOW RUNNER VALIDATESCONTAINER TEST"
>>> RUNNING DATAFLOW RUNNER VALIDATESCONTAINER TEST
python setup.py nosetests \
  --attr ValidatesContainer \
  --nologcapture \
  --processes=1 \
  --process-timeout=900 \
  --test-pipeline-options=" \
    --runner=TestDataflowRunner \
    --project=$PROJECT \
    --worker_harness_container_image=$CONTAINER:$TAG \
    --staging_location=$GCS_LOCATION/staging-validatesrunner-test \
    --temp_location=$GCS_LOCATION/temp-validatesrunner-test \
    --output=$GCS_LOCATION/output \
    --sdk_location=$SDK_LOCATION \
    --num_workers=1"
<https://builds.apache.org/job/beam_PostCommit_Py_ValCont/ws/src/sdks/python/container/venv/python/local/lib/python2.7/site-packages/setuptools/dist.py>:475:
UserWarning: Normalizing '2.13.0.dev' to '2.13.0.dev0'
  normalized_version,
running nosetests
running egg_info
<https://builds.apache.org/job/beam_PostCommit_Py_ValCont/ws/src/sdks/python/gen_protos.py>:52:
UserWarning: Installing grpcio-tools is recommended for development.
  warnings.warn('Installing grpcio-tools is recommended for development.')
writing requirements to apache_beam.egg-info/requires.txt
writing apache_beam.egg-info/PKG-INFO
writing top-level names to apache_beam.egg-info/top_level.txt
writing dependency_links to apache_beam.egg-info/dependency_links.txt
writing entry points to apache_beam.egg-info/entry_points.txt
reading manifest file 'apache_beam.egg-info/SOURCES.txt'
reading manifest template 'MANIFEST.in'
warning: no files found matching 'README.md'
warning: no files found matching 'NOTICE'
warning: no files found matching 'LICENSE'
writing manifest file 'apache_beam.egg-info/SOURCES.txt'
WARNING:root:python-snappy is not installed; some tests will be skipped.
WARNING:root:Tensorflow is not installed, so skipping some tests.
test_wordcount_fnapi_it (apache_beam.examples.wordcount_it_test.WordCountIT) ... FAIL
WARNING:root:Discarding unparseable args: ['--output=gs://temp-storage-for-end-to-end-tests/output']
WARNING:root:Discarding unparseable args: ['--output=gs://temp-storage-for-end-to-end-tests/output']
test_metrics_fnapi_it (apache_beam.runners.dataflow.dataflow_exercise_metrics_pipeline_test.ExerciseMetricsPipelineTest)
... FAIL

======================================================================
FAIL: test_wordcount_fnapi_it (apache_beam.examples.wordcount_it_test.WordCountIT)
----------------------------------------------------------------------
Traceback (most recent call last):
  File "<https://builds.apache.org/job/beam_PostCommit_Py_ValCont/ws/src/sdks/python/apache_beam/examples/wordcount_it_test.py",>
line 51, in test_wordcount_fnapi_it
    self._run_wordcount_it(wordcount.run, experiment='beam_fn_api')
  File "<https://builds.apache.org/job/beam_PostCommit_Py_ValCont/ws/src/sdks/python/apache_beam/examples/wordcount_it_test.py",>
line 75, in _run_wordcount_it
    run_wordcount(test_pipeline.get_full_options_as_args(**extra_opts))
  File "<https://builds.apache.org/job/beam_PostCommit_Py_ValCont/ws/src/sdks/python/apache_beam/examples/wordcount.py",>
line 114, in run
    result = p.run()
  File "<https://builds.apache.org/job/beam_PostCommit_Py_ValCont/ws/src/sdks/python/apache_beam/pipeline.py",>
line 406, in run
    self._options).run(False)
  File "<https://builds.apache.org/job/beam_PostCommit_Py_ValCont/ws/src/sdks/python/apache_beam/pipeline.py",>
line 419, in run
    return self.runner.run_pipeline(self, self._options)
  File "<https://builds.apache.org/job/beam_PostCommit_Py_ValCont/ws/src/sdks/python/apache_beam/runners/dataflow/test_dataflow_runner.py",>
line 68, in run_pipeline
    hc_assert_that(self.result, pickler.loads(on_success_matcher))
AssertionError: 
Expected: (Test pipeline expected terminated in state: DONE and Expected checksum is 33535a832b7db6d78389759577d4ff495980b9c0)
     but: Test pipeline expected terminated in state: DONE Test pipeline job terminated in
state: FAILED

-------------------- >> begin captured stdout << ---------------------
Found: https://console.cloud.google.com/dataflow/jobsDetail/locations/us-central1/jobs/2019-03-28_09_04_01-12758488591131543174?project=apache-beam-testing.

--------------------- >> end captured stdout << ----------------------

======================================================================
FAIL: test_metrics_fnapi_it (apache_beam.runners.dataflow.dataflow_exercise_metrics_pipeline_test.ExerciseMetricsPipelineTest)
----------------------------------------------------------------------
Traceback (most recent call last):
  File "<https://builds.apache.org/job/beam_PostCommit_Py_ValCont/ws/src/sdks/python/apache_beam/runners/dataflow/dataflow_exercise_metrics_pipeline_test.py",>
line 64, in test_metrics_fnapi_it
    self.assertFalse(errors, str(errors))
AssertionError: Unable to match metrics for matcher  namespace: 'apache_beam.runners.dataflow.dataflow_exercise_metrics_pipeline.UserMetricsDoFn'
name: 'total_values' step: 'metrics' attempted: <100> committed: <100>Unable to
match metrics for matcher  name: 'ExecutionTime_StartBundle' step: 'metrics' attempted: a
value greater than <0> committed: a value greater than <0>Unable to match metrics
for matcher  name: 'ExecutionTime_ProcessElement' step: 'metrics' attempted: a value greater
than <0> committed: a value greater than <0>Unable to match metrics for matcher
 name: 'ExecutionTime_FinishBundle' step: 'metrics' attempted: a value greater than <0>
committed: a value greater than <0>Unable to match metrics for matcher  name: 'ElementCount'
(label_key: 'output_user_name' label_value: 'GroupByKey/Reify-out0').  (label_key: 'original_name'
label_value: 'GroupByKey/Reify-out0-ElementCount').  attempted: a value greater than <0>
committed: a value greater than <0>Unable to match metrics for matcher  name: 'MeanByteCount'
(label_key: 'original_name' label_value: 'GroupByKey/Reify-out0-MeanByteCount').  (label_key:
'output_user_name' label_value: 'GroupByKey/Reify-out0').  attempted: a value greater than
<0> committed: a value greater than <0>Unable to match metrics for matcher  name:
'ElementCount' (label_key: 'original_name' label_value: 'GroupByKey/Read-out0-ElementCount').
 (label_key: 'output_user_name' label_value: 'GroupByKey/Read-out0').  attempted: a value
greater than <0> committed: a value greater than <0>Unable to match metrics for
matcher  name: 'MeanByteCount' (label_key: 'output_user_name' label_value: 'GroupByKey/Read-out0').
 (label_key: 'original_name' label_value: 'GroupByKey/Read-out0-MeanByteCount').  attempted:
a value greater than <0> committed: a value greater than <0>Unable to match metrics
for matcher  name: 'ElementCount' (label_key: 'output_user_name' label_value: 'map_to_common_key-out0').
 (label_key: 'original_name' label_value: 'map_to_common_key-out0-ElementCount').  attempted:
a value greater than <0> committed: a value greater than <0>Unable to match metrics
for matcher  name: 'MeanByteCount' (label_key: 'output_user_name' label_value: 'map_to_common_key-out0').
 (label_key: 'original_name' label_value: 'map_to_common_key-out0-MeanByteCount').  attempted:
a value greater than <0> committed: a value greater than <0>Unable to match metrics
for matcher  name: 'ElementCount' (label_key: 'output_user_name' label_value: 'GroupByKey/GroupByWindow-out0').
 (label_key: 'original_name' label_value: 'GroupByKey/GroupByWindow-out0-ElementCount'). 
attempted: a value greater than <0> committed: a value greater than <0>Unable
to match metrics for matcher  name: 'MeanByteCount' (label_key: 'original_name' label_value:
'GroupByKey/GroupByWindow-out0-MeanByteCount').  (label_key: 'output_user_name' label_value:
'GroupByKey/GroupByWindow-out0').  attempted: a value greater than <0> committed: a
value greater than <0>Unable to match metrics for matcher  name: 'ElementCount' (label_key:
'output_user_name' label_value: 'GroupByKey/Read-out0').  (label_key: 'original_name' label_value:
'GroupByKey/Read-out0-ElementCount').  attempted: a value greater than <0> committed:
a value greater than <0>Unable to match metrics for matcher  name: 'MeanByteCount' (label_key:
'output_user_name' label_value: 'GroupByKey/Read-out0').  (label_key: 'original_name' label_value:
'GroupByKey/Read-out0-MeanByteCount').  attempted: a value greater than <0> committed:
a value greater than <0>Unable to match metrics for matcher  name: 'ElementCount' (label_key:
'output_user_name' label_value: 'GroupByKey/Reify-out0').  (label_key: 'original_name' label_value:
'GroupByKey/Reify-out0-ElementCount').  attempted: a value greater than <0> committed:
a value greater than <0>Unable to match metrics for matcher  name: 'MeanByteCount' (label_key:
'output_user_name' label_value: 'GroupByKey/Reify-out0').  (label_key: 'original_name' label_value:
'GroupByKey/Reify-out0-MeanByteCount').  attempted: a value greater than <0> committed:
a value greater than <0>
Actual MetricResults:

-------------------- >> begin captured stdout << ---------------------
Found: https://console.cloud.google.com/dataflow/jobsDetail/locations/us-central1/jobs/2019-03-28_09_04_13-2769408015159667948?project=apache-beam-testing.

--------------------- >> end captured stdout << ----------------------

----------------------------------------------------------------------
XML: <https://builds.apache.org/job/beam_PostCommit_Py_ValCont/ws/src/sdks/python/nosetests.xml>
----------------------------------------------------------------------
Ran 2 tests in 27.171s

FAILED (failures=2)
cleanup_container
Untagged: us.gcr.io/apache-beam-testing/jenkins/python:20190328-155753
Untagged: us.gcr.io/apache-beam-testing/jenkins/python@sha256:d49b245288eece37b72dc9577445fdab972b9de3fe7b4d4c68bebaebb32961cf
Deleted: sha256:b02e3ea59eea31f644c1a34e9ecd112c8530aaf08d19fdfe336c0f49ed889063
Deleted: sha256:a758dee6beece156e6110cdc3c7d41f6b269320df5b39334a680f8478a467c30
Deleted: sha256:edf0b11d1cc464321965632167622f4bb7c002c30a939b82fceb3418249a87eb
Deleted: sha256:53ddc18ce2c5f7e8adf3ea276c3c2e59649567d0b7a373fff9dcf4ab6a6c2b1f
Deleted: sha256:deea7d67188e9a95ff1ac378f63f7356eb81d540213eae82da7c8c2527af9658
Deleted: sha256:925d2ddf85bfcd83c0b9eb6c5c4a876e5cccd72d6e5e55eb160ca40cb956ade4
Deleted: sha256:c07e6e4ae780b42893ff5589a20eda2bc0a9b7fcaba8885e6d035378d8dfc88b
Deleted: sha256:4e43b1cb3a9a5f0d63956c59c88babb1ce9af59fc776c544d29a9a7be7e265a7
Deleted: sha256:32fd5d58cdd7f601c745048e6dd00bd3990dc140631fd3163db2f3288cad4190
Deleted: sha256:084099c5b1d2986c6785c743463f97ef45a9fa1794eca37dbb8148b9ac680ca1
Deleted: sha256:d058e750f49aa24992deadaa01c244b547a45404e50cd3241a90de4c2e4e337c
Deleted: sha256:551a655578432a7478614265656ee47baef724fd3b999ef4c3b71d1922ada5b6
Deleted: sha256:614ba51e452d72e1846063ec073cf6a9bf59a1dd65745ac212e6c995b8c057cb
Deleted: sha256:7c9101492a9c6de5c28c06ef21132d9aa5489a2909236b73c265621d3c23ba84
Digests:
- us.gcr.io/apache-beam-testing/jenkins/python@sha256:d49b245288eece37b72dc9577445fdab972b9de3fe7b4d4c68bebaebb32961cf
  Associated tags:
 - 20190328-155753
Tags:
- us.gcr.io/apache-beam-testing/jenkins/python:20190328-155753
Deleted [us.gcr.io/apache-beam-testing/jenkins/python:20190328-155753].
Deleted [us.gcr.io/apache-beam-testing/jenkins/python@sha256:d49b245288eece37b72dc9577445fdab972b9de3fe7b4d4c68bebaebb32961cf].
Removed the container
Build step 'Execute shell' marked build as failure

---------------------------------------------------------------------
To unsubscribe, e-mail: builds-unsubscribe@beam.apache.org
For additional commands, e-mail: builds-help@beam.apache.org


Mime
View raw message