beam-builds mailing list archives

Site index · List index
Message view « Date » · « Thread »
Top « Date » · « Thread »
From Apache Jenkins Server <jenk...@builds.apache.org>
Subject Build failed in Jenkins: beam_PreCommit_Website_Cron #831
Date Thu, 28 Mar 2019 07:08:19 GMT
See <https://builds.apache.org/job/beam_PreCommit_Website_Cron/831/display/redirect>

------------------------------------------
Started by timer
[EnvInject] - Loading node environment variables.
Building remotely on beam5 (beam) in workspace <https://builds.apache.org/job/beam_PreCommit_Website_Cron/ws/>
No credentials specified
 > git rev-parse --is-inside-work-tree # timeout=10
Fetching changes from the remote Git repository
 > git config remote.origin.url https://github.com/apache/beam.git # timeout=10
Fetching upstream changes from https://github.com/apache/beam.git
 > git --version # timeout=10
 > git fetch --tags --progress https://github.com/apache/beam.git +refs/heads/*:refs/remotes/origin/*
+refs/pull/${ghprbPullId}/*:refs/remotes/origin/pr/${ghprbPullId}/*
 > git rev-parse origin/master^{commit} # timeout=10
Checking out Revision 1d9daf1aca101fa5a194cbbba969886734e08902 (origin/master)
 > git config core.sparsecheckout # timeout=10
 > git checkout -f 1d9daf1aca101fa5a194cbbba969886734e08902
Commit message: "Merge pull request #8154: [BEAM-6924] Prevent overflow for Flink bundle timeout"
 > git rev-list --no-walk 1d9daf1aca101fa5a194cbbba969886734e08902 # timeout=10
Cleaning workspace
 > git rev-parse --verify HEAD # timeout=10
Resetting working tree
 > git reset --hard # timeout=10
 > git clean -fdx # timeout=10
[EnvInject] - Executing scripts and injecting environment variables after the SCM step.
[EnvInject] - Injecting as environment variables the properties content 
SPARK_LOCAL_IP=127.0.0.1

[EnvInject] - Variables injected successfully.
[Gradle] - Launching build.
[src] $ <https://builds.apache.org/job/beam_PreCommit_Website_Cron/ws/src/gradlew> --continue
--max-workers=12 -Dorg.gradle.jvmargs=-Xms2g -Dorg.gradle.jvmargs=-Xmx4g :websitePreCommit
To honour the JVM settings for this build a new JVM will be forked. Please consider using
the daemon: https://docs.gradle.org/5.2.1/userguide/gradle_daemon.html.
Daemon will be stopped at the end of the build stopping after processing
> Task :buildSrc:compileJava NO-SOURCE
> Task :buildSrc:compileGroovy FROM-CACHE
> Task :buildSrc:pluginDescriptors
> Task :buildSrc:processResources
> Task :buildSrc:classes
> Task :buildSrc:jar
> Task :buildSrc:assemble
> Task :buildSrc:spotlessGroovy
> Task :buildSrc:spotlessGroovyCheck
> Task :buildSrc:spotlessGroovyGradle
> Task :buildSrc:spotlessGroovyGradleCheck
> Task :buildSrc:spotlessCheck
> Task :buildSrc:pluginUnderTestMetadata
> Task :buildSrc:compileTestJava NO-SOURCE
> Task :buildSrc:compileTestGroovy NO-SOURCE
> Task :buildSrc:processTestResources NO-SOURCE
> Task :buildSrc:testClasses UP-TO-DATE
> Task :buildSrc:test NO-SOURCE
> Task :buildSrc:validateTaskProperties FROM-CACHE
> Task :buildSrc:check
> Task :buildSrc:build
Configuration on demand is an incubating feature.
> Task :beam-website:setupBuildDir

> Task :beam-website:buildDockerImage
Sending build context to Docker daemon  26.45MB
Step 1/7 : FROM ruby:2.5
 ---> e86557c9a8ab
Step 2/7 : WORKDIR /ruby
 ---> Using cache
 ---> 6a6e3b4cf96b
Step 3/7 : RUN gem install bundler
 ---> Using cache
 ---> bab5f63c71e6
Step 4/7 : ADD Gemfile Gemfile.lock /ruby/
 ---> Using cache
 ---> 36c0a17cb307
Step 5/7 : RUN bundle install --deployment --path $GEM_HOME
 ---> Using cache
 ---> 007f916d1ea1
Step 6/7 : ENV LC_ALL C.UTF-8
 ---> Using cache
 ---> 68a5d38b6266
Step 7/7 : CMD sleep 3600
 ---> Using cache
 ---> d79f7390606b
Successfully built d79f7390606b
Successfully tagged beam-website:latest

> Task :beam-website:createDockerContainer

> Task :beam-website:startDockerContainer
efd7f26e0c81434ea1ce8f3b9fc65f6276b759ce973d0f608d3302c808e57931

> Task :beam-website:buildLocalWebsite
`/` is not writable.
Bundler will use `/tmp/bundler/home/unknown' as your home directory temporarily.
Configuration file: /repo/website/_config.yml
Configuration file: /repo/website/_config_test.yml
            Source: /repo/website/src
       Destination: generated-local-content
 Incremental build: enabled
      Generating... 
                    done in 13.514 seconds.
 Auto-regeneration: disabled. Use --watch to enable.

> Task :beam-website:testWebsite
`/` is not writable.
Bundler will use `/tmp/bundler/home/unknown' as your home directory temporarily.
Running ["HtmlCheck", "LinkCheck", "ImageCheck", "ScriptCheck"] on ["./generated-local-content"]
on *.html... 


Checking 890 external links...
Ran on 191 files!


- ./generated-local-content/documentation/index.html
  *  External link http://flink.apache.org failed: got a time out (response code 301)
- ./generated-local-content/documentation/resources/learning-resources/index.html
  *  External link https://beam.apache.org/blog/2017/02/13/stateful-processing.html failed:
got a time out (response code 0)
  *  External link https://beam.apache.org/blog/2017/08/28/timely-processing.html failed:
got a time out (response code 0)
  *  External link https://beam.apache.org/contribute/ failed: got a time out (response code
0)
rake aborted!
HTML-Proofer found 4 failures!
/usr/local/bundle/ruby/2.5.0/gems/html-proofer-3.9.3/lib/html-proofer/runner.rb:167:in `print_failed_tests'
/usr/local/bundle/ruby/2.5.0/gems/html-proofer-3.9.3/lib/html-proofer/runner.rb:48:in `run'
/repo/build/website/Rakefile:23:in `block in <top (required)>'
/usr/local/bundle/ruby/2.5.0/gems/rake-12.3.0/exe/rake:27:in `<top (required)>'
/usr/local/bundle/bin/bundle:23:in `load'
/usr/local/bundle/bin/bundle:23:in `<main>'
Tasks: TOP => test
(See full trace by running task with --trace)

> Task :beam-website:testWebsite FAILED

> Task :beam-website:stopAndRemoveDockerContainer
efd7f26e0c81434ea1ce8f3b9fc65f6276b759ce973d0f608d3302c808e57931

FAILURE: Build failed with an exception.

* What went wrong:
Execution failed for task ':beam-website:testWebsite'.
> Process 'command 'docker'' finished with non-zero exit value 1

* Try:
Run with --stacktrace option to get the stack trace. Run with --info or --debug option to
get more log output. Run with --scan to get full insights.

* Get more help at https://help.gradle.org

BUILD FAILED in 2m 19s
7 actionable tasks: 7 executed

Publishing build scan...
https://gradle.com/s/qhfovnskrire2

Build step 'Invoke Gradle script' changed build result to FAILURE
Build step 'Invoke Gradle script' marked build as failure

---------------------------------------------------------------------
To unsubscribe, e-mail: builds-unsubscribe@beam.apache.org
For additional commands, e-mail: builds-help@beam.apache.org


Mime
View raw message