beam-builds mailing list archives

Site index · List index
Message view « Date » · « Thread »
Top « Date » · « Thread »
From Apache Jenkins Server <jenk...@builds.apache.org>
Subject Build failed in Jenkins: beam_Release_NightlySnapshot #354
Date Wed, 06 Mar 2019 09:09:23 GMT
See <https://builds.apache.org/job/beam_Release_NightlySnapshot/354/display/redirect?page=changes>

Changes:

[altay] Website changes for 2.11.0

[kmj] Add BQ Storage API case to BigQueryTornadoesIT.

[ajamato] [BEAM-6612] Improve java SDK performance by using a LinkedBlockingQueue

[kmj] Run BQ Storage tests in Dataflow in post-commit.

[github] Migrate older releases to archive links.

[mxm] [BEAM-6731] Move ExpansionService to core-construction-java

[github] [BEAM-6760] Reducing concurrency in website checks (#7989)

[github] Fixing typo in LoadTestsBuilder

[pablo] [BEAM-6081]: Create "Dataflow Reaper" infrastructure to periodically

[melissapa] [BEAM-6749] Add BigQuery Storage API info to docs

[github] [BEAM-6767] SamzaRunner: Add more parameters to SamzaPipelineOptions

------------------------------------------
[...truncated 4.25 MB...]
> Task :beam-vendor-guava-20_0:compileTestJava NO-SOURCE
> Task :beam-vendor-guava-20_0:processTestResources NO-SOURCE
> Task :beam-vendor-guava-20_0:testClasses UP-TO-DATE
> Task :beam-vendor-guava-20_0:test NO-SOURCE
> Task :beam-vendor-guava-20_0:validateVendoring
> Task :beam-vendor-guava-20_0:check
> Task :beam-vendor-guava-20_0:build
> Task :beam-vendor-sdks-java-extensions-protobuf:jar
> Task :beam-vendor-sdks-java-extensions-protobuf:compileTestJava NO-SOURCE
> Task :beam-vendor-sdks-java-extensions-protobuf:processTestResources NO-SOURCE
> Task :beam-vendor-sdks-java-extensions-protobuf:testClasses UP-TO-DATE
> Task :beam-vendor-sdks-java-extensions-protobuf:packageTests
> Task :beam-vendor-sdks-java-extensions-protobuf:assemble
> Task :beam-vendor-sdks-java-extensions-protobuf:analyzeClassesDependencies SKIPPED
> Task :beam-sdks-java-nexmark:check
> Task :beam-sdks-java-nexmark:build
> Task :beam-vendor-sdks-java-extensions-protobuf:analyzeTestClassesDependencies SKIPPED
> Task :beam-vendor-sdks-java-extensions-protobuf:analyzeDependencies SKIPPED
> Task :beam-vendor-sdks-java-extensions-protobuf:checkstyleMain NO-SOURCE
> Task :beam-vendor-sdks-java-extensions-protobuf:checkstyleTest NO-SOURCE
> Task :beam-vendor-sdks-java-extensions-protobuf:javadoc NO-SOURCE
> Task :beam-vendor-sdks-java-extensions-protobuf:spotlessJava
> Task :beam-vendor-sdks-java-extensions-protobuf:spotlessJavaCheck
> Task :beam-vendor-sdks-java-extensions-protobuf:spotlessCheck
> Task :beam-vendor-sdks-java-extensions-protobuf:test NO-SOURCE
> Task :beam-vendor-sdks-java-extensions-protobuf:validateShadedJarDoesntLeakNonProjectClasses
> Task :beam-website:assemble UP-TO-DATE
> Task :beam-website:setupBuildDir

> Task :beam-website:buildDockerImage
Sending build context to Docker daemon  26.43MB
Step 1/7 : FROM ruby:2.5
2.5: Pulling from library/ruby
22dbe790f715: Already exists
0250231711a0: Already exists
6fba9447437b: Already exists
c2b4d327b352: Already exists
270e1baa5299: Already exists
01cbe6152974: Pulling fs layer
9cbe009ecc9f: Pulling fs layer
12a294370dca: Pulling fs layer
12a294370dca: Verifying Checksum
12a294370dca: Download complete
01cbe6152974: Verifying Checksum
01cbe6152974: Download complete
01cbe6152974: Pull complete
9cbe009ecc9f: Verifying Checksum
9cbe009ecc9f: Download complete
9cbe009ecc9f: Pull complete
12a294370dca: Pull complete
Digest: sha256:232b58a5856545faa3be96d307a54f87acad0db7f97d82c54aec5e035bbcbc04
Status: Downloaded newer image for ruby:2.5
 ---> 8423fe29e329
Step 2/7 : WORKDIR /ruby
 ---> 58725d280b29
Removing intermediate container 3aed0c1b9a17
Step 3/7 : RUN gem install bundler
 ---> Running in 96cfc1e9348b
Successfully installed bundler-2.0.1
1 gem installed
 ---> 4738d4891e04
Removing intermediate container 96cfc1e9348b
Step 4/7 : ADD Gemfile Gemfile.lock /ruby/
 ---> c3df7e0ce902
Removing intermediate container aea60eac4d83
Step 5/7 : RUN bundle install --deployment --path $GEM_HOME
 ---> Running in a50fdebaa9c8
Fetching gem metadata from https://rubygems.org/.........
Fetching rake 12.3.0
Installing rake 12.3.0
Fetching concurrent-ruby 1.1.4
Installing concurrent-ruby 1.1.4
Fetching i18n 0.9.5
Installing i18n 0.9.5
Fetching minitest 5.11.3
Installing minitest 5.11.3
Fetching thread_safe 0.3.6
Installing thread_safe 0.3.6
Fetching tzinfo 1.2.5
Installing tzinfo 1.2.5
Fetching activesupport 4.2.11
Installing activesupport 4.2.11
Fetching public_suffix 3.0.3
Installing public_suffix 3.0.3
Fetching addressable 2.5.2
Installing addressable 2.5.2
Using bundler 1.17.2
Fetching colorator 1.1.0
Installing colorator 1.1.0
Fetching colorize 0.8.1
Installing colorize 0.8.1
Fetching ffi 1.9.25
Installing ffi 1.9.25 with native extensions
Fetching ethon 0.11.0
Installing ethon 0.11.0
Fetching forwardable-extended 2.6.0
Installing forwardable-extended 2.6.0
Fetching mercenary 0.3.6
Installing mercenary 0.3.6
Fetching mini_portile2 2.3.0
Installing mini_portile2 2.3.0
Fetching nokogiri 1.8.5
Installing nokogiri 1.8.5 with native extensions

> Task :beam-vendor-sdks-java-extensions-protobuf:spotbugsMain

> Task :beam-website:buildDockerImage
Fetching parallel 1.12.1
Installing parallel 1.12.1
Fetching typhoeus 1.3.1
Installing typhoeus 1.3.1
Fetching yell 2.0.7
Installing yell 2.0.7
Fetching html-proofer 3.9.3
Installing html-proofer 3.9.3
Fetching rb-fsevent 0.10.2
Installing rb-fsevent 0.10.2
Fetching rb-inotify 0.9.10
Installing rb-inotify 0.9.10
Fetching sass-listen 4.0.0
Installing sass-listen 4.0.0
Fetching sass 3.5.5
Installing sass 3.5.5
Fetching jekyll-sass-converter 1.5.2
Installing jekyll-sass-converter 1.5.2
Fetching ruby_dep 1.5.0
Installing ruby_dep 1.5.0
Fetching listen 3.1.5
Installing listen 3.1.5
Fetching jekyll-watch 1.5.1
Installing jekyll-watch 1.5.1
Fetching kramdown 1.16.2
Installing kramdown 1.16.2
Fetching liquid 3.0.6
Installing liquid 3.0.6
Fetching pathutil 0.16.1
Installing pathutil 0.16.1
Fetching rouge 1.11.1
Installing rouge 1.11.1
Fetching safe_yaml 1.0.4
Installing safe_yaml 1.0.4
Fetching jekyll 3.2.0
Installing jekyll 3.2.0
Fetching jekyll-redirect-from 0.11.0
Installing jekyll-redirect-from 0.11.0
Fetching jekyll_github_sample 0.3.1
Installing jekyll_github_sample 0.3.1
Bundle complete! 7 Gemfile dependencies, 38 gems now installed.
Bundled gems are installed into `/usr/local/bundle`
 ---> 94ea71137023
Removing intermediate container a50fdebaa9c8
Step 6/7 : ENV LC_ALL C.UTF-8
 ---> Running in 9456267c99b9
 ---> d16d27134e04
Removing intermediate container 9456267c99b9
Step 7/7 : CMD sleep 3600
 ---> Running in f5978fba1c66
 ---> c684e76d3af1
Removing intermediate container f5978fba1c66
Successfully built c684e76d3af1
Successfully tagged beam-website:latest

> Task :beam-website:createDockerContainer

> Task :beam-website:startDockerContainer
6909a1bd0146c8257ae69fed8a820d23dd407a390d01a62fb1c3304871af916e

> Task :beam-website:buildLocalWebsite
`/` is not writable.
Bundler will use `/tmp/bundler/home/unknown' as your home directory temporarily.
Configuration file: /repo/website/_config.yml
Configuration file: /repo/website/_config_test.yml
            Source: /repo/website/src
       Destination: generated-local-content
 Incremental build: enabled
      Generating... 
                    done in 14.411 seconds.
 Auto-regeneration: disabled. Use --watch to enable.

> Task :beam-website:testWebsite
`/` is not writable.
Bundler will use `/tmp/bundler/home/unknown' as your home directory temporarily.
Running ["HtmlCheck", "LinkCheck", "ImageCheck", "ScriptCheck"] on ["./generated-local-content"]
on *.html... 


Checking 889 external links...
Ran on 190 files!


- ./generated-local-content/contribute/become-a-committer/index.html
  *  External link https://lists.apache.org/trends.html?dev@beam.apache.org failed: 503 No
error
- ./generated-local-content/contribute/postcommits-policies-details/index.html
  *  External link https://lists.apache.org/thread.html/3bb4aa777751da2e2d7e22666aa6a2e18ae31891cb09d91718b75e74@%3Cdev.beam.apache.org%3E
failed: 503 No error
rake aborted!
HTML-Proofer found 2 failures!
/usr/local/bundle/ruby/2.5.0/gems/html-proofer-3.9.3/lib/html-proofer/runner.rb:167:in `print_failed_tests'
/usr/local/bundle/ruby/2.5.0/gems/html-proofer-3.9.3/lib/html-proofer/runner.rb:48:in `run'
/repo/build/website/Rakefile:23:in `block in <top (required)>'
/usr/local/bundle/ruby/2.5.0/gems/rake-12.3.0/exe/rake:27:in `<top (required)>'
/usr/local/bundle/bin/bundle:23:in `load'
/usr/local/bundle/bin/bundle:23:in `<main>'
Tasks: TOP => test
(See full trace by running task with --trace)

> Task :beam-website:testWebsite FAILED

> Task :beam-website:stopAndRemoveDockerContainer
6909a1bd0146c8257ae69fed8a820d23dd407a390d01a62fb1c3304871af916e

> Task :beam-website:buildWebsite
> Task :release:compileJava NO-SOURCE
> Task :release:compileGroovy FROM-CACHE
> Task :release:processResources NO-SOURCE
> Task :release:classes UP-TO-DATE
> Task :release:jar
> Task :release:assemble
> Task :release:compileTestJava NO-SOURCE
> Task :release:compileTestGroovy NO-SOURCE
> Task :release:processTestResources NO-SOURCE
> Task :release:testClasses UP-TO-DATE
> Task :release:test NO-SOURCE
> Task :release:check UP-TO-DATE
> Task :release:build
> Task :beam-vendor-sdks-java-extensions-protobuf:check
> Task :beam-vendor-sdks-java-extensions-protobuf:build

FAILURE: Build failed with an exception.

* What went wrong:
Execution failed for task ':beam-website:testWebsite'.
> Process 'command 'docker'' finished with non-zero exit value 1

* Try:
Run with --stacktrace option to get the stack trace. Run with --info or --debug option to
get more log output. Run with --scan to get full insights.

* Get more help at https://help.gradle.org

Deprecated Gradle features were used in this build, making it incompatible with Gradle 6.0.
Use '--warning-mode all' to show the individual deprecation warnings.
See https://docs.gradle.org/5.2.1/userguide/command_line_interface.html#sec:command_line_warnings

BUILD FAILED in 2h 8m 39s
1059 actionable tasks: 971 executed, 88 from cache

Publishing build scan...
https://gradle.com/s/5rhik7bwsn732

Build step 'Invoke Gradle script' changed build result to FAILURE
Build step 'Invoke Gradle script' marked build as failure

---------------------------------------------------------------------
To unsubscribe, e-mail: builds-unsubscribe@beam.apache.org
For additional commands, e-mail: builds-help@beam.apache.org


Mime
View raw message