beam-builds mailing list archives

Site index · List index
Message view « Date » · « Thread »
Top « Date » · « Thread »
From Apache Jenkins Server <jenk...@builds.apache.org>
Subject Build failed in Jenkins: beam_PostCommit_Java11_ValidatesRunner_Dataflow #60
Date Thu, 28 Mar 2019 16:14:02 GMT
See <https://builds.apache.org/job/beam_PostCommit_Java11_ValidatesRunner_Dataflow/60/display/redirect?page=changes>

Changes:

[apilloud] Moving to 2.13.0-SNAPSHOT on master branch.

------------------------------------------
[...truncated 50.77 KB...]
org.apache.beam.sdk.transforms.ParDoSchemaTest > testFieldAccessSchemaPipeline FAILED
    java.lang.RuntimeException at ParDoSchemaTest.java:316

org.apache.beam.sdk.transforms.CombineTest$WindowingTests > testWindowedCombineGloballyAsSingletonView
FAILED
    java.lang.RuntimeException at CombineTest.java:1369

org.apache.beam.sdk.transforms.ParDoTest$TimerTests > testEventTimeTimerMultipleKeys FAILED
    java.lang.RuntimeException at ParDoTest.java:2824

org.apache.beam.sdk.transforms.ParDoTest$MultipleInputsAndOutputTests > testParDoWithSideInputsIsCumulative
FAILED
    java.lang.RuntimeException at ParDoTest.java:771

org.apache.beam.sdk.transforms.FlattenTest > testFlattenPCollectionsThenParDo FAILED
    java.lang.RuntimeException at FlattenTest.java:118

org.apache.beam.sdk.transforms.ParDoTest$StateTests > testBagStateSideInput FAILED
    java.lang.RuntimeException at ParDoTest.java:2011

org.apache.beam.sdk.transforms.ParDoTest$StateCoderInferenceTests > testBagStateCoderInference
FAILED
    java.lang.RuntimeException at ParDoTest.java:2067

org.apache.beam.sdk.transforms.ReshuffleTest > testReshuffleAfterSlidingWindowsAndGroupByKey
FAILED
    java.lang.RuntimeException at ReshuffleTest.java:211

org.apache.beam.sdk.transforms.SplittableDoFnTest > testOutputAfterCheckpointBounded FAILED
    java.lang.RuntimeException at SplittableDoFnTest.java:309

org.apache.beam.sdk.transforms.GroupByKeyTest$BasicTests > testLargeKeys10KB FAILED
    java.lang.RuntimeException at GroupByKeyTest.java:353

org.apache.beam.sdk.transforms.ViewTest > testMultimapSideInput FAILED
    java.lang.RuntimeException at ViewTest.java:543

org.apache.beam.sdk.transforms.ParDoSchemaTest > testSimpleSchemaPipeline FAILED
    java.lang.RuntimeException at ParDoSchemaTest.java:90

org.apache.beam.sdk.transforms.CombineTest$WindowingTests > testCombineGloballyInstanceMethodReference
FAILED
    java.lang.RuntimeException at CombineTest.java:1403

org.apache.beam.sdk.testing.PAssertTest > testSerializablePredicate FAILED
    java.lang.RuntimeException at PAssertTest.java:203

org.apache.beam.sdk.transforms.ParDoTest$TimerTests > testPipelineOptionsParameterOnTimer
FAILED
    java.lang.RuntimeException at ParDoTest.java:3179

org.apache.beam.sdk.transforms.FlattenTest > testFlattenMultiplePCollectionsHavingMultipleConsumers
FAILED
    java.lang.RuntimeException at FlattenTest.java:347

org.apache.beam.sdk.transforms.ReshuffleTest > testJustReshuffle FAILED
    java.lang.RuntimeException at ReshuffleTest.java:102

org.apache.beam.sdk.transforms.ParDoTest$StateTests > testCombiningStateParameterSuperclass
FAILED
    java.lang.RuntimeException at ParDoTest.java:1960

org.apache.beam.sdk.transforms.SplittableDoFnTest > testAdditionalOutputBounded FAILED
    java.lang.RuntimeException at SplittableDoFnTest.java:634

org.apache.beam.sdk.transforms.GroupByKeyTest$BasicTests > testGroupByKeyWithBadEqualsHashCode
FAILED
    java.lang.RuntimeException at GroupByKeyTest.java:347

org.apache.beam.sdk.transforms.ViewTest > testEmptyIterableSideInput FAILED
    java.lang.RuntimeException at ViewTest.java:470

org.apache.beam.sdk.transforms.ParDoSchemaTest > testSchemaConversionPipeline FAILED
    java.lang.RuntimeException at ParDoSchemaTest.java:443

org.apache.beam.sdk.transforms.FlattenTest > testFlattenIterables FAILED
    java.lang.RuntimeException at FlattenTest.java:252

org.apache.beam.sdk.transforms.CombineTest$WindowingTests > testFixedWindowsCombine FAILED
    java.lang.RuntimeException at CombineTest.java:1030

org.apache.beam.sdk.transforms.ReifyTimestampsTest > inValuesSucceeds FAILED
    java.lang.RuntimeException at ReifyTimestampsTest.java:60

org.apache.beam.sdk.testing.PAssertTest > testNotEqualTo FAILED
    java.lang.RuntimeException at PAssertTest.java:355

org.apache.beam.sdk.transforms.SplittableDoFnTest > testSideInputUnbounded FAILED
    java.lang.RuntimeException at SplittableDoFnTest.java:375

org.apache.beam.sdk.transforms.ViewTest > testSideInputWithNestedIterables FAILED
    java.lang.RuntimeException at ViewTest.java:1539

org.apache.beam.sdk.transforms.ParDoSchemaTest > testReadAndWriteWithSchemaRegistry FAILED
    java.lang.RuntimeException at ParDoSchemaTest.java:281

org.apache.beam.sdk.transforms.GroupByKeyTest$BasicTests > testLargeKeys100KB FAILED
    java.lang.RuntimeException at GroupByKeyTest.java:359

org.apache.beam.sdk.transforms.FlattenTest > testFlattenIterablesSets FAILED
    java.lang.RuntimeException at FlattenTest.java:280

org.apache.beam.sdk.testing.PAssertTest > testGlobalWindowContainsInAnyOrder FAILED
    java.lang.RuntimeException at PAssertTest.java:405

org.apache.beam.sdk.transforms.CombineTest$WindowingTests > testSlidingWindowsCombineWithContext
FAILED
    java.lang.RuntimeException at CombineTest.java:1182

org.apache.beam.sdk.transforms.ViewTest > testListSideInput FAILED
    java.lang.RuntimeException at ViewTest.java:241

org.apache.beam.sdk.transforms.ParDoSchemaTest > testReadAndWriteMultiOutput FAILED
    java.lang.RuntimeException at ParDoSchemaTest.java:236

org.apache.beam.sdk.transforms.FlattenTest > testFlattenPCollectionsEmptyThenParDo FAILED
    java.lang.RuntimeException at FlattenTest.java:224

org.apache.beam.sdk.transforms.CombineTest$WindowingTests > testFixedWindowsCombineWithContext
FAILED
    java.lang.RuntimeException at CombineTest.java:1072

org.apache.beam.sdk.testing.PAssertTest > testEmptyFalseDefaultReasonString FAILED
    java.lang.AssertionError at PAssertTest.java:500

org.apache.beam.sdk.transforms.ViewTest > testMapSideInput FAILED
    java.lang.RuntimeException at ViewTest.java:945

org.apache.beam.sdk.transforms.CombineTest$WindowingTests > testSessionsCombineWithContext
FAILED
    java.lang.RuntimeException at CombineTest.java:1286

org.apache.beam.sdk.testing.PAssertTest > testAssertionSiteIsCapturedWithoutMessage FAILED
    java.lang.AssertionError at PAssertTest.java:541

org.apache.beam.sdk.transforms.ViewTest > testWindowedSideInputFixedToFixedWithDefault
FAILED
    java.lang.RuntimeException at ViewTest.java:1455

org.apache.beam.sdk.testing.PAssertTest > testWindowedSerializablePredicate FAILED
    java.lang.RuntimeException at PAssertTest.java:237

org.apache.beam.sdk.testing.PAssertTest > testWindowedIsEqualTo FAILED
    java.lang.RuntimeException at PAssertTest.java:346

org.apache.beam.sdk.transforms.ViewTest > testWindowedIterableSideInput FAILED
    java.lang.RuntimeException at ViewTest.java:442

org.apache.beam.sdk.testing.PAssertTest > testContainsInAnyOrderFalse FAILED
    java.lang.AssertionError at PAssertTest.java:467

org.apache.beam.sdk.transforms.ViewTest > testWindowedMapSideInputWithNonDeterministicKeyCoder
FAILED
    java.lang.RuntimeException at ViewTest.java:1144

org.apache.beam.sdk.transforms.ViewTest > testWindowedSideInputFixedToGlobal FAILED
    java.lang.RuntimeException at ViewTest.java:1416

org.apache.beam.sdk.transforms.ViewTest > testMultimapSideInputWithNonDeterministicKeyCoder
FAILED
    java.lang.RuntimeException at ViewTest.java:650

org.apache.beam.sdk.transforms.ViewTest > testEmptyMultimapSideInput FAILED
    java.lang.RuntimeException at ViewTest.java:830

org.apache.beam.sdk.transforms.ParDoTest$StateTests > testValueStateDedup FAILED
    java.lang.RuntimeException at ParDoTest.java:1476

org.apache.beam.sdk.transforms.ViewTest > testCombinedMapSideInput FAILED
    java.lang.RuntimeException at ViewTest.java:1334

org.apache.beam.sdk.transforms.ParDoTest$StateTests > testValueStateFixedWindows FAILED
    java.lang.RuntimeException at ParDoTest.java:1615

org.apache.beam.sdk.transforms.ViewTest > testMultimapSideInputIsImmutable FAILED
    java.lang.RuntimeException at ViewTest.java:913

org.apache.beam.sdk.transforms.ViewTest > testWindowedMultimapAsEntrySetSideInput FAILED
    java.lang.RuntimeException at ViewTest.java:747

org.apache.beam.sdk.transforms.ViewTest > testWindowedMultimapSideInputWithNonDeterministicKeyCoder
FAILED
    java.lang.RuntimeException at ViewTest.java:797

org.apache.beam.sdk.transforms.ViewTest > testMapSideInputWithNonDeterministicKeyCoder
FAILED
    java.lang.RuntimeException at ViewTest.java:1012

org.apache.beam.sdk.transforms.ViewTest > testWindowedSingletonSideInput FAILED
    java.lang.RuntimeException at ViewTest.java:152

org.apache.beam.sdk.transforms.ViewTest > testWindowedMultimapSideInput FAILED
    java.lang.RuntimeException at ViewTest.java:699

org.apache.beam.sdk.transforms.ViewTest > testSideInputWithNullDefault FAILED
    java.lang.RuntimeException at ViewTest.java:1484

org.apache.beam.sdk.transforms.ViewTest > testWindowedListSideInput FAILED
    java.lang.RuntimeException at ViewTest.java:290

org.apache.beam.sdk.transforms.ViewTest > testWindowedMapSideInput FAILED
    java.lang.RuntimeException at ViewTest.java:1056

org.apache.beam.sdk.transforms.ViewTest > testIterableSideInputIsImmutable FAILED
    java.lang.RuntimeException at ViewTest.java:505

org.apache.beam.sdk.transforms.ViewTest > testListSideInputIsImmutable FAILED
    java.lang.RuntimeException at ViewTest.java:368

org.apache.beam.sdk.transforms.ViewTest > testEmptyListSideInput FAILED
    java.lang.RuntimeException at ViewTest.java:319

org.apache.beam.sdk.transforms.ViewTest > testWindowedSideInputFixedToFixed FAILED
    java.lang.RuntimeException at ViewTest.java:1375

org.apache.beam.sdk.transforms.ViewTest > testIterableSideInput FAILED
    java.lang.RuntimeException at ViewTest.java:396

org.apache.beam.sdk.transforms.ViewTest > testEmptyMultimapSideInputWithNonDeterministicKeyCoder
FAILED
    java.lang.RuntimeException at ViewTest.java:864

org.apache.beam.sdk.transforms.ViewTest > testEmptyMapSideInput FAILED
    java.lang.RuntimeException at ViewTest.java:1177

org.apache.beam.sdk.transforms.ViewTest > testMapSideInputIsImmutable FAILED
    java.lang.RuntimeException at ViewTest.java:1301

org.apache.beam.sdk.transforms.ViewTest > testWindowedMapAsEntrySetSideInput FAILED
    java.lang.RuntimeException at ViewTest.java:1099

org.apache.beam.sdk.transforms.ViewTest > testEmptyMapSideInputWithNonDeterministicKeyCoder
FAILED
    java.lang.RuntimeException at ViewTest.java:1211

org.apache.beam.sdk.transforms.ViewTest > testMultimapAsEntrySetSideInput FAILED
    java.lang.RuntimeException at ViewTest.java:581

org.apache.beam.sdk.transforms.ViewTest > testSingletonSideInput FAILED
    java.lang.RuntimeException at ViewTest.java:113

215 tests completed, 203 failed, 2 skipped

> Task :beam-runners-google-cloud-dataflow-java:validatesRunnerLegacyWorkerJava11Test FAILED

FAILURE: Build failed with an exception.

* What went wrong:
Execution failed for task ':beam-runners-google-cloud-dataflow-java:validatesRunnerLegacyWorkerJava11Test'.
> There were failing tests. See the report at: file://<https://builds.apache.org/job/beam_PostCommit_Java11_ValidatesRunner_Dataflow/ws/src/runners/google-cloud-dataflow-java/build/reports/tests/validatesRunnerLegacyWorkerJava11Test/index.html>

* Try:
Run with --stacktrace option to get the stack trace. Run with --info or --debug option to
get more log output. Run with --scan to get full insights.

* Get more help at https://help.gradle.org

Deprecated Gradle features were used in this build, making it incompatible with Gradle 6.0.
Use '--warning-mode all' to show the individual deprecation warnings.
See https://docs.gradle.org/5.2.1/userguide/command_line_interface.html#sec:command_line_warnings

BUILD FAILED in 22m 23s
59 actionable tasks: 58 executed, 1 from cache

Publishing build scan...
https://gradle.com/s/wkl5esy3oe7gk

Build step 'Invoke Gradle script' changed build result to FAILURE
Build step 'Invoke Gradle script' marked build as failure

---------------------------------------------------------------------
To unsubscribe, e-mail: builds-unsubscribe@beam.apache.org
For additional commands, e-mail: builds-help@beam.apache.org


Mime
View raw message