beam-builds mailing list archives

Site index · List index
Message view « Date » · « Thread »
Top « Date » · « Thread »
From Apache Jenkins Server <jenk...@builds.apache.org>
Subject Build failed in Jenkins: beam_PostCommit_Python_Verify #7542
Date Fri, 01 Mar 2019 15:57:02 GMT
See <https://builds.apache.org/job/beam_PostCommit_Python_Verify/7542/display/redirect?page=changes>

Changes:

[github] Merge pull request #7353: [BEAM-4461] Support inner and outer style

------------------------------------------
[...truncated 137.35 KB...]
> Task :beam-sdks-python:hdfsIntegrationTest
++ dirname ./apache_beam/io/hdfs_integration_test/hdfs_integration_test.sh
+ TEST_DIR=./apache_beam/io/hdfs_integration_test
+ ROOT_DIR=./apache_beam/io/hdfs_integration_test/../../../../..
+ CONTEXT_DIR=./apache_beam/io/hdfs_integration_test/../../../../../build/hdfs_integration
+ rm -r ./apache_beam/io/hdfs_integration_test/../../../../../build/hdfs_integration
rm: cannot remove './apache_beam/io/hdfs_integration_test/../../../../../build/hdfs_integration':
No such file or directory
+ true
+ mkdir -p ./apache_beam/io/hdfs_integration_test/../../../../../build/hdfs_integration/sdks
+ cp ./apache_beam/io/hdfs_integration_test/docker-compose.yml ./apache_beam/io/hdfs_integration_test/Dockerfile
./apache_beam/io/hdfs_integration_test/hdfscli.cfg ./apache_beam/io/hdfs_integration_test/hdfs_integration_test.sh
./apache_beam/io/hdfs_integration_test/../../../../../build/hdfs_integration/
+ cp -r ./apache_beam/io/hdfs_integration_test/../../../../../sdks/python ./apache_beam/io/hdfs_integration_test/../../../../../build/hdfs_integration/sdks/
+ cp -r ./apache_beam/io/hdfs_integration_test/../../../../../model ./apache_beam/io/hdfs_integration_test/../../../../../build/hdfs_integration/
++ echo hdfs_IT-jenkins-beam_PostCommit_Python_Verify-7542
+ PROJECT_NAME=hdfs_IT-jenkins-beam_PostCommit_Python_Verify-7542
+ '[' -z jenkins-beam_PostCommit_Python_Verify-7542 ']'
+ COLOR_OPT=--no-ansi
+ COMPOSE_OPT='-p hdfs_IT-jenkins-beam_PostCommit_Python_Verify-7542 --no-ansi'
+ cd ./apache_beam/io/hdfs_integration_test/../../../../../build/hdfs_integration
+ docker network prune --force
+ trap finally EXIT
+ docker-compose -p hdfs_IT-jenkins-beam_PostCommit_Python_Verify-7542 --no-ansi build
namenode uses an image, skipping
datanode uses an image, skipping
Building test
Step 1/9 : FROM python:2
 ---> e49a53a4af5c
Step 2/9 : WORKDIR /app
 ---> Using cache
 ---> 39c2db1ef75c
Step 3/9 : ENV HDFSCLI_CONFIG /app/sdks/python/apache_beam/io/hdfs_integration_test/hdfscli.cfg
 ---> Using cache
 ---> b98faca55ee7
Step 4/9 : RUN pip install --no-cache-dir holdup gsutil
 ---> Using cache
 ---> 86a5f3458108
Step 5/9 : RUN gsutil cp gs://dataflow-samples/shakespeare/kinglear.txt .
 ---> Using cache
 ---> 74b16e40bb49
Step 6/9 : ADD sdks/python /app/sdks/python
 ---> 5e656427f8fc
Removing intermediate container b89ba6ea0ab2
Step 7/9 : ADD model /app/model
 ---> 18dd53503e0c
Removing intermediate container 9a89452e15fb
Step 8/9 : RUN cd sdks/python &&     python setup.py sdist &&     pip install
--no-cache-dir $(ls dist/apache-beam-*.tar.gz | tail -n1)[gcp]
 ---> Running in dff9efeead04
Service 'test' failed to build: grpc: the connection is unavailable
+ finally
+ docker-compose -p hdfs_IT-jenkins-beam_PostCommit_Python_Verify-7542 --no-ansi down
Removing network hdfs_it-jenkins-beam_postcommit_python_verify-7542_test_net
Network hdfs_it-jenkins-beam_postcommit_python_verify-7542_test_net not found.

real	0m0.225s
user	0m0.174s
sys	0m0.044s

> Task :beam-sdks-python:hdfsIntegrationTest FAILED

> Task :beam-sdks-python:postCommitIT


###########################################################################
# Build pipeline options if not provided in --pipeline_opts from commandline

if [[ -z $PIPELINE_OPTS ]]; then

  # Check that the script is running in a known directory.
  if [[ $PWD != *sdks/python* ]]; then
    echo 'Unable to locate Apache Beam Python SDK root directory'
    exit 1
  fi

  # Go to the Apache Beam Python SDK root
  if [[ "*sdks/python" != $PWD ]]; then
    cd $(pwd | sed 's/sdks\/python.*/sdks\/python/')
  fi

  # Create a tarball if not exists
  if [[ $(find ${SDK_LOCATION}) ]]; then
    SDK_LOCATION=$(find ${SDK_LOCATION})
  else
    python setup.py -q sdist
    SDK_LOCATION=$(find dist/apache-beam-*.tar.gz)
  fi

  # Install test dependencies for ValidatesRunner tests.
  echo "pyhamcrest" > postcommit_requirements.txt
  echo "mock" >> postcommit_requirements.txt

  # Options used to run testing pipeline on Cloud Dataflow Service. Also used for
  # running on DirectRunner (some options ignored).
  opts=(
    "--runner=$RUNNER"
    "--project=$PROJECT"
    "--staging_location=$GCS_LOCATION/staging-it"
    "--temp_location=$GCS_LOCATION/temp-it"
    "--output=$GCS_LOCATION/py-it-cloud/output"
    "--sdk_location=$SDK_LOCATION"
    "--requirements_file=postcommit_requirements.txt"
    "--num_workers=$NUM_WORKERS"
    "--sleep_secs=$SLEEP_SECS"
  )

  # Add --streaming if provided
  if [[ "$STREAMING" = true ]]; then
    opts+=("--streaming")
  fi

  # Add --dataflow_worker_jar if provided
  if [[ ! -z "$WORKER_JAR" ]]; then
    opts+=("--dataflow_worker_jar=$WORKER_JAR")
  fi

  if [[ ! -z "$KMS_KEY_NAME" ]]; then
    opts+=(
      "--kms_key_name=$KMS_KEY_NAME"
      "--dataflow_kms_key=$KMS_KEY_NAME"
    )
  fi

  PIPELINE_OPTS=$(IFS=" " ; echo "${opts[*]}")

fi
pwd | sed 's/sdks\/python.*/sdks\/python/'
find ${SDK_LOCATION}
find ${SDK_LOCATION}
IFS=" " ; echo "${opts[*]}"

###########################################################################
# Run tests and validate that jobs finish successfully.

echo ">>> RUNNING integration tests with pipeline options: $PIPELINE_OPTS"
python setup.py nosetests \
  --test-pipeline-options="$PIPELINE_OPTS" \
  $TEST_OPTS
>>> RUNNING integration tests with pipeline options: --runner=TestDataflowRunner
--project=apache-beam-testing --staging_location=gs://temp-storage-for-end-to-end-tests/staging-it
--temp_location=gs://temp-storage-for-end-to-end-tests/temp-it --output=gs://temp-storage-for-end-to-end-tests/py-it-cloud/output
--sdk_location=build/apache-beam.tar.gz --requirements_file=postcommit_requirements.txt --num_workers=1
--sleep_secs=20 --kms_key_name=projects/apache-beam-testing/locations/global/keyRings/beam-it/cryptoKeys/test
--dataflow_kms_key=projects/apache-beam-testing/locations/global/keyRings/beam-it/cryptoKeys/test
<https://builds.apache.org/job/beam_PostCommit_Python_Verify/ws/src/build/gradleenv/1327086738/local/lib/python2.7/site-packages/setuptools/dist.py>:475:
UserWarning: Normalizing '2.12.0.dev' to '2.12.0.dev0'
  normalized_version,
running nosetests
running egg_info
writing requirements to apache_beam.egg-info/requires.txt
writing apache_beam.egg-info/PKG-INFO
writing top-level names to apache_beam.egg-info/top_level.txt
writing dependency_links to apache_beam.egg-info/dependency_links.txt
writing entry points to apache_beam.egg-info/entry_points.txt
reading manifest file 'apache_beam.egg-info/SOURCES.txt'
warning: no files found matching 'README.md'
warning: no files found matching 'NOTICE'
warning: no files found matching 'LICENSE'
reading manifest template 'MANIFEST.in'
writing manifest file 'apache_beam.egg-info/SOURCES.txt'
<https://builds.apache.org/job/beam_PostCommit_Python_Verify/ws/src/sdks/python/apache_beam/examples/cookbook/bigquery_tornadoes.py>:90:
BeamDeprecationWarning: options is deprecated since First stable release. References to <pipeline>.options
will not be supported
  if 'temp_location' in p.options.get_all_options():
<https://builds.apache.org/job/beam_PostCommit_Python_Verify/ws/src/sdks/python/apache_beam/io/gcp/bigquery.py>:835:
BeamDeprecationWarning: options is deprecated since First stable release. References to <pipeline>.options
will not be supported
  standard_options = p.options.view_as(StandardOptions)
<https://builds.apache.org/job/beam_PostCommit_Python_Verify/ws/src/sdks/python/apache_beam/io/gcp/bigquery.py>:835:
BeamDeprecationWarning: options is deprecated since First stable release. References to <pipeline>.options
will not be supported
  standard_options = p.options.view_as(StandardOptions)
<https://builds.apache.org/job/beam_PostCommit_Python_Verify/ws/src/sdks/python/apache_beam/io/gcp/bigquery.py>:835:
BeamDeprecationWarning: options is deprecated since First stable release. References to <pipeline>.options
will not be supported
  standard_options = p.options.view_as(StandardOptions)
<https://builds.apache.org/job/beam_PostCommit_Python_Verify/ws/src/sdks/python/apache_beam/io/gcp/bigquery.py>:835:
BeamDeprecationWarning: options is deprecated since First stable release. References to <pipeline>.options
will not be supported
  standard_options = p.options.view_as(StandardOptions)
test_autocomplete_it (apache_beam.examples.complete.autocomplete_test.AutocompleteTest) ...
ok
test_bigquery_tornadoes_it (apache_beam.examples.cookbook.bigquery_tornadoes_it_test.BigqueryTornadoesIT)
... ok
test_datastore_wordcount_it (apache_beam.examples.cookbook.datastore_wordcount_it_test.DatastoreWordCountIT)
... ok
test_leader_board_it (apache_beam.examples.complete.game.leader_board_it_test.LeaderBoardIT)
... ok
test_game_stats_it (apache_beam.examples.complete.game.game_stats_it_test.GameStatsIT) ...
ok
test_streaming_wordcount_it (apache_beam.examples.streaming_wordcount_it_test.StreamingWordCountIT)
... ok
test_wordcount_fnapi_it (apache_beam.examples.wordcount_it_test.WordCountIT) ... ok
test_wordcount_it (apache_beam.examples.wordcount_it_test.WordCountIT) ... ok
test_copy (apache_beam.io.gcp.gcsio_integration_test.GcsIOIntegrationTest) ... ok
test_copy_batch (apache_beam.io.gcp.gcsio_integration_test.GcsIOIntegrationTest) ... ok
test_copy_batch_kms (apache_beam.io.gcp.gcsio_integration_test.GcsIOIntegrationTest) ... ok
test_copy_batch_rewrite_token (apache_beam.io.gcp.gcsio_integration_test.GcsIOIntegrationTest)
... ok
test_copy_kms (apache_beam.io.gcp.gcsio_integration_test.GcsIOIntegrationTest) ... ok
test_copy_rewrite_token (apache_beam.io.gcp.gcsio_integration_test.GcsIOIntegrationTest) ...
ok
test_user_score_it (apache_beam.examples.complete.game.user_score_it_test.UserScoreIT) ...
ok
test_avro_it (apache_beam.examples.fastavro_it_test.FastavroIT) ... ok
test_hourly_team_score_it (apache_beam.examples.complete.game.hourly_team_score_it_test.HourlyTeamScoreIT)
... ok
test_bigquery_read_1M_python (apache_beam.io.gcp.bigquery_io_read_it_test.BigqueryIOReadIT)
... ok
test_parquetio_it (apache_beam.io.parquetio_it_test.TestParquetIT) ... ok
test_multiple_destinations_transform (apache_beam.io.gcp.bigquery_file_loads_test.BigQueryFileLoadsIT)
... ok
test_one_job_fails_all_jobs_fail (apache_beam.io.gcp.bigquery_file_loads_test.BigQueryFileLoadsIT)
... ok
test_streaming_data_only (apache_beam.io.gcp.pubsub_integration_test.PubSubIntegrationTest)
... ok
test_streaming_with_attributes (apache_beam.io.gcp.pubsub_integration_test.PubSubIntegrationTest)
... ok
test_big_query_legacy_sql (apache_beam.io.gcp.big_query_query_to_table_it_test.BigQueryQueryToTableIT)
... ok
test_big_query_new_types (apache_beam.io.gcp.big_query_query_to_table_it_test.BigQueryQueryToTableIT)
... ok
test_big_query_standard_sql (apache_beam.io.gcp.big_query_query_to_table_it_test.BigQueryQueryToTableIT)
... ok
test_big_query_standard_sql_kms_key (apache_beam.io.gcp.big_query_query_to_table_it_test.BigQueryQueryToTableIT)
... SKIP: This test requires BQ Dataflow native source support for KMS, which is not available
yet.
test_datastore_write_limit (apache_beam.io.gcp.datastore_write_it_test.DatastoreWriteIT) ...
ok

----------------------------------------------------------------------
XML: <https://builds.apache.org/job/beam_PostCommit_Python_Verify/ws/src/sdks/python/nosetests.xml>
----------------------------------------------------------------------
Ran 28 tests in 2898.474s

OK (SKIP=1)
Found: https://console.cloud.google.com/dataflow/jobsDetail/locations/us-central1/jobs/2019-03-01_07_08_50-8829645874160604733?project=apache-beam-testing.
Found: https://console.cloud.google.com/dataflow/jobsDetail/locations/us-central1/jobs/2019-03-01_07_16_45-2169356869488623635?project=apache-beam-testing.
Found: https://console.cloud.google.com/dataflow/jobsDetail/locations/us-central1/jobs/2019-03-01_07_24_49-26641457457697919?project=apache-beam-testing.
Found: https://console.cloud.google.com/dataflow/jobsDetail/locations/us-central1/jobs/2019-03-01_07_30_36-17233627131473190229?project=apache-beam-testing.
Found: https://console.cloud.google.com/dataflow/jobsDetail/locations/us-central1/jobs/2019-03-01_07_37_19-15237151246275288811?project=apache-beam-testing.
Found: https://console.cloud.google.com/dataflow/jobsDetail/locations/us-central1/jobs/2019-03-01_07_44_11-7413511125055003045?project=apache-beam-testing.
Found: https://console.cloud.google.com/dataflow/jobsDetail/locations/us-central1/jobs/2019-03-01_07_50_39-17338214747680463594?project=apache-beam-testing.
Found: https://console.cloud.google.com/dataflow/jobsDetail/locations/us-central1/jobs/2019-03-01_07_08_53-18020680727195202988?project=apache-beam-testing.
Found: https://console.cloud.google.com/dataflow/jobsDetail/locations/us-central1/jobs/2019-03-01_07_23_31-14841512479027936994?project=apache-beam-testing.
Found: https://console.cloud.google.com/dataflow/jobsDetail/locations/us-central1/jobs/2019-03-01_07_30_34-17841645644890990735?project=apache-beam-testing.
Found: https://console.cloud.google.com/dataflow/jobsDetail/locations/us-central1/jobs/2019-03-01_07_08_52-12212945565076245510?project=apache-beam-testing.
Found: https://console.cloud.google.com/dataflow/jobsDetail/locations/us-central1/jobs/2019-03-01_07_08_52-16591004738618132630?project=apache-beam-testing.
Found: https://console.cloud.google.com/dataflow/jobsDetail/locations/us-central1/jobs/2019-03-01_07_21_05-16906269812969059455?project=apache-beam-testing.
Found: https://console.cloud.google.com/dataflow/jobsDetail/locations/us-central1/jobs/2019-03-01_07_30_36-9121572224507622935?project=apache-beam-testing.
Found: https://console.cloud.google.com/dataflow/jobsDetail/locations/us-central1/jobs/2019-03-01_07_39_20-10235622098933914335?project=apache-beam-testing.
Found: https://console.cloud.google.com/dataflow/jobsDetail/locations/us-central1/jobs/2019-03-01_07_08_51-4629953016301834000?project=apache-beam-testing.
Found: https://console.cloud.google.com/dataflow/jobsDetail/locations/us-central1/jobs/2019-03-01_07_26_10-8687873431991495318?project=apache-beam-testing.
Found: https://console.cloud.google.com/dataflow/jobsDetail/locations/us-central1/jobs/2019-03-01_07_08_51-13339815738792225529?project=apache-beam-testing.
Found: https://console.cloud.google.com/dataflow/jobsDetail/locations/us-central1/jobs/2019-03-01_07_15_33-13859528976635070969?project=apache-beam-testing.
Found: https://console.cloud.google.com/dataflow/jobsDetail/locations/us-central1/jobs/2019-03-01_07_24_32-15019413721561971049?project=apache-beam-testing.
Found: https://console.cloud.google.com/dataflow/jobsDetail/locations/us-central1/jobs/2019-03-01_07_08_50-8973072240009310697?project=apache-beam-testing.
Found: https://console.cloud.google.com/dataflow/jobsDetail/locations/us-central1/jobs/2019-03-01_07_17_09-6952453657291712081?project=apache-beam-testing.
Found: https://console.cloud.google.com/dataflow/jobsDetail/locations/us-central1/jobs/2019-03-01_07_25_46-4331414747151928112?project=apache-beam-testing.
Found: https://console.cloud.google.com/dataflow/jobsDetail/locations/us-central1/jobs/2019-03-01_07_31_36-297109920759869291?project=apache-beam-testing.
Found: https://console.cloud.google.com/dataflow/jobsDetail/locations/us-central1/jobs/2019-03-01_07_08_51-3582191326161040181?project=apache-beam-testing.
Found: https://console.cloud.google.com/dataflow/jobsDetail/locations/us-central1/jobs/2019-03-01_07_16_23-7187273471276906816?project=apache-beam-testing.

FAILURE: Build failed with an exception.

* Where:
Build file '<https://builds.apache.org/job/beam_PostCommit_Python_Verify/ws/src/sdks/python/build.gradle'>
line: 317

* What went wrong:
Execution failed for task ':beam-sdks-python:hdfsIntegrationTest'.
> Process 'command 'sh'' finished with non-zero exit value 1

* Try:
Run with --stacktrace option to get the stack trace. Run with --info or --debug option to
get more log output. Run with --scan to get full insights.

* Get more help at https://help.gradle.org

Deprecated Gradle features were used in this build, making it incompatible with Gradle 6.0.
Use '--warning-mode all' to show the individual deprecation warnings.
See https://docs.gradle.org/5.2.1/userguide/command_line_interface.html#sec:command_line_warnings

BUILD FAILED in 50m 3s
6 actionable tasks: 6 executed

Publishing build scan...
https://gradle.com/s/vvbjwthmv6h3e

Build step 'Invoke Gradle script' changed build result to FAILURE
Build step 'Invoke Gradle script' marked build as failure

---------------------------------------------------------------------
To unsubscribe, e-mail: builds-unsubscribe@beam.apache.org
For additional commands, e-mail: builds-help@beam.apache.org


Mime
View raw message