beam-builds mailing list archives

Site index · List index
Message view « Date » · « Thread »
Top « Date » · « Thread »
From Apache Jenkins Server <jenk...@builds.apache.org>
Subject Build failed in Jenkins: beam_PostCommit_Java_PVR_Flink_Batch #918
Date Fri, 01 Mar 2019 19:30:28 GMT
See <https://builds.apache.org/job/beam_PostCommit_Java_PVR_Flink_Batch/918/display/redirect?page=changes>

Changes:

[kenn] [BEAM-6554] Adjust Jenkins directory for spotbugs report

------------------------------------------
[...truncated 55.89 KB...]
org.apache.beam.sdk.transforms.ParDoTest$StateTests > testValueStateSimple FAILED
    java.lang.IllegalArgumentException at ParDoTest.java:1426
        Caused by: java.lang.reflect.InvocationTargetException at ParDoTest.java:1426
            Caused by: java.io.IOException at ParDoTest.java:1426
                Caused by: java.net.BindException

org.apache.beam.sdk.transforms.ParDoTest$StateTests > testValueStateTaggedOutput FAILED
    java.lang.IllegalArgumentException at ParDoTest.java:1725
        Caused by: java.lang.reflect.InvocationTargetException at ParDoTest.java:1725
            Caused by: java.io.IOException at ParDoTest.java:1725
                Caused by: java.net.BindException

org.apache.beam.sdk.transforms.ParDoTest$StateTests > testBagStateSideInput FAILED
    java.lang.IllegalArgumentException at ParDoTest.java:2011
        Caused by: java.lang.reflect.InvocationTargetException at ParDoTest.java:2011
            Caused by: java.io.IOException at ParDoTest.java:2011
                Caused by: java.net.BindException

org.apache.beam.sdk.transforms.ParDoTest$StateTests > testCombiningStateParameterSuperclass
FAILED
    java.lang.IllegalArgumentException at ParDoTest.java:1960
        Caused by: java.lang.reflect.InvocationTargetException at ParDoTest.java:1960
            Caused by: java.io.IOException at ParDoTest.java:1960
                Caused by: java.net.BindException

org.apache.beam.sdk.transforms.ParDoTest$StateTests > testCoderInferenceOfList FAILED
    java.lang.IllegalArgumentException at ParDoTest.java:1567
        Caused by: java.lang.reflect.InvocationTargetException at ParDoTest.java:1567
            Caused by: java.io.IOException at ParDoTest.java:1567
                Caused by: java.net.BindException

org.apache.beam.sdk.transforms.ParDoTest$StateTests > testValueStateDedup FAILED
    java.lang.IllegalArgumentException at ParDoTest.java:1476
        Caused by: java.lang.reflect.InvocationTargetException at ParDoTest.java:1476
            Caused by: java.io.IOException at ParDoTest.java:1476
                Caused by: java.net.BindException

org.apache.beam.sdk.transforms.ParDoTest$StateTests > testValueStateFixedWindows FAILED
    java.lang.IllegalArgumentException at ParDoTest.java:1615
        Caused by: java.lang.reflect.InvocationTargetException at ParDoTest.java:1615
            Caused by: java.io.IOException at ParDoTest.java:1615
                Caused by: java.net.BindException

org.apache.beam.sdk.transforms.CombineTest$CombineWithContextTests > testSimpleCombineWithContext
FAILED
    java.lang.IllegalArgumentException at CombineTest.java:965
        Caused by: java.lang.reflect.InvocationTargetException at CombineTest.java:965
            Caused by: java.io.IOException at CombineTest.java:965
                Caused by: java.net.BindException

org.apache.beam.sdk.transforms.CombineTest$CombineWithContextTests > testSimpleCombineWithContextEmpty
FAILED
    java.lang.IllegalArgumentException at CombineTest.java:975
        Caused by: java.lang.reflect.InvocationTargetException at CombineTest.java:975
            Caused by: java.io.IOException at CombineTest.java:975
                Caused by: java.net.BindException

org.apache.beam.sdk.transforms.KeysTest > testKeys FAILED
    java.lang.IllegalArgumentException at KeysTest.java:60
        Caused by: java.lang.reflect.InvocationTargetException at KeysTest.java:60
            Caused by: java.io.IOException at KeysTest.java:60
                Caused by: java.net.BindException

org.apache.beam.sdk.transforms.KeysTest > testKeysEmpty FAILED
    java.lang.IllegalArgumentException at KeysTest.java:73
        Caused by: java.lang.reflect.InvocationTargetException at KeysTest.java:73
            Caused by: java.io.IOException at KeysTest.java:73
                Caused by: java.net.BindException

org.apache.beam.sdk.transforms.KvSwapTest > testKvSwap FAILED
    java.lang.IllegalArgumentException at KvSwapTest.java:77
        Caused by: java.lang.reflect.InvocationTargetException at KvSwapTest.java:77
            Caused by: java.io.IOException at KvSwapTest.java:77
                Caused by: java.net.BindException

org.apache.beam.sdk.transforms.GroupByKeyTest$WindowTests > testGroupByKeyMergingWindows
FAILED
    java.lang.IllegalArgumentException at GroupByKeyTest.java:480
        Caused by: java.lang.reflect.InvocationTargetException at GroupByKeyTest.java:480
            Caused by: java.io.IOException at GroupByKeyTest.java:480
                Caused by: java.net.BindException

org.apache.beam.sdk.transforms.GroupByKeyTest$WindowTests > testGroupByKeyMultipleWindows
FAILED
    java.lang.IllegalArgumentException at GroupByKeyTest.java:452
        Caused by: java.lang.reflect.InvocationTargetException at GroupByKeyTest.java:452
            Caused by: java.io.IOException at GroupByKeyTest.java:452
                Caused by: java.net.BindException

org.apache.beam.sdk.transforms.GroupByKeyTest$WindowTests > testGroupByKeyAndWindows FAILED
    java.lang.IllegalArgumentException at GroupByKeyTest.java:422
        Caused by: java.lang.reflect.InvocationTargetException at GroupByKeyTest.java:422
            Caused by: java.io.IOException at GroupByKeyTest.java:422
                Caused by: java.net.BindException

org.apache.beam.sdk.transforms.GroupByKeyTest$BasicTests > testLargeKeys1MB FAILED
    java.lang.IllegalArgumentException at GroupByKeyTest.java:365
        Caused by: java.lang.reflect.InvocationTargetException at GroupByKeyTest.java:365
            Caused by: java.io.IOException at GroupByKeyTest.java:365
                Caused by: java.net.BindException

org.apache.beam.sdk.transforms.GroupByKeyTest$BasicTests > testTimestampCombinerLatest
FAILED
    java.lang.IllegalArgumentException at GroupByKeyTest.java:290
        Caused by: java.lang.reflect.InvocationTargetException at GroupByKeyTest.java:290
            Caused by: java.io.IOException at GroupByKeyTest.java:290
                Caused by: java.net.BindException

org.apache.beam.sdk.transforms.GroupByKeyTest$BasicTests > testGroupByKeyEmpty FAILED
    java.lang.IllegalArgumentException at GroupByKeyTest.java:145
        Caused by: java.lang.reflect.InvocationTargetException at GroupByKeyTest.java:145
            Caused by: java.io.IOException at GroupByKeyTest.java:145
                Caused by: java.net.BindException

org.apache.beam.sdk.transforms.GroupByKeyTest$BasicTests > testTimestampCombinerEarliest
FAILED
    java.lang.IllegalArgumentException at GroupByKeyTest.java:270
        Caused by: java.lang.reflect.InvocationTargetException at GroupByKeyTest.java:270
            Caused by: java.io.IOException at GroupByKeyTest.java:270
                Caused by: java.net.BindException

org.apache.beam.sdk.transforms.GroupByKeyTest$BasicTests > testGroupByKey FAILED
    java.lang.IllegalArgumentException at GroupByKeyTest.java:128
        Caused by: java.lang.reflect.InvocationTargetException at GroupByKeyTest.java:128
            Caused by: java.io.IOException at GroupByKeyTest.java:128
                Caused by: java.net.BindException

org.apache.beam.sdk.transforms.GroupByKeyTest$BasicTests > testLargeKeys10KB FAILED
    java.lang.IllegalArgumentException at GroupByKeyTest.java:353
        Caused by: java.lang.reflect.InvocationTargetException at GroupByKeyTest.java:353
            Caused by: java.io.IOException at GroupByKeyTest.java:353
                Caused by: java.net.BindException

org.apache.beam.sdk.transforms.GroupByKeyTest$BasicTests > testLargeKeys10MB FAILED
    java.lang.IllegalArgumentException at GroupByKeyTest.java:371
        Caused by: java.lang.reflect.InvocationTargetException at GroupByKeyTest.java:371
            Caused by: java.io.IOException at GroupByKeyTest.java:371
                Caused by: java.net.BindException

org.apache.beam.sdk.transforms.GroupByKeyTest$BasicTests > testGroupByKeyWithBadEqualsHashCode
FAILED
    java.lang.IllegalArgumentException at GroupByKeyTest.java:347
        Caused by: java.lang.reflect.InvocationTargetException at GroupByKeyTest.java:347
            Caused by: java.io.IOException at GroupByKeyTest.java:347
                Caused by: java.net.BindException

org.apache.beam.sdk.transforms.GroupByKeyTest$BasicTests > testLargeKeys100KB FAILED
    java.lang.IllegalArgumentException at GroupByKeyTest.java:359
        Caused by: java.lang.reflect.InvocationTargetException at GroupByKeyTest.java:359
            Caused by: java.io.IOException at GroupByKeyTest.java:359
                Caused by: java.net.BindException

org.apache.beam.sdk.transforms.ImpulseTest > testImpulse FAILED
    java.lang.IllegalArgumentException at ImpulseTest.java:47
        Caused by: java.lang.reflect.InvocationTargetException at ImpulseTest.java:47
            Caused by: java.io.IOException at ImpulseTest.java:47
                Caused by: java.net.BindException

org.apache.beam.sdk.transforms.ReshuffleTest > testReshuffleAfterSessionsAndGroupByKey
FAILED
    java.lang.IllegalArgumentException at ReshuffleTest.java:169
        Caused by: java.lang.reflect.InvocationTargetException at ReshuffleTest.java:169
            Caused by: java.io.IOException at ReshuffleTest.java:169
                Caused by: java.net.BindException

org.apache.beam.sdk.transforms.ReshuffleTest > testReshuffleAfterFixedWindows FAILED
    java.lang.IllegalArgumentException at ReshuffleTest.java:231
        Caused by: java.lang.reflect.InvocationTargetException at ReshuffleTest.java:231
            Caused by: java.io.IOException at ReshuffleTest.java:231
                Caused by: java.net.BindException

org.apache.beam.sdk.transforms.ReshuffleTest > testReshuffleAfterFixedWindowsAndGroupByKey
FAILED
    java.lang.IllegalArgumentException at ReshuffleTest.java:190
        Caused by: java.lang.reflect.InvocationTargetException at ReshuffleTest.java:190
            Caused by: java.io.IOException at ReshuffleTest.java:190
                Caused by: java.net.BindException

org.apache.beam.sdk.transforms.ReshuffleTest > testReshuffleAfterSlidingWindows FAILED
    java.lang.IllegalArgumentException at ReshuffleTest.java:251
        Caused by: java.lang.reflect.InvocationTargetException at ReshuffleTest.java:251
            Caused by: java.io.IOException at ReshuffleTest.java:251
                Caused by: java.net.BindException

org.apache.beam.sdk.transforms.ReshuffleTest > testReshufflePreservesTimestamps FAILED
    java.lang.IllegalArgumentException at ReshuffleTest.java:148
        Caused by: java.lang.reflect.InvocationTargetException at ReshuffleTest.java:148
            Caused by: java.io.IOException at ReshuffleTest.java:148
                Caused by: java.net.BindException

org.apache.beam.sdk.transforms.ReshuffleTest > testReshuffleAfterSlidingWindowsAndGroupByKey
FAILED
    java.lang.IllegalArgumentException at ReshuffleTest.java:211
        Caused by: java.lang.reflect.InvocationTargetException at ReshuffleTest.java:211
            Caused by: java.io.IOException at ReshuffleTest.java:211
                Caused by: java.net.BindException

org.apache.beam.sdk.transforms.ReshuffleTest > testJustReshuffle FAILED
    java.lang.IllegalArgumentException at ReshuffleTest.java:102
        Caused by: java.lang.reflect.InvocationTargetException at ReshuffleTest.java:102
            Caused by: java.io.IOException at ReshuffleTest.java:102
                Caused by: java.net.BindException

org.apache.beam.sdk.transforms.CombineTest$BasicTests > testCombinePerKeyInstanceMethodReference
FAILED
    java.lang.IllegalArgumentException at CombineTest.java:921
        Caused by: java.lang.reflect.InvocationTargetException at CombineTest.java:921
            Caused by: java.io.IOException at CombineTest.java:921
                Caused by: java.net.BindException

org.apache.beam.sdk.transforms.CombineTest$BasicTests > testBasicCombine FAILED
    java.lang.IllegalArgumentException at CombineTest.java:676
        Caused by: java.lang.reflect.InvocationTargetException at CombineTest.java:676
            Caused by: java.io.IOException at CombineTest.java:676
                Caused by: java.net.BindException

org.apache.beam.sdk.transforms.CombineTest$BasicTests > testCombinePerKeyLambda FAILED
    java.lang.IllegalArgumentException at CombineTest.java:907
        Caused by: java.lang.reflect.InvocationTargetException at CombineTest.java:907
            Caused by: java.io.IOException at CombineTest.java:907
                Caused by: java.net.BindException

org.apache.beam.sdk.transforms.CombineTest$BasicTests > testHotKeyCombining FAILED
    java.lang.IllegalArgumentException at CombineTest.java:736
        Caused by: java.lang.reflect.InvocationTargetException at CombineTest.java:736
            Caused by: java.io.IOException at CombineTest.java:736
                Caused by: java.net.BindException

org.apache.beam.sdk.transforms.CombineTest$BasicTests > testSimpleCombineEmpty FAILED
    java.lang.IllegalArgumentException at CombineTest.java:670
        Caused by: java.lang.reflect.InvocationTargetException at CombineTest.java:670
            Caused by: java.io.IOException at CombineTest.java:670
                Caused by: java.net.BindException

195 tests completed, 107 failed, 2 skipped

> Task :beam-runners-flink_2.11-job-server:validatesPortableRunnerBatch FAILED

FAILURE: Build failed with an exception.

* What went wrong:
Execution failed for task ':beam-runners-flink_2.11-job-server:validatesPortableRunnerBatch'.
> There were failing tests. See the report at: file://<https://builds.apache.org/job/beam_PostCommit_Java_PVR_Flink_Batch/ws/src/runners/flink/job-server/build/reports/tests/validatesPortableRunnerBatch/index.html>

* Try:
Run with --stacktrace option to get the stack trace. Run with --info or --debug option to
get more log output. Run with --scan to get full insights.

* Get more help at https://help.gradle.org

Deprecated Gradle features were used in this build, making it incompatible with Gradle 6.0.
Use '--warning-mode all' to show the individual deprecation warnings.
See https://docs.gradle.org/5.2.1/userguide/command_line_interface.html#sec:command_line_warnings

BUILD FAILED in 16m 22s
62 actionable tasks: 41 executed, 21 from cache

Publishing build scan...
https://gradle.com/s/xrmh5jnk3vp7y

Build step 'Invoke Gradle script' changed build result to FAILURE
Build step 'Invoke Gradle script' marked build as failure

---------------------------------------------------------------------
To unsubscribe, e-mail: builds-unsubscribe@beam.apache.org
For additional commands, e-mail: builds-help@beam.apache.org


Mime
View raw message