beam-builds mailing list archives

Site index · List index
Message view « Date » · « Thread »
Top « Date » · « Thread »
From Apache Jenkins Server <jenk...@builds.apache.org>
Subject Build failed in Jenkins: beam_PostCommit_Java_ValidatesRunner_Dataflow #2194
Date Fri, 01 Mar 2019 15:37:39 GMT
See <https://builds.apache.org/job/beam_PostCommit_Java_ValidatesRunner_Dataflow/2194/display/redirect>

------------------------------------------
[...truncated 45.83 KB...]
    java.lang.RuntimeException at FlattenTest.java:162

org.apache.beam.sdk.transforms.CombineTest$BasicTests > testHotKeyCombiningWithAccumulationMode
FAILED
    java.lang.RuntimeException at CombineTest.java:761
        Caused by: com.google.api.client.googleapis.json.GoogleJsonResponseException at CombineTest.java:761

org.apache.beam.sdk.transforms.GroupByKeyTest$BasicTests > testGroupByKeyWithBadEqualsHashCode
FAILED
    java.lang.RuntimeException at GroupByKeyTest.java:347

org.apache.beam.sdk.transforms.GroupByKeyTest$BasicTests > testLargeKeys100KB FAILED
    java.lang.RuntimeException at GroupByKeyTest.java:359
        Caused by: com.google.api.client.googleapis.json.GoogleJsonResponseException at GroupByKeyTest.java:359

org.apache.beam.sdk.transforms.ParDoTest$MultipleInputsAndOutputTests > testParDoWithTaggedOutput
FAILED
    java.lang.RuntimeException at ParDoTest.java:592

org.apache.beam.sdk.transforms.CombineTest$BasicTests > testBasicCombineEmpty FAILED
    java.lang.RuntimeException at CombineTest.java:687
        Caused by: com.google.api.client.googleapis.json.GoogleJsonResponseException at CombineTest.java:687

org.apache.beam.sdk.transforms.ParDoTest$TimerTests > testEventTimeTimerBounded FAILED
    java.lang.RuntimeException at ParDoTest.java:2536

org.apache.beam.sdk.testing.PAssertTest > testIsEqualTo FAILED
    java.lang.RuntimeException at PAssertTest.java:308

org.apache.beam.sdk.transforms.ParDoSchemaTest > testFieldAccessSchemaPipeline FAILED
    java.lang.RuntimeException at ParDoSchemaTest.java:316

org.apache.beam.sdk.transforms.ParDoTest$MultipleInputsAndOutputTests > testMultiOutputParDoWithSideInputsIsCumulative
FAILED
    java.lang.RuntimeException at ParDoTest.java:847

org.apache.beam.sdk.transforms.ParDoTest$BasicTests > testPipelineOptionsParameter FAILED
    java.lang.RuntimeException at ParDoTest.java:544

org.apache.beam.sdk.io.CountingSourceTest > testBoundedSourceSplits FAILED
    java.lang.RuntimeException at CountingSourceTest.java:121

org.apache.beam.sdk.testing.PAssertTest > testEmpty FAILED
    java.lang.RuntimeException at PAssertTest.java:451

org.apache.beam.sdk.transforms.FlattenTest > testFlattenPCollectionsEmpty FAILED
    java.lang.RuntimeException at FlattenTest.java:130

org.apache.beam.sdk.transforms.ParDoSchemaTest > testSimpleSchemaPipeline FAILED
    java.lang.RuntimeException at ParDoSchemaTest.java:90

org.apache.beam.sdk.transforms.ParDoTest$MultipleInputsAndOutputTests > testParDoWithEmptyTaggedOutput
FAILED
    java.lang.RuntimeException at ParDoTest.java:658

org.apache.beam.sdk.transforms.FlattenTest > testFlattenPCollectionsSingletonList FAILED
    java.lang.RuntimeException at FlattenTest.java:104

org.apache.beam.sdk.transforms.FlattenTest > testFlattenPCollections FAILED
    java.lang.RuntimeException at FlattenTest.java:92
        Caused by: com.google.api.client.googleapis.json.GoogleJsonResponseException at FlattenTest.java:92

org.apache.beam.sdk.testing.PAssertTest > testWindowedContainsInAnyOrder FAILED
    java.lang.RuntimeException at PAssertTest.java:441

org.apache.beam.sdk.transforms.ParDoTest$TimerTests > testEventTimeTimerAlignBounded FAILED
    java.lang.RuntimeException at ParDoTest.java:2619

org.apache.beam.sdk.transforms.SplittableDoFnTest > testOutputAfterCheckpointUnbounded
FAILED
    java.lang.RuntimeException at SplittableDoFnTest.java:309

org.apache.beam.sdk.transforms.SplittableDoFnTest > testPairWithIndexWindowedTimestampedBounded
FAILED
    java.lang.RuntimeException at SplittableDoFnTest.java:219
        Caused by: com.google.api.client.googleapis.json.GoogleJsonResponseException at SplittableDoFnTest.java:219

org.apache.beam.sdk.PipelineTest > testIdentityTransform FAILED
    java.lang.RuntimeException at PipelineTest.java:294

org.apache.beam.sdk.transforms.ParDoSchemaTest > testSchemaConversionPipeline FAILED
    java.lang.RuntimeException at ParDoSchemaTest.java:443

org.apache.beam.sdk.testing.PAssertTest > testPAssertEqualsSingletonFalse FAILED
    java.lang.AssertionError at PAssertTest.java:369

org.apache.beam.sdk.PipelineTest > testTupleProjectionTransform FAILED
    java.lang.RuntimeException at PipelineTest.java:316
        Caused by: com.google.api.client.googleapis.json.GoogleJsonResponseException at PipelineTest.java:316

org.apache.beam.sdk.transforms.FlattenTest > testFlattenMultipleCoders FAILED
    java.lang.RuntimeException at FlattenTest.java:184

org.apache.beam.sdk.transforms.ParDoTest$TimerTests > testGbkFollowedByUserTimers FAILED
    java.lang.RuntimeException at ParDoTest.java:2579

org.apache.beam.sdk.testing.PAssertTest > testPAssertEqualsSingletonFalseDefaultReasonString
FAILED
    java.lang.AssertionError at PAssertTest.java:385

org.apache.beam.sdk.PipelineTest > testMultipleApply FAILED
    java.lang.RuntimeException at PipelineTest.java:228

org.apache.beam.sdk.transforms.ParDoSchemaTest > testReadAndWriteWithSchemaRegistry FAILED
    java.lang.RuntimeException at ParDoSchemaTest.java:281

org.apache.beam.sdk.transforms.FlattenTest > testFlattenPCollectionsThenParDo FAILED
    java.lang.RuntimeException at FlattenTest.java:118

org.apache.beam.sdk.transforms.CombineTest$WindowingTests > testSlidingWindowsCombine FAILED
    java.lang.RuntimeException at CombineTest.java:1131

org.apache.beam.sdk.transforms.ParDoSchemaTest > testReadAndWriteMultiOutput FAILED
    java.lang.RuntimeException at ParDoSchemaTest.java:236
        Caused by: com.google.api.client.googleapis.json.GoogleJsonResponseException at ParDoSchemaTest.java:236

org.apache.beam.sdk.testing.PAssertTest > testContainsInAnyOrder FAILED
    java.lang.RuntimeException at PAssertTest.java:396

org.apache.beam.sdk.transforms.FlattenTest > testFlattenMultiplePCollectionsHavingMultipleConsumers
FAILED
    java.lang.RuntimeException at FlattenTest.java:347

org.apache.beam.sdk.transforms.CombineFnsTest > testComposedCombine FAILED
    java.lang.RuntimeException at CombineFnsTest.java:147
        Caused by: com.google.api.client.googleapis.json.GoogleJsonResponseException at CombineFnsTest.java:147

org.apache.beam.sdk.transforms.ParDoTest$TimerTests > testOutOfBoundsEventTimeTimer FAILED
    java.lang.RuntimeException at ParDoTest.java:2906

org.apache.beam.sdk.transforms.CombineFnsTest > testComposedCombineWithContext FAILED
    java.lang.RuntimeException at CombineFnsTest.java:208
        Caused by: com.google.api.client.googleapis.json.GoogleJsonResponseException at CombineFnsTest.java:208

org.apache.beam.sdk.testing.PAssertTest > testContainsInAnyOrderNotSerializable FAILED
    java.lang.RuntimeException at PAssertTest.java:182

org.apache.beam.sdk.transforms.CombineTest$WindowingTests > testSessionsCombine FAILED
    java.lang.RuntimeException at CombineTest.java:1235

org.apache.beam.sdk.transforms.FlattenTest > testFlattenIterables FAILED
    java.lang.RuntimeException at FlattenTest.java:252

org.apache.beam.sdk.transforms.FlattenTest > testFlattenIterablesSets FAILED
    java.lang.RuntimeException at FlattenTest.java:280
        Caused by: com.google.api.client.googleapis.json.GoogleJsonResponseException at FlattenTest.java:280

org.apache.beam.sdk.testing.PAssertTest > testSerializablePredicate FAILED
    java.lang.RuntimeException at PAssertTest.java:203

org.apache.beam.sdk.transforms.ParDoTest$StateTests > testBagStateSideInput FAILED
    java.lang.RuntimeException at ParDoTest.java:2011
        Caused by: com.google.api.client.googleapis.json.GoogleJsonResponseException at ParDoTest.java:2011

org.apache.beam.sdk.testing.PAssertTest > testNotEqualTo FAILED
    java.lang.RuntimeException at PAssertTest.java:355
        Caused by: com.google.api.client.googleapis.json.GoogleJsonResponseException at PAssertTest.java:355

org.apache.beam.sdk.transforms.CombineTest$WindowingTests > testWindowedCombineGloballyAsSingletonView
FAILED
    java.lang.RuntimeException at CombineTest.java:1369

org.apache.beam.sdk.transforms.ParDoTest$TimerTests > testEventTimeTimerMultipleKeys FAILED
    java.lang.RuntimeException at ParDoTest.java:2824

org.apache.beam.sdk.transforms.ParDoTest$MultipleInputsAndOutputTests > testParDoWithSideInputs
FAILED
    java.lang.RuntimeException at ParDoTest.java:737

org.apache.beam.sdk.transforms.ParDoTest$StateTests > testCombiningStateParameterSuperclass
FAILED
    java.lang.RuntimeException at ParDoTest.java:1960

org.apache.beam.sdk.transforms.FlattenTest > testFlattenPCollectionsEmptyThenParDo FAILED
    java.lang.RuntimeException at FlattenTest.java:224

org.apache.beam.sdk.transforms.ParDoTest$TimerTests > testPipelineOptionsParameterOnTimer
FAILED
    java.lang.RuntimeException at ParDoTest.java:3179

org.apache.beam.sdk.testing.PAssertTest > testGlobalWindowContainsInAnyOrder FAILED
    java.lang.RuntimeException at PAssertTest.java:405

org.apache.beam.sdk.transforms.ViewTest > testMapSideInput FAILED
    java.lang.RuntimeException at ViewTest.java:945

org.apache.beam.sdk.transforms.ParDoTest$StateTests > testCoderInferenceOfList FAILED
    java.lang.RuntimeException at ParDoTest.java:1567

org.apache.beam.sdk.transforms.CombineTest$WindowingTests > testCombineGloballyInstanceMethodReference
FAILED
    java.lang.RuntimeException at CombineTest.java:1403

org.apache.beam.sdk.testing.PAssertTest > testEmptyFalseDefaultReasonString FAILED
    java.lang.AssertionError at PAssertTest.java:500

org.apache.beam.sdk.transforms.ParDoTest$StateTests > testValueStateDedup FAILED
    java.lang.RuntimeException at ParDoTest.java:1476

org.apache.beam.sdk.testing.PAssertTest > testAssertionSiteIsCapturedWithoutMessage FAILED
    java.lang.AssertionError at PAssertTest.java:541

org.apache.beam.sdk.transforms.ParDoTest$MultipleInputsAndOutputTests > testParDoWithSideInputsIsCumulative
FAILED
    java.lang.RuntimeException at ParDoTest.java:771
        Caused by: com.google.api.client.googleapis.json.GoogleJsonResponseException at ParDoTest.java:771

org.apache.beam.sdk.transforms.ViewTest > testWindowedSideInputFixedToFixedWithDefault
FAILED
    java.lang.RuntimeException at ViewTest.java:1455

org.apache.beam.sdk.transforms.CombineTest$WindowingTests > testFixedWindowsCombine FAILED
    java.lang.RuntimeException at CombineTest.java:1030

org.apache.beam.sdk.testing.PAssertTest > testWindowedSerializablePredicate FAILED
    java.lang.RuntimeException at PAssertTest.java:237

org.apache.beam.sdk.testing.PAssertTest > testWindowedIsEqualTo FAILED
    java.lang.RuntimeException at PAssertTest.java:346
        Caused by: com.google.api.client.googleapis.json.GoogleJsonResponseException at PAssertTest.java:346

org.apache.beam.sdk.transforms.ParDoTest$StateTests > testValueStateFixedWindows FAILED
    java.lang.RuntimeException at ParDoTest.java:1615
        Caused by: com.google.api.client.googleapis.json.GoogleJsonResponseException at ParDoTest.java:1615

org.apache.beam.sdk.testing.PAssertTest > testContainsInAnyOrderFalse FAILED
    java.lang.AssertionError at PAssertTest.java:467

org.apache.beam.sdk.transforms.SplittableDoFnTest > testPairWithIndexWindowedTimestampedUnbounded
FAILED
    java.lang.RuntimeException at SplittableDoFnTest.java:219

org.apache.beam.sdk.transforms.SplittableDoFnTest > testPairWithIndexBasicBounded FAILED
    java.lang.RuntimeException at SplittableDoFnTest.java:152
        Caused by: com.google.api.client.googleapis.json.GoogleJsonResponseException at SplittableDoFnTest.java:152

org.apache.beam.sdk.transforms.SplittableDoFnTest > testOutputAfterCheckpointBounded FAILED
    java.lang.RuntimeException at SplittableDoFnTest.java:309

215 tests completed, 163 failed, 2 skipped

> Task :beam-runners-google-cloud-dataflow-java:validatesRunnerLegacyWorkerTest FAILED

FAILURE: Build failed with an exception.

* What went wrong:
Execution failed for task ':beam-runners-google-cloud-dataflow-java:validatesRunnerLegacyWorkerTest'.
> There were failing tests. See the report at: file://<https://builds.apache.org/job/beam_PostCommit_Java_ValidatesRunner_Dataflow/ws/src/runners/google-cloud-dataflow-java/build/reports/tests/validatesRunnerLegacyWorkerTest/index.html>

* Try:
Run with --stacktrace option to get the stack trace. Run with --info or --debug option to
get more log output. Run with --scan to get full insights.

* Get more help at https://help.gradle.org

Deprecated Gradle features were used in this build, making it incompatible with Gradle 6.0.
Use '--warning-mode all' to show the individual deprecation warnings.
See https://docs.gradle.org/5.2.1/userguide/command_line_interface.html#sec:command_line_warnings

BUILD FAILED in 1h 57m 48s
59 actionable tasks: 41 executed, 18 from cache

Publishing build scan...
https://gradle.com/s/s5osdm6dyeko6

Build step 'Invoke Gradle script' changed build result to FAILURE
Build step 'Invoke Gradle script' marked build as failure

---------------------------------------------------------------------
To unsubscribe, e-mail: builds-unsubscribe@beam.apache.org
For additional commands, e-mail: builds-help@beam.apache.org


Mime
View raw message