beam-builds mailing list archives

Site index · List index
Message view « Date » · « Thread »
Top « Date » · « Thread »
From Apache Jenkins Server <jenk...@builds.apache.org>
Subject Build failed in Jenkins: beam_PostCommit_Python_Verify #7543
Date Fri, 01 Mar 2019 17:46:05 GMT
See <https://builds.apache.org/job/beam_PostCommit_Python_Verify/7543/display/redirect?page=changes>

Changes:

[ehudm] Allow setting dataflow_endpoint for Python ITs

------------------------------------------
Started by GitHub push by aaltay
[EnvInject] - Loading node environment variables.
Building remotely on beam9 (beam) in workspace <https://builds.apache.org/job/beam_PostCommit_Python_Verify/ws/>
No credentials specified
 > git rev-parse --is-inside-work-tree # timeout=10
Fetching changes from the remote Git repository
 > git config remote.origin.url https://github.com/apache/beam.git # timeout=10
Fetching upstream changes from https://github.com/apache/beam.git
 > git --version # timeout=10
 > git fetch --tags --progress https://github.com/apache/beam.git +refs/heads/*:refs/remotes/origin/*
+refs/pull/${ghprbPullId}/*:refs/remotes/origin/pr/${ghprbPullId}/*
 > git rev-parse origin/master^{commit} # timeout=10
Checking out Revision cf2f35c36355cc4e6805ae7aa56e3933457d83b2 (origin/master)
 > git config core.sparsecheckout # timeout=10
 > git checkout -f cf2f35c36355cc4e6805ae7aa56e3933457d83b2
Commit message: "Merge pull request #7894 from udim/kms-proto"
 > git rev-list --no-walk c41b3c082d924059c393345f4b1e740804d2b877 # timeout=10
Cleaning workspace
 > git rev-parse --verify HEAD # timeout=10
Resetting working tree
 > git reset --hard # timeout=10
 > git clean -fdx # timeout=10
No emails were triggered.
[EnvInject] - Executing scripts and injecting environment variables after the SCM step.
[EnvInject] - Injecting as environment variables the properties content 
SPARK_LOCAL_IP=127.0.0.1

[EnvInject] - Variables injected successfully.
[Gradle] - Launching build.
[src] $ <https://builds.apache.org/job/beam_PostCommit_Python_Verify/ws/src/gradlew>
--continue --max-workers=12 -Dorg.gradle.jvmargs=-Xms2g -Dorg.gradle.jvmargs=-Xmx4g :pythonPostCommit
To honour the JVM settings for this build a new JVM will be forked. Please consider using
the daemon: https://docs.gradle.org/5.2.1/userguide/gradle_daemon.html.
Daemon will be stopped at the end of the build stopping after processing
> Task :buildSrc:compileJava NO-SOURCE
> Task :buildSrc:compileGroovy FROM-CACHE
> Task :buildSrc:pluginDescriptors
> Task :buildSrc:processResources
> Task :buildSrc:classes
> Task :buildSrc:jar
> Task :buildSrc:assemble
> Task :buildSrc:spotlessGroovy
> Task :buildSrc:spotlessGroovyCheck
> Task :buildSrc:spotlessGroovyGradle
> Task :buildSrc:spotlessGroovyGradleCheck
> Task :buildSrc:spotlessCheck
> Task :buildSrc:pluginUnderTestMetadata
> Task :buildSrc:compileTestJava NO-SOURCE
> Task :buildSrc:compileTestGroovy NO-SOURCE
> Task :buildSrc:processTestResources NO-SOURCE
> Task :buildSrc:testClasses UP-TO-DATE
> Task :buildSrc:test NO-SOURCE
> Task :buildSrc:validateTaskProperties FROM-CACHE
> Task :buildSrc:check
> Task :buildSrc:build
Configuration on demand is an incubating feature.

> Task :beam-sdks-python:setupVirtualenv
New python executable in <https://builds.apache.org/job/beam_PostCommit_Python_Verify/ws/src/build/gradleenv/1327086738/bin/python2>
Also creating executable in <https://builds.apache.org/job/beam_PostCommit_Python_Verify/ws/src/build/gradleenv/1327086738/bin/python>
Installing setuptools, pkg_resources, pip, wheel...done.
Running virtualenv with interpreter /usr/bin/python2
DEPRECATION: Python 2.7 will reach the end of its life on January 1st, 2020. Please upgrade
your Python as Python 2.7 won't be maintained after that date. A future version of pip will
drop support for Python 2.7.
Exception:
Traceback (most recent call last):
  File "<https://builds.apache.org/job/beam_PostCommit_Python_Verify/ws/src/build/gradleenv/1327086738/local/lib/python2.7/site-packages/pip/_internal/cli/base_command.py",>
line 179, in main
    status = self.run(options, args)
  File "<https://builds.apache.org/job/beam_PostCommit_Python_Verify/ws/src/build/gradleenv/1327086738/local/lib/python2.7/site-packages/pip/_internal/commands/install.py",>
line 255, in run
    with self._build_session(options) as session:
  File "<https://builds.apache.org/job/beam_PostCommit_Python_Verify/ws/src/build/gradleenv/1327086738/local/lib/python2.7/site-packages/pip/_internal/cli/base_command.py",>
line 93, in _build_session
    insecure_hosts=options.trusted_hosts,
  File "<https://builds.apache.org/job/beam_PostCommit_Python_Verify/ws/src/build/gradleenv/1327086738/local/lib/python2.7/site-packages/pip/_internal/download.py",>
line 344, in __init__
    self.headers["User-Agent"] = user_agent()
  File "<https://builds.apache.org/job/beam_PostCommit_Python_Verify/ws/src/build/gradleenv/1327086738/local/lib/python2.7/site-packages/pip/_internal/download.py",>
line 108, in user_agent
    zip(["name", "version", "id"], distro.linux_distribution()),
  File "<https://builds.apache.org/job/beam_PostCommit_Python_Verify/ws/src/build/gradleenv/1327086738/local/lib/python2.7/site-packages/pip/_vendor/distro.py",>
line 120, in linux_distribution
    return _distro.linux_distribution(full_distribution_name)
  File "<https://builds.apache.org/job/beam_PostCommit_Python_Verify/ws/src/build/gradleenv/1327086738/local/lib/python2.7/site-packages/pip/_vendor/distro.py",>
line 675, in linux_distribution
    self.version(),
  File "<https://builds.apache.org/job/beam_PostCommit_Python_Verify/ws/src/build/gradleenv/1327086738/local/lib/python2.7/site-packages/pip/_vendor/distro.py",>
line 735, in version
    self.lsb_release_attr('release'),
  File "<https://builds.apache.org/job/beam_PostCommit_Python_Verify/ws/src/build/gradleenv/1327086738/local/lib/python2.7/site-packages/pip/_vendor/distro.py",>
line 892, in lsb_release_attr
    return self._lsb_release_info.get(attribute, '')
  File "<https://builds.apache.org/job/beam_PostCommit_Python_Verify/ws/src/build/gradleenv/1327086738/local/lib/python2.7/site-packages/pip/_vendor/distro.py",>
line 550, in __get__
    ret = obj.__dict__[self._fname] = self._f(obj)
  File "<https://builds.apache.org/job/beam_PostCommit_Python_Verify/ws/src/build/gradleenv/1327086738/local/lib/python2.7/site-packages/pip/_vendor/distro.py",>
line 998, in _lsb_release_info
    stdout = subprocess.check_output(cmd, stderr=devnull)
  File "/usr/lib/python2.7/subprocess.py", line 574, in check_output
    raise CalledProcessError(retcode, cmd, output=output)
CalledProcessError: Command '('lsb_release', '-a')' returned non-zero exit status 1
Traceback (most recent call last):
  File "<https://builds.apache.org/job/beam_PostCommit_Python_Verify/ws/src/build/gradleenv/1327086738/bin/pip",>
line 11, in <module>
    sys.exit(main())
  File "<https://builds.apache.org/job/beam_PostCommit_Python_Verify/ws/src/build/gradleenv/1327086738/local/lib/python2.7/site-packages/pip/_internal/__init__.py",>
line 78, in main
    return command.main(cmd_args)
  File "<https://builds.apache.org/job/beam_PostCommit_Python_Verify/ws/src/build/gradleenv/1327086738/local/lib/python2.7/site-packages/pip/_internal/cli/base_command.py",>
line 228, in main
    timeout=min(5, options.timeout)
  File "<https://builds.apache.org/job/beam_PostCommit_Python_Verify/ws/src/build/gradleenv/1327086738/local/lib/python2.7/site-packages/pip/_internal/cli/base_command.py",>
line 93, in _build_session
    insecure_hosts=options.trusted_hosts,
  File "<https://builds.apache.org/job/beam_PostCommit_Python_Verify/ws/src/build/gradleenv/1327086738/local/lib/python2.7/site-packages/pip/_internal/download.py",>
line 344, in __init__
    self.headers["User-Agent"] = user_agent()
  File "<https://builds.apache.org/job/beam_PostCommit_Python_Verify/ws/src/build/gradleenv/1327086738/local/lib/python2.7/site-packages/pip/_internal/download.py",>
line 108, in user_agent
    zip(["name", "version", "id"], distro.linux_distribution()),
  File "<https://builds.apache.org/job/beam_PostCommit_Python_Verify/ws/src/build/gradleenv/1327086738/local/lib/python2.7/site-packages/pip/_vendor/distro.py",>
line 120, in linux_distribution
    return _distro.linux_distribution(full_distribution_name)
  File "<https://builds.apache.org/job/beam_PostCommit_Python_Verify/ws/src/build/gradleenv/1327086738/local/lib/python2.7/site-packages/pip/_vendor/distro.py",>
line 675, in linux_distribution
    self.version(),
  File "<https://builds.apache.org/job/beam_PostCommit_Python_Verify/ws/src/build/gradleenv/1327086738/local/lib/python2.7/site-packages/pip/_vendor/distro.py",>
line 735, in version
    self.lsb_release_attr('release'),
  File "<https://builds.apache.org/job/beam_PostCommit_Python_Verify/ws/src/build/gradleenv/1327086738/local/lib/python2.7/site-packages/pip/_vendor/distro.py",>
line 892, in lsb_release_attr
    return self._lsb_release_info.get(attribute, '')
  File "<https://builds.apache.org/job/beam_PostCommit_Python_Verify/ws/src/build/gradleenv/1327086738/local/lib/python2.7/site-packages/pip/_vendor/distro.py",>
line 550, in __get__
    ret = obj.__dict__[self._fname] = self._f(obj)
  File "<https://builds.apache.org/job/beam_PostCommit_Python_Verify/ws/src/build/gradleenv/1327086738/local/lib/python2.7/site-packages/pip/_vendor/distro.py",>
line 998, in _lsb_release_info
    stdout = subprocess.check_output(cmd, stderr=devnull)
  File "/usr/lib/python2.7/subprocess.py", line 574, in check_output
    raise CalledProcessError(retcode, cmd, output=output)
subprocess.CalledProcessError: Command '('lsb_release', '-a')' returned non-zero exit status
1

> Task :beam-sdks-python:setupVirtualenv FAILED

FAILURE: Build failed with an exception.

* What went wrong:
Execution failed for task ':beam-sdks-python:setupVirtualenv'.
> Process 'command 'sh'' finished with non-zero exit value 1

* Try:
Run with --stacktrace option to get the stack trace. Run with --info or --debug option to
get more log output. Run with --scan to get full insights.

* Get more help at https://help.gradle.org

Deprecated Gradle features were used in this build, making it incompatible with Gradle 6.0.
Use '--warning-mode all' to show the individual deprecation warnings.
See https://docs.gradle.org/5.2.1/userguide/command_line_interface.html#sec:command_line_warnings

BUILD FAILED in 23s
1 actionable task: 1 executed

Publishing build scan...
https://gradle.com/s/wzqz6csju4fe6

Build step 'Invoke Gradle script' changed build result to FAILURE
Build step 'Invoke Gradle script' marked build as failure

---------------------------------------------------------------------
To unsubscribe, e-mail: builds-unsubscribe@beam.apache.org
For additional commands, e-mail: builds-help@beam.apache.org


Mime
View raw message