beam-builds mailing list archives

Site index · List index
Message view « Date » · « Thread »
Top « Date » · « Thread »
From Apache Jenkins Server <jenk...@builds.apache.org>
Subject Build failed in Jenkins: beam_PostCommit_Py_ValCont #2510
Date Fri, 01 Mar 2019 00:34:29 GMT
See <https://builds.apache.org/job/beam_PostCommit_Py_ValCont/2510/display/redirect>

------------------------------------------
Started by timer
[EnvInject] - Loading node environment variables.
Building remotely on beam4 (beam) in workspace /home/jenkins/jenkins-slave/workspace/beam_PostCommit_Py_ValCont
No credentials specified
 > git rev-parse --is-inside-work-tree # timeout=10
Fetching changes from the remote Git repository
 > git config remote.origin.url https://github.com/apache/beam.git # timeout=10
Fetching upstream changes from https://github.com/apache/beam.git
 > git --version # timeout=10
 > git fetch --tags --progress https://github.com/apache/beam.git +refs/heads/*:refs/remotes/origin/*
+refs/pull/${ghprbPullId}/*:refs/remotes/origin/pr/${ghprbPullId}/*
 > git rev-parse origin/master^{commit} # timeout=10
Checking out Revision 2c3be5178ceab5f1767135480d9441264f6dcadc (origin/master)
 > git config core.sparsecheckout # timeout=10
 > git checkout -f 2c3be5178ceab5f1767135480d9441264f6dcadc
Commit message: "Merge pull request #7966 from charlesccychen/allow-36"
 > git rev-list --no-walk 2c3be5178ceab5f1767135480d9441264f6dcadc # timeout=10
Cleaning workspace
 > git rev-parse --verify HEAD # timeout=10
Resetting working tree
 > git reset --hard # timeout=10
 > git clean -fdx # timeout=10
No emails were triggered.
[EnvInject] - Executing scripts and injecting environment variables after the SCM step.
[EnvInject] - Injecting as environment variables the properties content 
SPARK_LOCAL_IP=127.0.0.1

[EnvInject] - Variables injected successfully.
[beam_PostCommit_Py_ValCont] $ /bin/bash -xe /tmp/jenkins454564853664980351.sh
+ cd src
+ bash sdks/python/container/run_validatescontainer.sh
This script must be executed in the root of beam project. Please set LOCAL_PATH, GCS_LOCATION,
and PROJECT as desired.

# Where to store integration test outputs.
GCS_LOCATION=${GCS_LOCATION:-gs://temp-storage-for-end-to-end-tests}

# Project for the container and integration test
PROJECT=${PROJECT:-apache-beam-testing}

# Verify in the root of the repository
test -d sdks/python/container

# Verify docker and gcloud commands exist
command -v docker
/usr/bin/docker
command -v gcloud
/usr/bin/gcloud
docker -v
Docker version 17.05.0-ce, build 89658be
gcloud -v
Google Cloud SDK 191.0.0
alpha 2018.02.23
beta 2018.02.23
bq 2.0.29
core 2018.02.23
gsutil 4.28

# Build the container
TAG=$(date +%Y%m%d-%H%M%S)
date +%Y%m%d-%H%M%S
CONTAINER=us.gcr.io/$PROJECT/$USER/python
echo "Using container $CONTAINER"
Using container us.gcr.io/apache-beam-testing/jenkins/python
./gradlew :beam-sdks-python-container:docker -Pdocker-repository-root=us.gcr.io/$PROJECT/$USER
-Pdocker-tag=$TAG --info
Initialized native services in: /home/jenkins/.gradle/native
To honour the JVM settings for this build a new JVM will be forked. Please consider using
the daemon: https://docs.gradle.org/5.2.1/userguide/gradle_daemon.html.
Starting process 'Gradle build daemon'. Working directory: /home/jenkins/.gradle/daemon/5.2.1
Command: /usr/local/asfpackages/java/jdk1.8.0_191/bin/java -Xss10240k -Dfile.encoding=UTF-8
-Duser.country=US -Duser.language=en -Duser.variant -cp /home/jenkins/.gradle/wrapper/dists/gradle-5.2.1-all/bviwmvmbexq6idcscbicws5me/gradle-5.2.1/lib/gradle-launcher-5.2.1.jar
org.gradle.launcher.daemon.bootstrap.GradleDaemon 5.2.1
Successfully started process 'Gradle build daemon'
An attempt to start the daemon took 0.86 secs.
The client will now receive all logging from the daemon (pid: 21542). The daemon log file:
/home/jenkins/.gradle/daemon/5.2.1/daemon-21542.out.log
Closing daemon's stdin at end of input.
The daemon will no longer process any standard input.
Daemon will be stopped at the end of the build stopping after processing
Using 16 worker leases.
Starting Build
Using local directory build cache for build ':buildSrc' (location = /home/jenkins/.gradle/caches/build-cache-1,
removeUnusedEntriesAfter = 7 days).

> Configure project :buildSrc
Evaluating project ':buildSrc' using build file '/home/jenkins/jenkins-slave/workspace/beam_PostCommit_Py_ValCont/src/buildSrc/build.gradle'.

FAILURE: Build failed with an exception.

* What went wrong:
unable to create new native thread

* Try:
Run with --stacktrace option to get the stack trace. Run with --debug option to get more log
output. Run with --scan to get full insights.

* Get more help at https://help.gradle.org

BUILD FAILED in 3s
FATAL: command execution failed
java.io.EOFException
	at java.io.ObjectInputStream$PeekInputStream.readFully(ObjectInputStream.java:2681)
	at java.io.ObjectInputStream$BlockDataInputStream.readShort(ObjectInputStream.java:3156)
	at java.io.ObjectInputStream.readStreamHeader(ObjectInputStream.java:862)
	at java.io.ObjectInputStream.<init>(ObjectInputStream.java:358)
	at hudson.remoting.ObjectInputStreamEx.<init>(ObjectInputStreamEx.java:49)
	at hudson.remoting.Command.readFrom(Command.java:140)
	at hudson.remoting.Command.readFrom(Command.java:126)
	at hudson.remoting.AbstractSynchronousByteArrayCommandTransport.read(AbstractSynchronousByteArrayCommandTransport.java:36)
	at hudson.remoting.SynchronousCommandTransport$ReaderThread.run(SynchronousCommandTransport.java:63)
Caused: java.io.IOException: Unexpected termination of the channel
	at hudson.remoting.SynchronousCommandTransport$ReaderThread.run(SynchronousCommandTransport.java:77)
Caused: java.io.IOException: Backing channel 'beam4' is disconnected.
	at hudson.remoting.RemoteInvocationHandler.channelOrFail(RemoteInvocationHandler.java:214)
	at hudson.remoting.RemoteInvocationHandler.invoke(RemoteInvocationHandler.java:283)
	at com.sun.proxy.$Proxy140.isAlive(Unknown Source)
	at hudson.Launcher$RemoteLauncher$ProcImpl.isAlive(Launcher.java:1144)
	at hudson.Launcher$RemoteLauncher$ProcImpl.join(Launcher.java:1136)
	at hudson.tasks.CommandInterpreter.join(CommandInterpreter.java:155)
	at hudson.tasks.CommandInterpreter.perform(CommandInterpreter.java:109)
	at hudson.tasks.CommandInterpreter.perform(CommandInterpreter.java:66)
	at hudson.tasks.BuildStepMonitor$1.perform(BuildStepMonitor.java:20)
	at hudson.model.AbstractBuild$AbstractBuildExecution.perform(AbstractBuild.java:744)
	at hudson.model.Build$BuildExecution.build(Build.java:206)
	at hudson.model.Build$BuildExecution.doRun(Build.java:163)
	at hudson.model.AbstractBuild$AbstractBuildExecution.run(AbstractBuild.java:504)
	at hudson.model.Run.execute(Run.java:1810)
	at hudson.model.FreeStyleBuild.run(FreeStyleBuild.java:43)
	at hudson.model.ResourceController.execute(ResourceController.java:97)
	at hudson.model.Executor.run(Executor.java:429)
FATAL: Unable to delete script file /tmp/jenkins454564853664980351.sh
java.io.EOFException
	at java.io.ObjectInputStream$PeekInputStream.readFully(ObjectInputStream.java:2681)
	at java.io.ObjectInputStream$BlockDataInputStream.readShort(ObjectInputStream.java:3156)
	at java.io.ObjectInputStream.readStreamHeader(ObjectInputStream.java:862)
	at java.io.ObjectInputStream.<init>(ObjectInputStream.java:358)
	at hudson.remoting.ObjectInputStreamEx.<init>(ObjectInputStreamEx.java:49)
	at hudson.remoting.Command.readFrom(Command.java:140)
	at hudson.remoting.Command.readFrom(Command.java:126)
	at hudson.remoting.AbstractSynchronousByteArrayCommandTransport.read(AbstractSynchronousByteArrayCommandTransport.java:36)
	at hudson.remoting.SynchronousCommandTransport$ReaderThread.run(SynchronousCommandTransport.java:63)
Caused: java.io.IOException: Unexpected termination of the channel
	at hudson.remoting.SynchronousCommandTransport$ReaderThread.run(SynchronousCommandTransport.java:77)
Caused: hudson.remoting.ChannelClosedException: Channel "unknown": Remote call on beam4 failed.
The channel is closing down or has closed down
	at hudson.remoting.Channel.call(Channel.java:948)
	at hudson.FilePath.act(FilePath.java:1072)
	at hudson.FilePath.act(FilePath.java:1061)
	at hudson.FilePath.delete(FilePath.java:1565)
	at hudson.tasks.CommandInterpreter.perform(CommandInterpreter.java:123)
	at hudson.tasks.CommandInterpreter.perform(CommandInterpreter.java:66)
	at hudson.tasks.BuildStepMonitor$1.perform(BuildStepMonitor.java:20)
	at hudson.model.AbstractBuild$AbstractBuildExecution.perform(AbstractBuild.java:744)
	at hudson.model.Build$BuildExecution.build(Build.java:206)
	at hudson.model.Build$BuildExecution.doRun(Build.java:163)
	at hudson.model.AbstractBuild$AbstractBuildExecution.run(AbstractBuild.java:504)
	at hudson.model.Run.execute(Run.java:1810)
	at hudson.model.FreeStyleBuild.run(FreeStyleBuild.java:43)
	at hudson.model.ResourceController.execute(ResourceController.java:97)
	at hudson.model.Executor.run(Executor.java:429)
Build step 'Execute shell' marked build as failure
ERROR: beam4 is offline; cannot locate JDK 1.8 (latest)

---------------------------------------------------------------------
To unsubscribe, e-mail: builds-unsubscribe@beam.apache.org
For additional commands, e-mail: builds-help@beam.apache.org


Mime
View raw message