beam-builds mailing list archives

Site index · List index
Message view « Date » · « Thread »
Top « Date » · « Thread »
From Apache Jenkins Server <jenk...@builds.apache.org>
Subject Build failed in Jenkins: beam_Release_NightlySnapshot #356
Date Fri, 08 Mar 2019 08:59:14 GMT
See <https://builds.apache.org/job/beam_Release_NightlySnapshot/356/display/redirect?page=changes>

Changes:

[markliu] Update ValidatesContainer test run scripts.

[ttanay100] Fix very minor typo

[juta_staes] [BEAM-6619] [BEAM-6593] Add gcsio integration tests to postcommit

------------------------------------------
[...truncated 4.22 MB...]
Resolving cached golang.org/x/time: commit='LATEST_COMMIT', urls=[https://go.googlesource.com/time]
Resolving cached github.com/cespare/xxhash: commit='LATEST_COMMIT', urls=[https://github.com/cespare/xxhash.git,
git@github.com:cespare/xxhash.git]
Resolving cached github.com/go-kit/kit: commit='LATEST_COMMIT', urls=[https://github.com/go-kit/kit.git,
git@github.com:go-kit/kit.git]
Resolving github.com/nightlyone/lockfile: commit='LATEST_COMMIT', urls=[https://github.com/nightlyone/lockfile.git,
git@github.com:nightlyone/lockfile.git]
Resolving github.com/oklog/ulid: commit='LATEST_COMMIT', urls=[https://github.com/oklog/ulid.git,
git@github.com:oklog/ulid.git]
Resolving cached github.com/pkg/errors: commit='LATEST_COMMIT', urls=[https://github.com/pkg/errors.git,
git@github.com:pkg/errors.git]
Resolving cached github.com/prometheus/client_golang: commit='LATEST_COMMIT', urls=[https://github.com/prometheus/client_golang.git,
git@github.com:prometheus/client_golang.git]
Resolving cached golang.org/x/sync: commit='LATEST_COMMIT', urls=[https://go.googlesource.com/sync]
Resolving cached golang.org/x/sys: commit='LATEST_COMMIT', urls=[https://go.googlesource.com/sys]
Resolving cached gopkg.in/alecthomas/kingpin.v2: commit='LATEST_COMMIT', urls=[https://gopkg.in/alecthomas/kingpin.v2]
Resolving github.com/codegangsta/negroni: commit='LATEST_COMMIT', urls=[https://github.com/codegangsta/negroni.git,
git@github.com:codegangsta/negroni.git]
Resolving github.com/go-martini/martini: commit='LATEST_COMMIT', urls=[https://github.com/go-martini/martini.git,
git@github.com:go-martini/martini.git]
Resolving cached github.com/gorilla/mux: commit='LATEST_COMMIT', urls=[https://github.com/gorilla/mux.git,
git@github.com:gorilla/mux.git]
Resolving cached github.com/julienschmidt/httprouter: commit='LATEST_COMMIT', urls=[https://github.com/julienschmidt/httprouter.git,
git@github.com:julienschmidt/httprouter.git]
Resolving github.com/justinas/alice: commit='LATEST_COMMIT', urls=[https://github.com/justinas/alice.git,
git@github.com:justinas/alice.git]
Resolving github.com/martini-contrib/render: commit='LATEST_COMMIT', urls=[https://github.com/martini-contrib/render.git,
git@github.com:martini-contrib/render.git]
Resolving github.com/zenazn/goji: commit='LATEST_COMMIT', urls=[https://github.com/zenazn/goji.git,
git@github.com:zenazn/goji.git]
Resolving cached github.com/davecgh/go-spew: commit='LATEST_COMMIT', urls=[https://github.com/davecgh/go-spew.git,
git@github.com:davecgh/go-spew.git]
Resolving cached github.com/eapache/go-resiliency: commit='LATEST_COMMIT', urls=[https://github.com/eapache/go-resiliency.git,
git@github.com:eapache/go-resiliency.git]
Resolving cached github.com/eapache/go-xerial-snappy: commit='LATEST_COMMIT', urls=[https://github.com/eapache/go-xerial-snappy.git,
git@github.com:eapache/go-xerial-snappy.git]
Resolving cached github.com/eapache/queue: commit='LATEST_COMMIT', urls=[https://github.com/eapache/queue.git,
git@github.com:eapache/queue.git]
Resolving cached github.com/pierrec/lz4: commit='LATEST_COMMIT', urls=[https://github.com/pierrec/lz4.git,
git@github.com:pierrec/lz4.git]
Resolving cached github.com/rcrowley/go-metrics: commit='LATEST_COMMIT', urls=[https://github.com/rcrowley/go-metrics.git,
git@github.com:rcrowley/go-metrics.git]
Resolving cached github.com/opentracing/opentracing-go: commit='LATEST_COMMIT', urls=[https://github.com/opentracing/opentracing-go.git,
git@github.com:opentracing/opentracing-go.git]
Resolving cached github.com/gogo/protobuf: commit='LATEST_COMMIT', urls=[https://github.com/gogo/protobuf.git,
git@github.com:gogo/protobuf.git]
Resolving cached github.com/opentracing/opentracing-go: commit='LATEST_COMMIT', urls=[https://github.com/opentracing/opentracing-go.git,
git@github.com:opentracing/opentracing-go.git]
Resolving cached golang.org/x/net: commit='LATEST_COMMIT', urls=[https://go.googlesource.com/net]
Resolving cached github.com/VividCortex/gohistogram: commit='LATEST_COMMIT', urls=[https://github.com/VividCortex/gohistogram.git,
git@github.com:VividCortex/gohistogram.git]
Resolving cached github.com/afex/hystrix-go: commit='LATEST_COMMIT', urls=[https://github.com/afex/hystrix-go.git,
git@github.com:afex/hystrix-go.git]
Resolving cached github.com/aws/aws-sdk-go: commit='LATEST_COMMIT', urls=[https://github.com/aws/aws-sdk-go.git,
git@github.com:aws/aws-sdk-go.git]
Resolving cached github.com/aws/aws-sdk-go-v2: commit='LATEST_COMMIT', urls=[https://github.com/aws/aws-sdk-go-v2.git,
git@github.com:aws/aws-sdk-go-v2.git]
Resolving cached github.com/casbin/casbin: commit='LATEST_COMMIT', urls=[https://github.com/casbin/casbin.git,
git@github.com:casbin/casbin.git]
Resolving cached github.com/davecgh/go-spew: commit='LATEST_COMMIT', urls=[https://github.com/davecgh/go-spew.git,
git@github.com:davecgh/go-spew.git]
Resolving cached github.com/dgrijalva/jwt-go: commit='LATEST_COMMIT', urls=[https://github.com/dgrijalva/jwt-go.git,
git@github.com:dgrijalva/jwt-go.git]
Resolving cached github.com/go-logfmt/logfmt: commit='LATEST_COMMIT', urls=[https://github.com/go-logfmt/logfmt.git,
git@github.com:go-logfmt/logfmt.git]
Resolving cached github.com/golang/protobuf: commit='LATEST_COMMIT', urls=[https://github.com/golang/protobuf.git,
git@github.com:golang/protobuf.git]
Resolving cached github.com/gorilla/mux: commit='LATEST_COMMIT', urls=[https://github.com/gorilla/mux.git,
git@github.com:gorilla/mux.git]
Resolving cached github.com/hashicorp/consul: commit='LATEST_COMMIT', urls=[https://github.com/hashicorp/consul.git,
git@github.com:hashicorp/consul.git]
Resolving cached github.com/hudl/fargo: commit='LATEST_COMMIT', urls=[https://github.com/hudl/fargo.git,
git@github.com:hudl/fargo.git]
Resolving cached github.com/influxdata/influxdb1-client: commit='LATEST_COMMIT', urls=[https://github.com/influxdata/influxdb1-client.git,
git@github.com:influxdata/influxdb1-client.git]
Resolving cached github.com/lightstep/lightstep-tracer-go: commit='LATEST_COMMIT', urls=[https://github.com/lightstep/lightstep-tracer-go.git,
git@github.com:lightstep/lightstep-tracer-go.git]
Resolving cached github.com/nats-io/go-nats: commit='LATEST_COMMIT', urls=[https://github.com/nats-io/go-nats.git,
git@github.com:nats-io/go-nats.git]
Resolving cached github.com/oklog/oklog: commit='LATEST_COMMIT', urls=[https://github.com/oklog/oklog.git,
git@github.com:oklog/oklog.git]
Resolving cached github.com/opentracing/opentracing-go: commit='LATEST_COMMIT', urls=[https://github.com/opentracing/opentracing-go.git,
git@github.com:opentracing/opentracing-go.git]
Resolving cached github.com/openzipkin-contrib/zipkin-go-opentracing: commit='LATEST_COMMIT',
urls=[https://github.com/openzipkin-contrib/zipkin-go-opentracing.git, git@github.com:openzipkin-contrib/zipkin-go-opentracing.git]
Resolving cached github.com/openzipkin/zipkin-go: commit='LATEST_COMMIT', urls=[https://github.com/openzipkin/zipkin-go.git,
git@github.com:openzipkin/zipkin-go.git]
Resolving cached github.com/pborman/uuid: commit='LATEST_COMMIT', urls=[https://github.com/pborman/uuid.git,
git@github.com:pborman/uuid.git]
Resolving cached github.com/performancecopilot/speed: commit='LATEST_COMMIT', urls=[https://github.com/performancecopilot/speed.git,
git@github.com:performancecopilot/speed.git]
Resolving cached github.com/pkg/errors: commit='LATEST_COMMIT', urls=[https://github.com/pkg/errors.git,
git@github.com:pkg/errors.git]
Resolving cached github.com/prometheus/client_golang: commit='LATEST_COMMIT', urls=[https://github.com/prometheus/client_golang.git,
git@github.com:prometheus/client_golang.git]
Resolving cached github.com/samuel/go-zookeeper: commit='LATEST_COMMIT', urls=[https://github.com/samuel/go-zookeeper.git,
git@github.com:samuel/go-zookeeper.git]
Resolving cached github.com/sirupsen/logrus: commit='LATEST_COMMIT', urls=[https://github.com/sirupsen/logrus.git,
git@github.com:sirupsen/logrus.git]
Resolving cached github.com/sony/gobreaker: commit='LATEST_COMMIT', urls=[https://github.com/sony/gobreaker.git,
git@github.com:sony/gobreaker.git]
Resolving cached github.com/streadway/amqp: commit='LATEST_COMMIT', urls=[https://github.com/streadway/amqp.git,
git@github.com:streadway/amqp.git]
Resolving cached github.com/streadway/handy: commit='LATEST_COMMIT', urls=[https://github.com/streadway/handy.git,
git@github.com:streadway/handy.git]
Resolving cached go.etcd.io/etcd: commit='LATEST_COMMIT', urls=[https://github.com/etcd-io/etcd]
Resolving cached go.opencensus.io: commit='LATEST_COMMIT', urls=[https://github.com/census-instrumentation/opencensus-go]
Resolving cached golang.org/x/sync: commit='LATEST_COMMIT', urls=[https://go.googlesource.com/sync]
Resolving cached golang.org/x/time: commit='LATEST_COMMIT', urls=[https://go.googlesource.com/time]
Resolving cached golang.org/x/tools: commit='LATEST_COMMIT', urls=[https://go.googlesource.com/tools]
Resolving cached google.golang.org/grpc: commit='LATEST_COMMIT', urls=[https://github.com/grpc/grpc-go]
Resolving cached sourcegraph.com/sourcegraph/appdash: commit='LATEST_COMMIT', urls=[https://github.com/sourcegraph/appdash]
Resolving cached github.com/golang/protobuf: commit='LATEST_COMMIT', urls=[https://github.com/golang/protobuf.git,
git@github.com:golang/protobuf.git]
Resolving cached github.com/prometheus/client_golang: commit='LATEST_COMMIT', urls=[https://github.com/prometheus/client_golang.git,
git@github.com:prometheus/client_golang.git]
Resolving cached golang.org/x/net: commit='LATEST_COMMIT', urls=[https://go.googlesource.com/net]
Resolving cached github.com/cespare/xxhash: commit='LATEST_COMMIT', urls=[https://github.com/cespare/xxhash.git,
git@github.com:cespare/xxhash.git]
Resolving cached github.com/go-kit/kit: commit='LATEST_COMMIT', urls=[https://github.com/go-kit/kit.git,
git@github.com:go-kit/kit.git]
Resolving cached github.com/oklog/ulid: commit='LATEST_COMMIT', urls=[https://github.com/oklog/ulid.git,
git@github.com:oklog/ulid.git]
Resolving cached github.com/pkg/errors: commit='LATEST_COMMIT', urls=[https://github.com/pkg/errors.git,
git@github.com:pkg/errors.git]
Resolving cached github.com/prometheus/client_golang: commit='LATEST_COMMIT', urls=[https://github.com/prometheus/client_golang.git,
git@github.com:prometheus/client_golang.git]
Resolving cached golang.org/x/sync: commit='LATEST_COMMIT', urls=[https://go.googlesource.com/sync]
Resolving cached golang.org/x/sys: commit='LATEST_COMMIT', urls=[https://go.googlesource.com/sys]
Resolving cached gopkg.in/alecthomas/kingpin.v2: commit='LATEST_COMMIT', urls=[https://gopkg.in/alecthomas/kingpin.v2]
Resolving github.com/codegangsta/inject: commit='33e0aa1cb7c019ccc3fbe049a8262a6403d30504',
urls=[https://github.com/codegangsta/inject.git, git@github.com:codegangsta/inject.git]
Resolving cached github.com/go-martini/martini: commit='LATEST_COMMIT', urls=[https://github.com/go-martini/martini.git,
git@github.com:go-martini/martini.git]
Resolving github.com/oxtoacart/bpool: commit='LATEST_COMMIT', urls=[https://github.com/oxtoacart/bpool.git,
git@github.com:oxtoacart/bpool.git]
Resolving github.com/goji/param: commit='LATEST_COMMIT', urls=[https://github.com/goji/param.git,
git@github.com:goji/param.git]
Resolving cached github.com/golang/snappy: commit='LATEST_COMMIT', urls=[https://github.com/golang/snappy.git,
git@github.com:golang/snappy.git]
Resolving cached github.com/pkg/profile: commit='LATEST_COMMIT', urls=[https://github.com/pkg/profile.git,
git@github.com:pkg/profile.git]

> Task :beam-test-tools:resolveTestDependencies
> Task :beam-test-tools:installDependencies
> Task :beam-test-tools:buildLinuxAmd64
> Task :beam-test-tools:goBuild
> Task :beam-test-tools:assemble
> Task :beam-test-tools:goVendor

> Task :beam-test-tools:goTest
Test for github.com/apache/beam/testing/tools finished, 3 completed, 0 failed.

> Task :beam-test-tools:goCover
> Task :beam-test-tools:goVet
> Task :beam-test-tools:gofmt
> Task :beam-test-tools:goCheck
> Task :beam-test-tools:check
> Task :beam-test-tools:build
> Task :beam-vendor-grpc-1_13_1:compileJava NO-SOURCE
> Task :beam-vendor-grpc-1_13_1:processResources NO-SOURCE
> Task :beam-vendor-grpc-1_13_1:classes UP-TO-DATE
> Task :beam-vendor-grpc-1_13_1:jar SKIPPED
> Task :beam-vendor-grpc-1_13_1:shadowJar
> Task :beam-vendor-grpc-1_13_1:assemble
> Task :beam-vendor-grpc-1_13_1:compileTestJava NO-SOURCE
> Task :beam-vendor-grpc-1_13_1:processTestResources NO-SOURCE
> Task :beam-vendor-grpc-1_13_1:testClasses UP-TO-DATE
> Task :beam-vendor-grpc-1_13_1:test NO-SOURCE
> Task :beam-vendor-grpc-1_13_1:validateVendoring
> Task :beam-vendor-grpc-1_13_1:check
> Task :beam-vendor-grpc-1_13_1:build
> Task :beam-vendor-guava-20_0:compileJava NO-SOURCE
> Task :beam-vendor-guava-20_0:processResources NO-SOURCE
> Task :beam-sdks-java-load-tests:check
> Task :beam-sdks-java-load-tests:build
> Task :beam-vendor-guava-20_0:classes UP-TO-DATE
> Task :beam-vendor-guava-20_0:jar SKIPPED
> Task :beam-vendor-guava-20_0:shadowJar
> Task :beam-vendor-guava-20_0:assemble
> Task :beam-vendor-guava-20_0:compileTestJava NO-SOURCE
> Task :beam-vendor-guava-20_0:processTestResources NO-SOURCE
> Task :beam-vendor-guava-20_0:testClasses UP-TO-DATE
> Task :beam-vendor-guava-20_0:test NO-SOURCE
> Task :beam-vendor-guava-20_0:validateVendoring
> Task :beam-vendor-guava-20_0:check
> Task :beam-vendor-guava-20_0:build
> Task :beam-vendor-sdks-java-extensions-protobuf:jar
> Task :beam-vendor-sdks-java-extensions-protobuf:compileTestJava NO-SOURCE
> Task :beam-vendor-sdks-java-extensions-protobuf:processTestResources NO-SOURCE
> Task :beam-vendor-sdks-java-extensions-protobuf:testClasses UP-TO-DATE
> Task :beam-vendor-sdks-java-extensions-protobuf:packageTests
> Task :beam-vendor-sdks-java-extensions-protobuf:assemble
> Task :beam-vendor-sdks-java-extensions-protobuf:analyzeClassesDependencies SKIPPED
> Task :beam-vendor-sdks-java-extensions-protobuf:analyzeTestClassesDependencies SKIPPED
> Task :beam-vendor-sdks-java-extensions-protobuf:analyzeDependencies SKIPPED
> Task :beam-vendor-sdks-java-extensions-protobuf:checkstyleMain NO-SOURCE
> Task :beam-vendor-sdks-java-extensions-protobuf:checkstyleTest NO-SOURCE
> Task :beam-vendor-sdks-java-extensions-protobuf:javadoc NO-SOURCE
> Task :beam-vendor-sdks-java-extensions-protobuf:spotlessJava
> Task :beam-vendor-sdks-java-extensions-protobuf:spotlessJavaCheck
> Task :beam-vendor-sdks-java-extensions-protobuf:spotlessCheck
> Task :beam-vendor-sdks-java-extensions-protobuf:test NO-SOURCE
> Task :beam-vendor-sdks-java-extensions-protobuf:validateShadedJarDoesntLeakNonProjectClasses
> Task :beam-website:assemble UP-TO-DATE
> Task :beam-website:setupBuildDir

> Task :beam-website:buildDockerImage
Sending build context to Docker daemon  26.44MB
Step 1/7 : FROM ruby:2.5
 ---> 8423fe29e329
Step 2/7 : WORKDIR /ruby
 ---> Using cache
 ---> 58725d280b29
Step 3/7 : RUN gem install bundler
 ---> Using cache
 ---> 4738d4891e04
Step 4/7 : ADD Gemfile Gemfile.lock /ruby/
 ---> Using cache
 ---> c3df7e0ce902
Step 5/7 : RUN bundle install --deployment --path $GEM_HOME
 ---> Using cache
 ---> 94ea71137023
Step 6/7 : ENV LC_ALL C.UTF-8
 ---> Using cache
 ---> d16d27134e04
Step 7/7 : CMD sleep 3600
 ---> Using cache
 ---> c684e76d3af1
Successfully built c684e76d3af1
Successfully tagged beam-website:latest

> Task :beam-website:createDockerContainer

> Task :beam-website:startDockerContainer
ad3626bdbbb19e41556c8440705a5e22936fa16ee12c02655c6d66acea461c25

> Task :beam-website:buildLocalWebsite
`/` is not writable.
Bundler will use `/tmp/bundler/home/unknown' as your home directory temporarily.
Configuration file: /repo/website/_config.yml
Configuration file: /repo/website/_config_test.yml
            Source: /repo/website/src
       Destination: generated-local-content
 Incremental build: enabled
      Generating... 
                    done in 14.925 seconds.
 Auto-regeneration: disabled. Use --watch to enable.

> Task :beam-website:testWebsite
`/` is not writable.
Bundler will use `/tmp/bundler/home/unknown' as your home directory temporarily.
Running ["LinkCheck", "ScriptCheck", "ImageCheck", "HtmlCheck"] on ["./generated-local-content"]
on *.html... 



> Task :beam-vendor-sdks-java-extensions-protobuf:spotbugsMain

> Task :beam-website:testWebsite
Checking 889 external links...
Ran on 191 files!


HTML-Proofer finished successfully.

> Task :beam-website:stopAndRemoveDockerContainer
ad3626bdbbb19e41556c8440705a5e22936fa16ee12c02655c6d66acea461c25

> Task :beam-website:buildWebsite
> Task :beam-website:check
> Task :beam-website:build
> Task :release:compileJava NO-SOURCE
> Task :release:compileGroovy FROM-CACHE
> Task :release:processResources NO-SOURCE
> Task :release:classes UP-TO-DATE
> Task :release:jar
> Task :release:assemble
> Task :release:compileTestJava NO-SOURCE
> Task :release:compileTestGroovy NO-SOURCE
> Task :release:processTestResources NO-SOURCE
> Task :release:testClasses UP-TO-DATE
> Task :release:test NO-SOURCE
> Task :release:check UP-TO-DATE
> Task :release:build
> Task :beam-sdks-java-test-utils:check
> Task :beam-sdks-java-test-utils:build
> Task :beam-vendor-sdks-java-extensions-protobuf:check
> Task :beam-vendor-sdks-java-extensions-protobuf:build

FAILURE: Build failed with an exception.

* What went wrong:
Execution failed for task ':beam-runners-google-cloud-dataflow-java:test'.
> There were failing tests. See the report at: file://<https://builds.apache.org/job/beam_Release_NightlySnapshot/ws/src/runners/google-cloud-dataflow-java/build/reports/tests/test/index.html>

* Try:
Run with --stacktrace option to get the stack trace. Run with --info or --debug option to
get more log output. Run with --scan to get full insights.

* Get more help at https://help.gradle.org

Deprecated Gradle features were used in this build, making it incompatible with Gradle 6.0.
Use '--warning-mode all' to show the individual deprecation warnings.
See https://docs.gradle.org/5.2.1/userguide/command_line_interface.html#sec:command_line_warnings

BUILD FAILED in 1h 58m 31s
1059 actionable tasks: 917 executed, 142 from cache

Publishing build scan...
https://gradle.com/s/bixex6njqn46s

Build step 'Invoke Gradle script' changed build result to FAILURE
Build step 'Invoke Gradle script' marked build as failure

---------------------------------------------------------------------
To unsubscribe, e-mail: builds-unsubscribe@beam.apache.org
For additional commands, e-mail: builds-help@beam.apache.org


Mime
View raw message