beam-builds mailing list archives

Site index · List index
Message view « Date » · « Thread »
Top « Date » · « Thread »
From Apache Jenkins Server <jenk...@builds.apache.org>
Subject Build failed in Jenkins: beam_PostCommit_Java11_ValidatesRunner_Direct #159
Date Wed, 27 Mar 2019 21:32:59 GMT
See <https://builds.apache.org/job/beam_PostCommit_Java11_ValidatesRunner_Direct/159/display/redirect?page=changes>

Changes:

[amyrvold] Fix ./gradlew :beam-test-tools:goTest

------------------------------------------
[...truncated 9.51 KB...]
	at java.util.concurrent.ThreadPoolExecutor$Worker.run(ThreadPoolExecutor.java:617)
	at java.lang.Thread.run(Thread.java:748)
	Suppressed: hudson.remoting.Channel$CallSiteStackTrace: Remote call to beam14
		at hudson.remoting.Channel.attachCallSiteStackTrace(Channel.java:1741)
		at hudson.remoting.UserRequest$ExceptionResponse.retrieve(UserRequest.java:357)
		at hudson.remoting.Channel.call(Channel.java:955)
		at org.jenkinsci.plugins.gitclient.RemoteGitImpl$CommandInvocationHandler.execute(RemoteGitImpl.java:146)
		at sun.reflect.GeneratedMethodAccessor1199.invoke(Unknown Source)
		at sun.reflect.DelegatingMethodAccessorImpl.invoke(DelegatingMethodAccessorImpl.java:43)
		at java.lang.reflect.Method.invoke(Method.java:498)
		at org.jenkinsci.plugins.gitclient.RemoteGitImpl$CommandInvocationHandler.invoke(RemoteGitImpl.java:132)
		at com.sun.proxy.$Proxy116.execute(Unknown Source)
		at hudson.plugins.git.GitSCM.fetchFrom(GitSCM.java:892)
		at hudson.plugins.git.GitSCM.retrieveChanges(GitSCM.java:1161)
		at hudson.plugins.git.GitSCM.checkout(GitSCM.java:1192)
		at hudson.scm.SCM.checkout(SCM.java:504)
		at hudson.model.AbstractProject.checkout(AbstractProject.java:1208)
		at hudson.model.AbstractBuild$AbstractBuildExecution.defaultCheckout(AbstractBuild.java:574)
		at jenkins.scm.SCMCheckoutStrategy.checkout(SCMCheckoutStrategy.java:86)
		at hudson.model.AbstractBuild$AbstractBuildExecution.run(AbstractBuild.java:499)
		at hudson.model.Run.execute(Run.java:1810)
		at hudson.model.FreeStyleBuild.run(FreeStyleBuild.java:43)
		at hudson.model.ResourceController.execute(ResourceController.java:97)
		at hudson.model.Executor.run(Executor.java:429)
ERROR: Error fetching remote repo 'origin'
Retrying after 10 seconds
No credentials specified
 > git rev-parse --is-inside-work-tree # timeout=10
Fetching changes from the remote Git repository
 > git config remote.origin.url https://github.com/apache/beam.git # timeout=10
Fetching upstream changes from https://github.com/apache/beam.git
 > git --version # timeout=10
 > git fetch --tags --progress https://github.com/apache/beam.git +refs/heads/*:refs/remotes/origin/*
+refs/pull/${ghprbPullId}/*:refs/remotes/origin/pr/${ghprbPullId}/*
 > git rev-parse origin/master^{commit} # timeout=10
Checking out Revision 352a3d91ad6e710479caa743d8c1b0ac3c70cc26 (origin/master)
 > git config core.sparsecheckout # timeout=10
 > git checkout -f 352a3d91ad6e710479caa743d8c1b0ac3c70cc26
Commit message: "Merge pull request #8155 from alanmyrvold/goFix"
 > git rev-list --no-walk c2c85fbf1ec9d0c73555b4399c4e1d5a127dc111 # timeout=10
Cleaning workspace
 > git rev-parse --verify HEAD # timeout=10
Resetting working tree
 > git reset --hard # timeout=10
 > git clean -fdx # timeout=10
No emails were triggered.
[EnvInject] - Executing scripts and injecting environment variables after the SCM step.
[EnvInject] - Injecting as environment variables the properties content 
SPARK_LOCAL_IP=127.0.0.1

[EnvInject] - Variables injected successfully.
[Gradle] - Launching build.
[src] $ /home/jenkins/jenkins-slave/workspace/beam_PostCommit_Java11_ValidatesRunner_Direct/src/gradlew
-Dorg.gradle.java.home=/home/jenkins/tools/java/latest1.8 :beam-runners-direct-java:shadowJar
:beam-runners-direct-java:shadowTestJar
To honour the JVM settings for this build a new JVM will be forked. Please consider using
the daemon: https://docs.gradle.org/5.2.1/userguide/gradle_daemon.html.
Daemon will be stopped at the end of the build stopping after processing
> Task :buildSrc:compileJava NO-SOURCE
> Task :buildSrc:compileGroovy FROM-CACHE
> Task :buildSrc:pluginDescriptors
> Task :buildSrc:processResources
> Task :buildSrc:classes
> Task :buildSrc:jar
> Task :buildSrc:assemble
> Task :buildSrc:spotlessGroovy
> Task :buildSrc:spotlessGroovyCheck
> Task :buildSrc:spotlessGroovyGradle
> Task :buildSrc:spotlessGroovyGradleCheck
> Task :buildSrc:spotlessCheck
> Task :buildSrc:pluginUnderTestMetadata
> Task :buildSrc:compileTestJava NO-SOURCE
> Task :buildSrc:compileTestGroovy NO-SOURCE
> Task :buildSrc:processTestResources NO-SOURCE
> Task :buildSrc:testClasses UP-TO-DATE
> Task :buildSrc:test NO-SOURCE
> Task :buildSrc:validateTaskProperties FROM-CACHE
> Task :buildSrc:check
> Task :buildSrc:build
Configuration on demand is an incubating feature.
> Task :beam-vendor-sdks-java-extensions-protobuf:processResources NO-SOURCE
> Task :beam-runners-java-fn-execution:processResources NO-SOURCE
> Task :beam-runners-direct-java:processResources NO-SOURCE
> Task :beam-sdks-java-core:generateAvroProtocol NO-SOURCE
> Task :beam-runners-core-construction-java:processResources NO-SOURCE
> Task :beam-runners-local-java-core:processResources NO-SOURCE
> Task :beam-runners-core-java:processResources NO-SOURCE
> Task :beam-sdks-java-fn-execution:processResources NO-SOURCE
> Task :beam-sdks-java-harness:processResources NO-SOURCE
> Task :beam-sdks-java-extensions-google-cloud-platform-core:processResources NO-SOURCE
> Task :beam-sdks-java-core:generateAvroJava NO-SOURCE
> Task :beam-runners-direct-java:processTestResources NO-SOURCE
> Task :beam-runners-core-java:processTestResources NO-SOURCE
> Task :beam-model-job-management:extractProto
> Task :beam-model-fn-execution:extractProto
> Task :beam-model-job-management:processResources
> Task :beam-model-fn-execution:processResources
> Task :beam-sdks-java-core:generateGrammarSource FROM-CACHE
> Task :beam-sdks-java-core:processResources
> Task :beam-sdks-java-core:generateTestAvroProtocol NO-SOURCE
> Task :beam-model-pipeline:extractIncludeProto
> Task :beam-model-pipeline:extractProto
> Task :beam-sdks-java-core:generateTestAvroJava
> Task :beam-sdks-java-core:generateTestGrammarSource NO-SOURCE
> Task :beam-sdks-java-core:processTestResources NO-SOURCE
> Task :beam-model-pipeline:generateProto
> Task :beam-model-pipeline:compileJava FROM-CACHE
> Task :beam-model-pipeline:processResources
> Task :beam-model-pipeline:classes
> Task :beam-model-pipeline:jar
> Task :beam-model-job-management:extractIncludeProto
> Task :beam-model-fn-execution:extractIncludeProto
> Task :beam-model-job-management:generateProto
> Task :beam-model-fn-execution:generateProto
> Task :beam-model-job-management:compileJava FROM-CACHE
> Task :beam-model-job-management:classes
> Task :beam-model-fn-execution:compileJava FROM-CACHE
> Task :beam-model-fn-execution:classes
> Task :beam-model-pipeline:shadowJar
> Task :beam-model-job-management:shadowJar
> Task :beam-model-fn-execution:shadowJar
> Task :beam-sdks-java-core:compileJava FROM-CACHE
> Task :beam-sdks-java-core:classes
> Task :beam-sdks-java-core:shadowJar
> Task :beam-runners-local-java-core:compileJava FROM-CACHE
> Task :beam-runners-local-java-core:classes UP-TO-DATE
> Task :beam-runners-local-java-core:shadowJar
> Task :beam-sdks-java-extensions-google-cloud-platform-core:compileJava FROM-CACHE
> Task :beam-sdks-java-extensions-google-cloud-platform-core:classes UP-TO-DATE
> Task :beam-sdks-java-fn-execution:compileJava FROM-CACHE
> Task :beam-sdks-java-fn-execution:classes UP-TO-DATE
> Task :beam-runners-core-construction-java:compileJava FROM-CACHE
> Task :beam-runners-core-construction-java:classes UP-TO-DATE
> Task :beam-vendor-sdks-java-extensions-protobuf:compileJava FROM-CACHE
> Task :beam-vendor-sdks-java-extensions-protobuf:classes UP-TO-DATE
> Task :beam-sdks-java-fn-execution:shadowJar
> Task :beam-runners-core-construction-java:shadowJar
> Task :beam-sdks-java-core:compileTestJava FROM-CACHE
> Task :beam-sdks-java-core:testClasses UP-TO-DATE
> Task :beam-runners-core-java:compileJava FROM-CACHE
> Task :beam-runners-core-java:classes UP-TO-DATE
> Task :beam-runners-core-java:shadowJar
> Task :beam-vendor-sdks-java-extensions-protobuf:shadowJar
> Task :beam-sdks-java-extensions-google-cloud-platform-core:shadowJar
> Task :beam-sdks-java-harness:compileJava FROM-CACHE
> Task :beam-sdks-java-harness:classes UP-TO-DATE
> Task :beam-sdks-java-harness:jar
> Task :beam-sdks-java-core:shadowTestJar
> Task :beam-runners-core-java:compileTestJava FROM-CACHE
> Task :beam-runners-core-java:testClasses UP-TO-DATE
> Task :beam-runners-core-java:shadowTestJar
> Task :beam-sdks-java-harness:shadowJar
> Task :beam-runners-java-fn-execution:compileJava FROM-CACHE
> Task :beam-runners-java-fn-execution:classes UP-TO-DATE
> Task :beam-runners-java-fn-execution:shadowJar
> Task :beam-runners-direct-java:compileJava FROM-CACHE
> Task :beam-runners-direct-java:classes UP-TO-DATE
> Task :beam-runners-direct-java:shadowJar
> Task :beam-runners-direct-java:compileTestJava FROM-CACHE
> Task :beam-runners-direct-java:testClasses UP-TO-DATE
> Task :beam-runners-direct-java:shadowTestJar

Deprecated Gradle features were used in this build, making it incompatible with Gradle 6.0.
Use '--warning-mode all' to show the individual deprecation warnings.
See https://docs.gradle.org/5.2.1/userguide/command_line_interface.html#sec:command_line_warnings

BUILD SUCCESSFUL in 1m 39s
49 actionable tasks: 32 executed, 17 from cache

Publishing build scan...
https://gradle.com/s/6wfmnf3ft634e

Build step 'Invoke Gradle script' changed build result to SUCCESS
[Gradle] - Launching build.
[src] $ /home/jenkins/jenkins-slave/workspace/beam_PostCommit_Java11_ValidatesRunner_Direct/src/gradlew
-Dorg.gradle.java.home=/home/jenkins/tools/java/latest11 -x shadowJar -x shadowTestJar -x
compileJava -x compileTestJava :beam-runners-direct-java:validatesRunner
To honour the JVM settings for this build a new JVM will be forked. Please consider using
the daemon: https://docs.gradle.org/5.2.1/userguide/gradle_daemon.html.
Daemon will be stopped at the end of the build stopping after processing
> Task :buildSrc:compileJava NO-SOURCE
> Task :buildSrc:compileGroovy FROM-CACHE
> Task :buildSrc:pluginDescriptors UP-TO-DATE
> Task :buildSrc:processResources UP-TO-DATE
> Task :buildSrc:classes UP-TO-DATE
> Task :buildSrc:jar
> Task :buildSrc:assemble
> Task :buildSrc:spotlessGroovy
> Task :buildSrc:spotlessGroovyCheck
> Task :buildSrc:spotlessGroovyGradle
> Task :buildSrc:spotlessGroovyGradleCheck
> Task :buildSrc:spotlessCheck
> Task :buildSrc:pluginUnderTestMetadata
> Task :buildSrc:compileTestJava NO-SOURCE
> Task :buildSrc:compileTestGroovy NO-SOURCE
> Task :buildSrc:processTestResources NO-SOURCE
> Task :buildSrc:testClasses UP-TO-DATE
> Task :buildSrc:test NO-SOURCE
> Task :buildSrc:validateTaskProperties FROM-CACHE
> Task :buildSrc:check
> Task :buildSrc:build
Configuration on demand is an incubating feature.

> Configure project :beam-test-infra-metrics
Applying groovy nature

> Task :beam-runners-core-java:processTestResources NO-SOURCE
> Task :beam-runners-core-construction-java:processTestResources NO-SOURCE
> Task :beam-sdks-java-core:processTestResources NO-SOURCE
> Task :beam-runners-direct-java:processTestResources NO-SOURCE
> Task :beam-runners-core-construction-java:testClasses
> Task :beam-runners-core-java:testClasses
> Task :beam-runners-direct-java:testClasses
> Task :beam-sdks-java-core:testClasses

> Task :beam-runners-direct-java:validatesRunner
WARNING: An illegal reflective access operation has occurred
WARNING: Illegal reflective access by org.apache.beam.vendor.grpc.v1p13p1.com.google.protobuf.UnsafeUtil
(file:/home/jenkins/.gradle/caches/modules-2/files-2.1/org.apache.beam/beam-vendor-grpc-1_13_1/0.2/249a9a576fc6541d87972e2dc24cf11ea8129b8f/beam-vendor-grpc-1_13_1-0.2.jar)
to field java.nio.Buffer.address
WARNING: Please consider reporting this to the maintainers of org.apache.beam.vendor.grpc.v1p13p1.com.google.protobuf.UnsafeUtil
WARNING: Use --illegal-access=warn to enable warnings of further illegal reflective access
operations
WARNING: All illegal access operations will be denied in a future release
[16.187s][warning][os,thread] Failed to start thread - pthread_create failed (EAGAIN) for
attributes: stacksize: 1024k, guardsize: 0k, detached.
FATAL: command execution failed
java.io.IOException: Backing channel 'beam14' is disconnected.
	at hudson.remoting.RemoteInvocationHandler.channelOrFail(RemoteInvocationHandler.java:214)
	at hudson.remoting.RemoteInvocationHandler.invoke(RemoteInvocationHandler.java:283)
	at com.sun.proxy.$Proxy140.isAlive(Unknown Source)
	at hudson.Launcher$RemoteLauncher$ProcImpl.isAlive(Launcher.java:1144)
	at hudson.Launcher$RemoteLauncher$ProcImpl.join(Launcher.java:1136)
	at hudson.Launcher$ProcStarter.join(Launcher.java:470)
	at hudson.plugins.gradle.Gradle.performTask(Gradle.java:332)
	at hudson.plugins.gradle.Gradle.perform(Gradle.java:224)
	at hudson.tasks.BuildStepMonitor$1.perform(BuildStepMonitor.java:20)
	at hudson.model.AbstractBuild$AbstractBuildExecution.perform(AbstractBuild.java:744)
	at hudson.model.Build$BuildExecution.build(Build.java:206)
	at hudson.model.Build$BuildExecution.doRun(Build.java:163)
	at hudson.model.AbstractBuild$AbstractBuildExecution.run(AbstractBuild.java:504)
	at hudson.model.Run.execute(Run.java:1810)
	at hudson.model.FreeStyleBuild.run(FreeStyleBuild.java:43)
	at hudson.model.ResourceController.execute(ResourceController.java:97)
	at hudson.model.Executor.run(Executor.java:429)
Caused by: java.io.IOException: Unexpected termination of the channel
	at hudson.remoting.SynchronousCommandTransport$ReaderThread.run(SynchronousCommandTransport.java:77)
Caused by: java.io.EOFException
	at java.io.ObjectInputStream$PeekInputStream.readFully(ObjectInputStream.java:2681)
	at java.io.ObjectInputStream$BlockDataInputStream.readShort(ObjectInputStream.java:3156)
	at java.io.ObjectInputStream.readStreamHeader(ObjectInputStream.java:862)
	at java.io.ObjectInputStream.<init>(ObjectInputStream.java:358)
	at hudson.remoting.ObjectInputStreamEx.<init>(ObjectInputStreamEx.java:49)
	at hudson.remoting.Command.readFrom(Command.java:140)
	at hudson.remoting.Command.readFrom(Command.java:126)
	at hudson.remoting.AbstractSynchronousByteArrayCommandTransport.read(AbstractSynchronousByteArrayCommandTransport.java:36)
	at hudson.remoting.SynchronousCommandTransport$ReaderThread.run(SynchronousCommandTransport.java:63)
Build step 'Invoke Gradle script' changed build result to FAILURE
Build step 'Invoke Gradle script' marked build as failure
ERROR: beam14 is offline; cannot locate JDK 1.8 (latest)

---------------------------------------------------------------------
To unsubscribe, e-mail: builds-unsubscribe@beam.apache.org
For additional commands, e-mail: builds-help@beam.apache.org


Mime
View raw message