beam-builds mailing list archives

Site index · List index
Message view « Date » · « Thread »
Top « Date » · « Thread »
From Apache Jenkins Server <jenk...@builds.apache.org>
Subject Build failed in Jenkins: beam_Release_NightlySnapshot #362
Date Thu, 14 Mar 2019 09:05:39 GMT
See <https://builds.apache.org/job/beam_Release_NightlySnapshot/362/display/redirect?page=changes>

Changes:

[skpedapudi] Report estimated size as source metadata when splitting.

[robbe.sneyders] Add Python 3.6 tox environment

[ehudm] Make python run_integration_test.sh handle multiple tarballs

[pabloem] Automatically retrieving JDK 11 containers

[robbe.sneyders] Skip failing Python 3.6 tests

[drieber] Use the maxWorkItemCommitBytes value returned in the

[github] Update reviewers in OWNER file for the runners/core-java module

[kcweaver] [BEAM-6811] only depend on spring.io for pentaho

[ehudm] [BEAM-2969] Handle negative AVRO timestamps

[gleb] Fix usage of non-vendored guava in BigTableIO

[pablo] Update Py3 postcommit tests. (#8014)

[github] Update OWNERS

[markliu] [BEAM-6527] Use Gradle to parallel Python tox tests

------------------------------------------
[...truncated 2.81 MB...]
Resolving cached sourcegraph.com/sourcegraph/appdash: commit='LATEST_COMMIT', urls=[https://github.com/sourcegraph/appdash]
Resolving cached github.com/golang/protobuf: commit='LATEST_COMMIT', urls=[https://github.com/golang/protobuf.git, git@github.com:golang/protobuf.git]
Resolving cached github.com/prometheus/client_golang: commit='LATEST_COMMIT', urls=[https://github.com/prometheus/client_golang.git, git@github.com:prometheus/client_golang.git]
Resolving cached golang.org/x/net: commit='LATEST_COMMIT', urls=[https://go.googlesource.com/net]
Resolving cached github.com/cespare/xxhash: commit='LATEST_COMMIT', urls=[https://github.com/cespare/xxhash.git, git@github.com:cespare/xxhash.git]
Resolving cached github.com/go-kit/kit: commit='LATEST_COMMIT', urls=[https://github.com/go-kit/kit.git, git@github.com:go-kit/kit.git]
Resolving cached github.com/oklog/ulid: commit='LATEST_COMMIT', urls=[https://github.com/oklog/ulid.git, git@github.com:oklog/ulid.git]
Resolving cached github.com/pkg/errors: commit='LATEST_COMMIT', urls=[https://github.com/pkg/errors.git, git@github.com:pkg/errors.git]
Resolving cached github.com/prometheus/client_golang: commit='LATEST_COMMIT', urls=[https://github.com/prometheus/client_golang.git, git@github.com:prometheus/client_golang.git]
Resolving cached golang.org/x/sync: commit='LATEST_COMMIT', urls=[https://go.googlesource.com/sync]
Resolving cached golang.org/x/sys: commit='LATEST_COMMIT', urls=[https://go.googlesource.com/sys]
Resolving cached gopkg.in/alecthomas/kingpin.v2: commit='LATEST_COMMIT', urls=[https://gopkg.in/alecthomas/kingpin.v2]
Resolving github.com/codegangsta/inject: commit='33e0aa1cb7c019ccc3fbe049a8262a6403d30504', urls=[https://github.com/codegangsta/inject.git, git@github.com:codegangsta/inject.git]
Resolving cached github.com/go-martini/martini: commit='LATEST_COMMIT', urls=[https://github.com/go-martini/martini.git, git@github.com:go-martini/martini.git]
Resolving github.com/oxtoacart/bpool: commit='LATEST_COMMIT', urls=[https://github.com/oxtoacart/bpool.git, git@github.com:oxtoacart/bpool.git]
Resolving github.com/goji/param: commit='LATEST_COMMIT', urls=[https://github.com/goji/param.git, git@github.com:goji/param.git]
Resolving cached github.com/golang/snappy: commit='LATEST_COMMIT', urls=[https://github.com/golang/snappy.git, git@github.com:golang/snappy.git]
Resolving cached github.com/pkg/profile: commit='LATEST_COMMIT', urls=[https://github.com/pkg/profile.git, git@github.com:pkg/profile.git]
Resolving cached github.com/xdg/stringprep: commit='LATEST_COMMIT', urls=[https://github.com/xdg/stringprep.git, git@github.com:xdg/stringprep.git]
Resolving cached golang.org/x/crypto: commit='LATEST_COMMIT', urls=[https://go.googlesource.com/crypto]
Resolving cached golang.org/x/text: commit='LATEST_COMMIT', urls=[https://go.googlesource.com/text]

> Task :beam-test-tools:resolveTestDependencies
> Task :beam-test-tools:installDependencies
> Task :beam-test-tools:buildLinuxAmd64
> Task :beam-test-tools:goBuild
> Task :beam-test-tools:assemble
> Task :beam-test-tools:goVendor

> Task :beam-test-tools:goTest
Test for github.com/apache/beam/testing/tools finished, 3 completed, 0 failed.

> Task :beam-test-tools:goCover
> Task :beam-test-tools:goVet
> Task :beam-test-tools:gofmt
> Task :beam-test-tools:goCheck
> Task :beam-test-tools:check
> Task :beam-test-tools:build
> Task :beam-vendor-grpc-1_13_1:compileJava NO-SOURCE
> Task :beam-vendor-grpc-1_13_1:processResources NO-SOURCE
> Task :beam-vendor-grpc-1_13_1:classes UP-TO-DATE
> Task :beam-vendor-grpc-1_13_1:jar SKIPPED
> Task :beam-vendor-grpc-1_13_1:shadowJar
> Task :beam-vendor-grpc-1_13_1:assemble
> Task :beam-vendor-grpc-1_13_1:compileTestJava NO-SOURCE
> Task :beam-vendor-grpc-1_13_1:processTestResources NO-SOURCE
> Task :beam-vendor-grpc-1_13_1:testClasses UP-TO-DATE
> Task :beam-vendor-grpc-1_13_1:test NO-SOURCE
> Task :beam-vendor-grpc-1_13_1:validateVendoring
> Task :beam-vendor-grpc-1_13_1:check
> Task :beam-vendor-grpc-1_13_1:build
> Task :beam-vendor-guava-20_0:compileJava NO-SOURCE
> Task :beam-vendor-guava-20_0:processResources NO-SOURCE
> Task :beam-vendor-guava-20_0:classes UP-TO-DATE
> Task :beam-vendor-guava-20_0:jar SKIPPED
> Task :beam-vendor-guava-20_0:shadowJar
> Task :beam-vendor-guava-20_0:assemble
> Task :beam-vendor-guava-20_0:compileTestJava NO-SOURCE
> Task :beam-vendor-guava-20_0:processTestResources NO-SOURCE
> Task :beam-vendor-guava-20_0:testClasses UP-TO-DATE
> Task :beam-vendor-guava-20_0:test NO-SOURCE
> Task :beam-vendor-guava-20_0:validateVendoring
> Task :beam-vendor-guava-20_0:check
> Task :beam-vendor-guava-20_0:build
> Task :beam-vendor-sdks-java-extensions-protobuf:jar
> Task :beam-vendor-sdks-java-extensions-protobuf:compileTestJava NO-SOURCE
> Task :beam-vendor-sdks-java-extensions-protobuf:processTestResources NO-SOURCE
> Task :beam-vendor-sdks-java-extensions-protobuf:testClasses UP-TO-DATE
> Task :beam-vendor-sdks-java-extensions-protobuf:packageTests
> Task :beam-vendor-sdks-java-extensions-protobuf:assemble
> Task :beam-vendor-sdks-java-extensions-protobuf:analyzeClassesDependencies SKIPPED
> Task :beam-vendor-sdks-java-extensions-protobuf:analyzeTestClassesDependencies SKIPPED
> Task :beam-vendor-sdks-java-extensions-protobuf:analyzeDependencies SKIPPED
> Task :beam-sdks-java-io-tika:check
> Task :beam-sdks-java-io-tika:build
> Task :beam-vendor-sdks-java-extensions-protobuf:checkstyleMain NO-SOURCE
> Task :beam-vendor-sdks-java-extensions-protobuf:checkstyleTest NO-SOURCE
> Task :beam-vendor-sdks-java-extensions-protobuf:javadoc NO-SOURCE
> Task :beam-vendor-sdks-java-extensions-protobuf:spotlessJava
> Task :beam-vendor-sdks-java-extensions-protobuf:spotlessJavaCheck
> Task :beam-vendor-sdks-java-extensions-protobuf:spotlessCheck
> Task :beam-vendor-sdks-java-extensions-protobuf:test NO-SOURCE
> Task :beam-vendor-sdks-java-extensions-protobuf:validateShadedJarDoesntLeakNonProjectClasses
> Task :beam-website:assemble UP-TO-DATE
> Task :beam-website:setupBuildDir

> Task :beam-website:buildDockerImage
Sending build context to Docker daemon  26.44MB
Step 1/7 : FROM ruby:2.5
2.5: Pulling from library/ruby
Digest: sha256:ae790cc668ca4dd837399a801fbb235d22769ad3e899f8e1b409490d011ff2ba
Status: Downloaded newer image for ruby:2.5
 ---> 72aaaee1eea4
Step 2/7 : WORKDIR /ruby
 ---> Using cache
 ---> 9f048a7417ed
Step 3/7 : RUN gem install bundler
 ---> Using cache
 ---> f02fb303f82f
Step 4/7 : ADD Gemfile Gemfile.lock /ruby/
 ---> Using cache
 ---> 742b494f861a
Step 5/7 : RUN bundle install --deployment --path $GEM_HOME
 ---> Using cache
 ---> 5cfa8fc1360d
Step 6/7 : ENV LC_ALL C.UTF-8
 ---> Using cache
 ---> e56fde3c5a23
Step 7/7 : CMD sleep 3600
 ---> Using cache
 ---> 1a836e457d60
Successfully built 1a836e457d60
Successfully tagged beam-website:latest

> Task :beam-website:createDockerContainer

> Task :beam-website:startDockerContainer
66c77f3c5cdafd04d31a2d5c5907ad316f3b6af5629c7020a3588c5b2c311e29

> Task :beam-website:buildLocalWebsite
`/` is not writable.
Bundler will use `/tmp/bundler/home/unknown' as your home directory temporarily.
Configuration file: /repo/website/_config.yml
Configuration file: /repo/website/_config_test.yml
            Source: /repo/website/src
       Destination: generated-local-content
 Incremental build: enabled
      Generating... 
                    done in 14.315 seconds.
 Auto-regeneration: disabled. Use --watch to enable.

> Task :beam-website:testWebsite
`/` is not writable.
Bundler will use `/tmp/bundler/home/unknown' as your home directory temporarily.
Running ["ImageCheck", "ScriptCheck", "LinkCheck", "HtmlCheck"] on ["./generated-local-content"] on *.html... 



> Task :beam-vendor-sdks-java-extensions-protobuf:spotbugsMain

> Task :beam-website:testWebsite
Checking 891 external links...
Ran on 191 files!


HTML-Proofer finished successfully.

> Task :beam-website:stopAndRemoveDockerContainer
66c77f3c5cdafd04d31a2d5c5907ad316f3b6af5629c7020a3588c5b2c311e29

> Task :beam-website:buildWebsite
> Task :beam-website:check
> Task :beam-website:build
> Task :release:compileJava NO-SOURCE
> Task :release:compileGroovy FROM-CACHE
> Task :release:processResources NO-SOURCE
> Task :release:classes UP-TO-DATE
> Task :release:jar
> Task :release:assemble
> Task :release:compileTestJava NO-SOURCE
> Task :release:compileTestGroovy NO-SOURCE
> Task :release:processTestResources NO-SOURCE
> Task :release:testClasses UP-TO-DATE
> Task :release:test NO-SOURCE
> Task :release:check UP-TO-DATE
> Task :release:build
> Task :beam-sdks-java-nexmark:check
> Task :beam-sdks-java-nexmark:build
> Task :beam-sdks-java-test-utils:check
> Task :beam-sdks-java-test-utils:build
> Task :beam-vendor-sdks-java-extensions-protobuf:check
> Task :beam-vendor-sdks-java-extensions-protobuf:build

FAILURE: Build completed with 6 failures.

1: Task failed with an exception.
-----------
* What went wrong:
Execution failed for task ':beam-sdks-python-load-tests:sdist'.
> Could not copy file '<https://builds.apache.org/job/beam_Release_NightlySnapshot/ws/src/sdks/python/apache_beam/testing/load_tests/build/srcs/sdks/python/apache_beam/testing/load_tests/build/srcs/sdks/python/apache_beam/testing/load_tests/build/srcs/sdks/python/apache_beam/testing/load_tests/build/srcs/sdks/python/apache_beam/testing/load_tests/build/srcs/sdks/python/apache_beam/testing/load_tests/build/srcs/sdks/python/apache_beam/testing/load_tests/build/srcs/sdks/python/apache_beam/testing/load_tests/build/srcs/sdks/python/apache_beam/testing/load_tests/build/srcs/sdks/python/apache_beam/testing/load_tests/build/srcs/sdks/python/apache_beam/testing/load_tests/build/srcs/sdks/python/apache_beam/testing/load_tests/build/srcs/sdks/python/apache_beam/testing/load_tests/build/srcs/sdks/python/apache_beam/testing/load_tests/build/srcs/sdks/python/apache_beam/testing/load_tests/build/srcs/sdks/python/apache_beam/testing/load_tests/build/srcs/sdks/python/apache_beam/testing/load_tests/build/srcs/sdks/python/apache_beam/testing/load_tests/build/srcs/sdks/python/apache_beam/testing/load_tests/build/srcs/sdks/python/apache_beam/testing/load_tests/build/srcs/sdks/python/apache_beam/testing/load_tests/build/srcs/sdks/python/apache_beam/testing/load_tests/build/srcs/sdks/python/apache_beam/testing/load_tests/build/srcs/sdks/python/apache_beam/testing/load_tests/build/srcs/sdks/python/apache_beam/testing/load_tests/build/srcs/sdks/python/apache_beam/testing/load_tests/build/srcs/sdks/python/apache_beam/testing/load_tests/build/srcs/sdks/python/apache_beam/testing/load_tests/build/srcs/sdks/python/apache_beam/testing/load_tests/build/srcs/sdks/python/apache_beam/testing/load_tests/build/srcs/sdks/python/apache_beam/testing/load_tests/build/srcs/sdks/python/apache_beam/testing/load_tests/build/srcs/sdks/python/apache_beam/testing/load_tests/build/srcs/sdks/python/apache_beam/testing/load_tests/build/srcs/sdks/python/apache_beam/testing/load_tests/build/srcs/sdks/python/apache_beam/testing/load_tests/build/srcs/sdks/python/apache_beam/testing/load_tests/build/srcs/sdks/python/apache_beam/testing/load_tests/build/srcs/sdks/python/apache_beam/testing/load_tests/build/srcs/sdks/python/apache_beam/testing/load_tests/build/srcs/sdks/python/apache_beam/testing/load_tests/build/srcs/sdks/python/apache_beam/testing/load_tests/build/srcs/sdks/python/apache_beam/testing/load_tests/build/srcs/sdks/python/apache_beam/testing/load_tests/build/srcs/sdks/python/apache_beam/testing/load_tests/build/srcs/sdks/python/apache_beam/testing/load_tests/build/srcs/sdks/python/apache_beam/testing/load_tests/build/srcs/sdks/python/apache_beam/testing/load_tests/build/srcs/sdks/python/apache_beam/testing/load_tests/build/srcs/sdks/python/apache_beam/testing/load_tests/build/srcs/sdks/python/apache_beam/testing/load_tests/build/srcs/sdks/python/apache_beam/testing/load_tests/build/srcs/sdks/python/apache_beam/testing/load_tests/build/srcs/sdks/python/apache_beam/testing/load_tests/build/srcs/sdks/python/apache_beam/testing/load_tests/build/srcs/sdks/python/apache_beam/testing/load_tests/build/srcs/sdks/python/apache_beam/testing/load_tests/build/srcs/sdks/python/apache_beam/testing/load_tests/build/srcs/sdks/python/apache_beam/testing/load_tests/build/srcs/sdks/python/apache_beam/testing/load_tests/build/srcs/sdks/python/apache_beam/testing/load_tests/build/srcs/sdks/python/apache_beam/testing/load_tests/build/srcs/sdks/python/apache_beam/testing/load_tests/build/srcs/sdks/python/apache_beam/testing/load_tests/build/srcs/sdks/python/apache_beam/testing/load_tests/build/srcs/sdks/python/apache_beam/testing/load_tests/build/srcs/sdks/python/apache_beam/testing/load_tests/build/srcs/sdks/python/apache_beam/testing/load_tests/build/srcs/sdks/python/apache_beam/testing/load_tests/build/srcs/sdks/python/apache_beam/testing/load_tests/build/srcs/sdks/python/apache_beam/testing/load_tests/build/srcs/sdks/python/container/vendor/go.opencensus.io/exporter/jaeger/internal/gen-go/zipkincore/zipkin_collector-remote/zipkin_collector-remote.go'> to '<https://builds.apache.org/job/beam_Release_NightlySnapshot/ws/src/sdks/python/apache_beam/testing/load_tests/build/srcs/sdks/python/apache_beam/testing/load_tests/build/srcs/sdks/python/apache_beam/testing/load_tests/build/srcs/sdks/python/apache_beam/testing/load_tests/build/srcs/sdks/python/apache_beam/testing/load_tests/build/srcs/sdks/python/apache_beam/testing/load_tests/build/srcs/sdks/python/apache_beam/testing/load_tests/build/srcs/sdks/python/apache_beam/testing/load_tests/build/srcs/sdks/python/apache_beam/testing/load_tests/build/srcs/sdks/python/apache_beam/testing/load_tests/build/srcs/sdks/python/apache_beam/testing/load_tests/build/srcs/sdks/python/apache_beam/testing/load_tests/build/srcs/sdks/python/apache_beam/testing/load_tests/build/srcs/sdks/python/apache_beam/testing/load_tests/build/srcs/sdks/python/apache_beam/testing/load_tests/build/srcs/sdks/python/apache_beam/testing/load_tests/build/srcs/sdks/python/apache_beam/testing/load_tests/build/srcs/sdks/python/apache_beam/testing/load_tests/build/srcs/sdks/python/apache_beam/testing/load_tests/build/srcs/sdks/python/apache_beam/testing/load_tests/build/srcs/sdks/python/apache_beam/testing/load_tests/build/srcs/sdks/python/apache_beam/testing/load_tests/build/srcs/sdks/python/apache_beam/testing/load_tests/build/srcs/sdks/python/apache_beam/testing/load_tests/build/srcs/sdks/python/apache_beam/testing/load_tests/build/srcs/sdks/python/apache_beam/testing/load_tests/build/srcs/sdks/python/apache_beam/testing/load_tests/build/srcs/sdks/python/apache_beam/testing/load_tests/build/srcs/sdks/python/apache_beam/testing/load_tests/build/srcs/sdks/python/apache_beam/testing/load_tests/build/srcs/sdks/python/apache_beam/testing/load_tests/build/srcs/sdks/python/apache_beam/testing/load_tests/build/srcs/sdks/python/apache_beam/testing/load_tests/build/srcs/sdks/python/apache_beam/testing/load_tests/build/srcs/sdks/python/apache_beam/testing/load_tests/build/srcs/sdks/python/apache_beam/testing/load_tests/build/srcs/sdks/python/apache_beam/testing/load_tests/build/srcs/sdks/python/apache_beam/testing/load_tests/build/srcs/sdks/python/apache_beam/testing/load_tests/build/srcs/sdks/python/apache_beam/testing/load_tests/build/srcs/sdks/python/apache_beam/testing/load_tests/build/srcs/sdks/python/apache_beam/testing/load_tests/build/srcs/sdks/python/apache_beam/testing/load_tests/build/srcs/sdks/python/apache_beam/testing/load_tests/build/srcs/sdks/python/apache_beam/testing/load_tests/build/srcs/sdks/python/apache_beam/testing/load_tests/build/srcs/sdks/python/apache_beam/testing/load_tests/build/srcs/sdks/python/apache_beam/testing/load_tests/build/srcs/sdks/python/apache_beam/testing/load_tests/build/srcs/sdks/python/apache_beam/testing/load_tests/build/srcs/sdks/python/apache_beam/testing/load_tests/build/srcs/sdks/python/apache_beam/testing/load_tests/build/srcs/sdks/python/apache_beam/testing/load_tests/build/srcs/sdks/python/apache_beam/testing/load_tests/build/srcs/sdks/python/apache_beam/testing/load_tests/build/srcs/sdks/python/apache_beam/testing/load_tests/build/srcs/sdks/python/apache_beam/testing/load_tests/build/srcs/sdks/python/apache_beam/testing/load_tests/build/srcs/sdks/python/apache_beam/testing/load_tests/build/srcs/sdks/python/apache_beam/testing/load_tests/build/srcs/sdks/python/apache_beam/testing/load_tests/build/srcs/sdks/python/apache_beam/testing/load_tests/build/srcs/sdks/python/apache_beam/testing/load_tests/build/srcs/sdks/python/apache_beam/testing/load_tests/build/srcs/sdks/python/apache_beam/testing/load_tests/build/srcs/sdks/python/apache_beam/testing/load_tests/build/srcs/sdks/python/apache_beam/testing/load_tests/build/srcs/sdks/python/apache_beam/testing/load_tests/build/srcs/sdks/python/apache_beam/testing/load_tests/build/srcs/sdks/python/apache_beam/testing/load_tests/build/srcs/sdks/python/apache_beam/testing/load_tests/build/srcs/sdks/python/apache_beam/testing/load_tests/build/srcs/sdks/python/container/vendor/go.opencensus.io/exporter/jaeger/internal/gen-go/zipkincore/zipkin_collector-remote/zipkin_collector-remote.go'.>

* Try:
Run with --stacktrace option to get the stack trace. Run with --info or --debug option to get more log output. Run with --scan to get full insights.
==============================================================================

2: Task failed with an exception.
-----------
* What went wrong:
Execution failed for task ':beam-sdks-python-test-suites-dataflow:sdist'.
> Could not copy file '<https://builds.apache.org/job/beam_Release_NightlySnapshot/ws/src/sdks/python/apache_beam/testing/load_tests/build/srcs/sdks/python/apache_beam/testing/load_tests/build/srcs/sdks/python/apache_beam/testing/load_tests/build/srcs/sdks/python/apache_beam/testing/load_tests/build/srcs/sdks/python/apache_beam/testing/load_tests/build/srcs/sdks/python/apache_beam/testing/load_tests/build/srcs/sdks/python/apache_beam/testing/load_tests/build/srcs/sdks/python/apache_beam/testing/load_tests/build/srcs/sdks/python/apache_beam/testing/load_tests/build/srcs/sdks/python/apache_beam/testing/load_tests/build/srcs/sdks/python/apache_beam/testing/load_tests/build/srcs/sdks/python/apache_beam/testing/load_tests/build/srcs/sdks/python/apache_beam/testing/load_tests/build/srcs/sdks/python/apache_beam/testing/load_tests/build/srcs/sdks/python/apache_beam/testing/load_tests/build/srcs/sdks/python/apache_beam/testing/load_tests/build/srcs/sdks/python/apache_beam/testing/load_tests/build/srcs/sdks/python/apache_beam/testing/load_tests/build/srcs/sdks/python/apache_beam/testing/load_tests/build/srcs/sdks/python/apache_beam/testing/load_tests/build/srcs/sdks/python/apache_beam/testing/load_tests/build/srcs/sdks/python/apache_beam/testing/load_tests/build/srcs/sdks/python/apache_beam/testing/load_tests/build/srcs/sdks/python/apache_beam/testing/load_tests/build/srcs/sdks/python/apache_beam/testing/load_tests/build/srcs/sdks/python/apache_beam/testing/load_tests/build/srcs/sdks/python/apache_beam/testing/load_tests/build/srcs/sdks/python/apache_beam/testing/load_tests/build/srcs/sdks/python/apache_beam/testing/load_tests/build/srcs/sdks/python/apache_beam/testing/load_tests/build/srcs/sdks/python/apache_beam/testing/load_tests/build/srcs/sdks/python/apache_beam/testing/load_tests/build/srcs/sdks/python/apache_beam/testing/load_tests/build/srcs/sdks/python/apache_beam/testing/load_tests/build/srcs/sdks/python/apache_beam/testing/load_tests/build/srcs/sdks/python/apache_beam/testing/load_tests/build/srcs/sdks/python/apache_beam/testing/load_tests/build/srcs/sdks/python/apache_beam/testing/load_tests/build/srcs/sdks/python/apache_beam/testing/load_tests/build/srcs/sdks/python/apache_beam/testing/load_tests/build/srcs/sdks/python/apache_beam/testing/load_tests/build/srcs/sdks/python/apache_beam/testing/load_tests/build/srcs/sdks/python/apache_beam/testing/load_tests/build/srcs/sdks/python/apache_beam/testing/load_tests/build/srcs/sdks/python/apache_beam/testing/load_tests/build/srcs/sdks/python/apache_beam/testing/load_tests/build/srcs/sdks/python/apache_beam/testing/load_tests/build/srcs/sdks/python/apache_beam/testing/load_tests/build/srcs/sdks/python/apache_beam/testing/load_tests/build/srcs/sdks/python/apache_beam/testing/load_tests/build/srcs/sdks/python/apache_beam/testing/load_tests/build/srcs/sdks/python/apache_beam/testing/load_tests/build/srcs/sdks/python/apache_beam/testing/load_tests/build/srcs/sdks/python/apache_beam/testing/load_tests/build/srcs/sdks/python/apache_beam/testing/load_tests/build/srcs/sdks/python/apache_beam/testing/load_tests/build/srcs/sdks/python/apache_beam/testing/load_tests/build/srcs/sdks/python/apache_beam/testing/load_tests/build/srcs/sdks/python/apache_beam/testing/load_tests/build/srcs/sdks/python/apache_beam/testing/load_tests/build/srcs/sdks/python/apache_beam/testing/load_tests/build/srcs/sdks/python/apache_beam/testing/load_tests/build/srcs/sdks/python/apache_beam/testing/load_tests/build/srcs/sdks/python/apache_beam/testing/load_tests/build/srcs/sdks/python/apache_beam/testing/load_tests/build/srcs/sdks/python/apache_beam/testing/load_tests/build/srcs/sdks/python/apache_beam/testing/load_tests/build/srcs/sdks/python/apache_beam/testing/load_tests/build/srcs/sdks/python/apache_beam/testing/load_tests/build/srcs/sdks/python/apache_beam/testing/load_tests/build/srcs/sdks/python/apache_beam/testing/load_tests/build/srcs/sdks/python/container/vendor/go.opencensus.io/exporter/jaeger/internal/gen-go/baggage/baggage_restriction_manager-remote/baggage_restriction_manager-remote.go'> to '<https://builds.apache.org/job/beam_Release_NightlySnapshot/ws/src/sdks/python/test-suites/dataflow/build/srcs/sdks/python/apache_beam/testing/load_tests/build/srcs/sdks/python/apache_beam/testing/load_tests/build/srcs/sdks/python/apache_beam/testing/load_tests/build/srcs/sdks/python/apache_beam/testing/load_tests/build/srcs/sdks/python/apache_beam/testing/load_tests/build/srcs/sdks/python/apache_beam/testing/load_tests/build/srcs/sdks/python/apache_beam/testing/load_tests/build/srcs/sdks/python/apache_beam/testing/load_tests/build/srcs/sdks/python/apache_beam/testing/load_tests/build/srcs/sdks/python/apache_beam/testing/load_tests/build/srcs/sdks/python/apache_beam/testing/load_tests/build/srcs/sdks/python/apache_beam/testing/load_tests/build/srcs/sdks/python/apache_beam/testing/load_tests/build/srcs/sdks/python/apache_beam/testing/load_tests/build/srcs/sdks/python/apache_beam/testing/load_tests/build/srcs/sdks/python/apache_beam/testing/load_tests/build/srcs/sdks/python/apache_beam/testing/load_tests/build/srcs/sdks/python/apache_beam/testing/load_tests/build/srcs/sdks/python/apache_beam/testing/load_tests/build/srcs/sdks/python/apache_beam/testing/load_tests/build/srcs/sdks/python/apache_beam/testing/load_tests/build/srcs/sdks/python/apache_beam/testing/load_tests/build/srcs/sdks/python/apache_beam/testing/load_tests/build/srcs/sdks/python/apache_beam/testing/load_tests/build/srcs/sdks/python/apache_beam/testing/load_tests/build/srcs/sdks/python/apache_beam/testing/load_tests/build/srcs/sdks/python/apache_beam/testing/load_tests/build/srcs/sdks/python/apache_beam/testing/load_tests/build/srcs/sdks/python/apache_beam/testing/load_tests/build/srcs/sdks/python/apache_beam/testing/load_tests/build/srcs/sdks/python/apache_beam/testing/load_tests/build/srcs/sdks/python/apache_beam/testing/load_tests/build/srcs/sdks/python/apache_beam/testing/load_tests/build/srcs/sdks/python/apache_beam/testing/load_tests/build/srcs/sdks/python/apache_beam/testing/load_tests/build/srcs/sdks/python/apache_beam/testing/load_tests/build/srcs/sdks/python/apache_beam/testing/load_tests/build/srcs/sdks/python/apache_beam/testing/load_tests/build/srcs/sdks/python/apache_beam/testing/load_tests/build/srcs/sdks/python/apache_beam/testing/load_tests/build/srcs/sdks/python/apache_beam/testing/load_tests/build/srcs/sdks/python/apache_beam/testing/load_tests/build/srcs/sdks/python/apache_beam/testing/load_tests/build/srcs/sdks/python/apache_beam/testing/load_tests/build/srcs/sdks/python/apache_beam/testing/load_tests/build/srcs/sdks/python/apache_beam/testing/load_tests/build/srcs/sdks/python/apache_beam/testing/load_tests/build/srcs/sdks/python/apache_beam/testing/load_tests/build/srcs/sdks/python/apache_beam/testing/load_tests/build/srcs/sdks/python/apache_beam/testing/load_tests/build/srcs/sdks/python/apache_beam/testing/load_tests/build/srcs/sdks/python/apache_beam/testing/load_tests/build/srcs/sdks/python/apache_beam/testing/load_tests/build/srcs/sdks/python/apache_beam/testing/load_tests/build/srcs/sdks/python/apache_beam/testing/load_tests/build/srcs/sdks/python/apache_beam/testing/load_tests/build/srcs/sdks/python/apache_beam/testing/load_tests/build/srcs/sdks/python/apache_beam/testing/load_tests/build/srcs/sdks/python/apache_beam/testing/load_tests/build/srcs/sdks/python/apache_beam/testing/load_tests/build/srcs/sdks/python/apache_beam/testing/load_tests/build/srcs/sdks/python/apache_beam/testing/load_tests/build/srcs/sdks/python/apache_beam/testing/load_tests/build/srcs/sdks/python/apache_beam/testing/load_tests/build/srcs/sdks/python/apache_beam/testing/load_tests/build/srcs/sdks/python/apache_beam/testing/load_tests/build/srcs/sdks/python/apache_beam/testing/load_tests/build/srcs/sdks/python/apache_beam/testing/load_tests/build/srcs/sdks/python/apache_beam/testing/load_tests/build/srcs/sdks/python/apache_beam/testing/load_tests/build/srcs/sdks/python/apache_beam/testing/load_tests/build/srcs/sdks/python/container/vendor/go.opencensus.io/exporter/jaeger/internal/gen-go/baggage/baggage_restriction_manager-remote/baggage_restriction_manager-remote.go'.>

* Try:
Run with --stacktrace option to get the stack trace. Run with --info or --debug option to get more log output. Run with --scan to get full insights.
==============================================================================

3: Task failed with an exception.
-----------
* What went wrong:
Execution failed for task ':beam-sdks-python-test-suites-dataflow-py3:sdist'.
> Could not copy file '<https://builds.apache.org/job/beam_Release_NightlySnapshot/ws/src/sdks/python/apache_beam/testing/load_tests/build/srcs/sdks/python/apache_beam/testing/load_tests/build/srcs/sdks/python/apache_beam/testing/load_tests/build/srcs/sdks/python/apache_beam/testing/load_tests/build/srcs/sdks/python/apache_beam/testing/load_tests/build/srcs/sdks/python/apache_beam/testing/load_tests/build/srcs/sdks/python/apache_beam/testing/load_tests/build/srcs/sdks/python/apache_beam/testing/load_tests/build/srcs/sdks/python/apache_beam/testing/load_tests/build/srcs/sdks/python/apache_beam/testing/load_tests/build/srcs/sdks/python/apache_beam/testing/load_tests/build/srcs/sdks/python/apache_beam/testing/load_tests/build/srcs/sdks/python/apache_beam/testing/load_tests/build/srcs/sdks/python/apache_beam/testing/load_tests/build/srcs/sdks/python/apache_beam/testing/load_tests/build/srcs/sdks/python/apache_beam/testing/load_tests/build/srcs/sdks/python/apache_beam/testing/load_tests/build/srcs/sdks/python/apache_beam/testing/load_tests/build/srcs/sdks/python/apache_beam/testing/load_tests/build/srcs/sdks/python/apache_beam/testing/load_tests/build/srcs/sdks/python/apache_beam/testing/load_tests/build/srcs/sdks/python/apache_beam/testing/load_tests/build/srcs/sdks/python/apache_beam/testing/load_tests/build/srcs/sdks/python/apache_beam/testing/load_tests/build/srcs/sdks/python/apache_beam/testing/load_tests/build/srcs/sdks/python/apache_beam/testing/load_tests/build/srcs/sdks/python/apache_beam/testing/load_tests/build/srcs/sdks/python/apache_beam/testing/load_tests/build/srcs/sdks/python/apache_beam/testing/load_tests/build/srcs/sdks/python/apache_beam/testing/load_tests/build/srcs/sdks/python/apache_beam/testing/load_tests/build/srcs/sdks/python/apache_beam/testing/load_tests/build/srcs/sdks/python/apache_beam/testing/load_tests/build/srcs/sdks/python/apache_beam/testing/load_tests/build/srcs/sdks/python/apache_beam/testing/load_tests/build/srcs/sdks/python/apache_beam/testing/load_tests/build/srcs/sdks/python/apache_beam/testing/load_tests/build/srcs/sdks/python/apache_beam/testing/load_tests/build/srcs/sdks/python/apache_beam/testing/load_tests/build/srcs/sdks/python/apache_beam/testing/load_tests/build/srcs/sdks/python/apache_beam/testing/load_tests/build/srcs/sdks/python/apache_beam/testing/load_tests/build/srcs/sdks/python/apache_beam/testing/load_tests/build/srcs/sdks/python/apache_beam/testing/load_tests/build/srcs/sdks/python/apache_beam/testing/load_tests/build/srcs/sdks/python/apache_beam/testing/load_tests/build/srcs/sdks/python/apache_beam/testing/load_tests/build/srcs/sdks/python/apache_beam/testing/load_tests/build/srcs/sdks/python/apache_beam/testing/load_tests/build/srcs/sdks/python/apache_beam/testing/load_tests/build/srcs/sdks/python/apache_beam/testing/load_tests/build/srcs/sdks/python/apache_beam/testing/load_tests/build/srcs/sdks/python/apache_beam/testing/load_tests/build/srcs/sdks/python/apache_beam/testing/load_tests/build/srcs/sdks/python/apache_beam/testing/load_tests/build/srcs/sdks/python/apache_beam/testing/load_tests/build/srcs/sdks/python/apache_beam/testing/load_tests/build/srcs/sdks/python/apache_beam/testing/load_tests/build/srcs/sdks/python/apache_beam/testing/load_tests/build/srcs/sdks/python/apache_beam/testing/load_tests/build/srcs/sdks/python/apache_beam/testing/load_tests/build/srcs/sdks/python/apache_beam/testing/load_tests/build/srcs/sdks/python/apache_beam/testing/load_tests/build/srcs/sdks/python/apache_beam/testing/load_tests/build/srcs/sdks/python/apache_beam/testing/load_tests/build/srcs/sdks/python/apache_beam/testing/load_tests/build/srcs/sdks/python/apache_beam/testing/load_tests/build/srcs/sdks/python/apache_beam/testing/load_tests/build/srcs/sdks/python/apache_beam/testing/load_tests/build/srcs/sdks/python/apache_beam/testing/load_tests/build/srcs/sdks/python/apache_beam/testing/load_tests/build/srcs/sdks/python/container/vendor/go.opencensus.io/exporter/jaeger/internal/gen-go/baggage/baggage_restriction_manager-remote/baggage_restriction_manager-remote.go'> to '<https://builds.apache.org/job/beam_Release_NightlySnapshot/ws/src/sdks/python/test-suites/dataflow/py3/build/srcs/sdks/python/apache_beam/testing/load_tests/build/srcs/sdks/python/apache_beam/testing/load_tests/build/srcs/sdks/python/apache_beam/testing/load_tests/build/srcs/sdks/python/apache_beam/testing/load_tests/build/srcs/sdks/python/apache_beam/testing/load_tests/build/srcs/sdks/python/apache_beam/testing/load_tests/build/srcs/sdks/python/apache_beam/testing/load_tests/build/srcs/sdks/python/apache_beam/testing/load_tests/build/srcs/sdks/python/apache_beam/testing/load_tests/build/srcs/sdks/python/apache_beam/testing/load_tests/build/srcs/sdks/python/apache_beam/testing/load_tests/build/srcs/sdks/python/apache_beam/testing/load_tests/build/srcs/sdks/python/apache_beam/testing/load_tests/build/srcs/sdks/python/apache_beam/testing/load_tests/build/srcs/sdks/python/apache_beam/testing/load_tests/build/srcs/sdks/python/apache_beam/testing/load_tests/build/srcs/sdks/python/apache_beam/testing/load_tests/build/srcs/sdks/python/apache_beam/testing/load_tests/build/srcs/sdks/python/apache_beam/testing/load_tests/build/srcs/sdks/python/apache_beam/testing/load_tests/build/srcs/sdks/python/apache_beam/testing/load_tests/build/srcs/sdks/python/apache_beam/testing/load_tests/build/srcs/sdks/python/apache_beam/testing/load_tests/build/srcs/sdks/python/apache_beam/testing/load_tests/build/srcs/sdks/python/apache_beam/testing/load_tests/build/srcs/sdks/python/apache_beam/testing/load_tests/build/srcs/sdks/python/apache_beam/testing/load_tests/build/srcs/sdks/python/apache_beam/testing/load_tests/build/srcs/sdks/python/apache_beam/testing/load_tests/build/srcs/sdks/python/apache_beam/testing/load_tests/build/srcs/sdks/python/apache_beam/testing/load_tests/build/srcs/sdks/python/apache_beam/testing/load_tests/build/srcs/sdks/python/apache_beam/testing/load_tests/build/srcs/sdks/python/apache_beam/testing/load_tests/build/srcs/sdks/python/apache_beam/testing/load_tests/build/srcs/sdks/python/apache_beam/testing/load_tests/build/srcs/sdks/python/apache_beam/testing/load_tests/build/srcs/sdks/python/apache_beam/testing/load_tests/build/srcs/sdks/python/apache_beam/testing/load_tests/build/srcs/sdks/python/apache_beam/testing/load_tests/build/srcs/sdks/python/apache_beam/testing/load_tests/build/srcs/sdks/python/apache_beam/testing/load_tests/build/srcs/sdks/python/apache_beam/testing/load_tests/build/srcs/sdks/python/apache_beam/testing/load_tests/build/srcs/sdks/python/apache_beam/testing/load_tests/build/srcs/sdks/python/apache_beam/testing/load_tests/build/srcs/sdks/python/apache_beam/testing/load_tests/build/srcs/sdks/python/apache_beam/testing/load_tests/build/srcs/sdks/python/apache_beam/testing/load_tests/build/srcs/sdks/python/apache_beam/testing/load_tests/build/srcs/sdks/python/apache_beam/testing/load_tests/build/srcs/sdks/python/apache_beam/testing/load_tests/build/srcs/sdks/python/apache_beam/testing/load_tests/build/srcs/sdks/python/apache_beam/testing/load_tests/build/srcs/sdks/python/apache_beam/testing/load_tests/build/srcs/sdks/python/apache_beam/testing/load_tests/build/srcs/sdks/python/apache_beam/testing/load_tests/build/srcs/sdks/python/apache_beam/testing/load_tests/build/srcs/sdks/python/apache_beam/testing/load_tests/build/srcs/sdks/python/apache_beam/testing/load_tests/build/srcs/sdks/python/apache_beam/testing/load_tests/build/srcs/sdks/python/apache_beam/testing/load_tests/build/srcs/sdks/python/apache_beam/testing/load_tests/build/srcs/sdks/python/apache_beam/testing/load_tests/build/srcs/sdks/python/apache_beam/testing/load_tests/build/srcs/sdks/python/apache_beam/testing/load_tests/build/srcs/sdks/python/apache_beam/testing/load_tests/build/srcs/sdks/python/apache_beam/testing/load_tests/build/srcs/sdks/python/apache_beam/testing/load_tests/build/srcs/sdks/python/apache_beam/testing/load_tests/build/srcs/sdks/python/apache_beam/testing/load_tests/build/srcs/sdks/python/container/vendor/go.opencensus.io/exporter/jaeger/internal/gen-go/baggage/baggage_restriction_manager-remote/baggage_restriction_manager-remote.go'.>

* Try:
Run with --stacktrace option to get the stack trace. Run with --info or --debug option to get more log output. Run with --scan to get full insights.
==============================================================================

4: Task failed with an exception.
-----------
* What went wrong:
Execution failed for task ':beam-sdks-python-test-suites-direct-py3:sdist'.
> Could not copy file '<https://builds.apache.org/job/beam_Release_NightlySnapshot/ws/src/sdks/python/apache_beam/testing/load_tests/build/srcs/sdks/python/apache_beam/testing/load_tests/build/srcs/sdks/python/apache_beam/testing/load_tests/build/srcs/sdks/python/apache_beam/testing/load_tests/build/srcs/sdks/python/apache_beam/testing/load_tests/build/srcs/sdks/python/apache_beam/testing/load_tests/build/srcs/sdks/python/apache_beam/testing/load_tests/build/srcs/sdks/python/apache_beam/testing/load_tests/build/srcs/sdks/python/apache_beam/testing/load_tests/build/srcs/sdks/python/apache_beam/testing/load_tests/build/srcs/sdks/python/apache_beam/testing/load_tests/build/srcs/sdks/python/apache_beam/testing/load_tests/build/srcs/sdks/python/apache_beam/testing/load_tests/build/srcs/sdks/python/apache_beam/testing/load_tests/build/srcs/sdks/python/apache_beam/testing/load_tests/build/srcs/sdks/python/apache_beam/testing/load_tests/build/srcs/sdks/python/apache_beam/testing/load_tests/build/srcs/sdks/python/apache_beam/testing/load_tests/build/srcs/sdks/python/apache_beam/testing/load_tests/build/srcs/sdks/python/apache_beam/testing/load_tests/build/srcs/sdks/python/apache_beam/testing/load_tests/build/srcs/sdks/python/apache_beam/testing/load_tests/build/srcs/sdks/python/apache_beam/testing/load_tests/build/srcs/sdks/python/apache_beam/testing/load_tests/build/srcs/sdks/python/apache_beam/testing/load_tests/build/srcs/sdks/python/apache_beam/testing/load_tests/build/srcs/sdks/python/apache_beam/testing/load_tests/build/srcs/sdks/python/apache_beam/testing/load_tests/build/srcs/sdks/python/apache_beam/testing/load_tests/build/srcs/sdks/python/apache_beam/testing/load_tests/build/srcs/sdks/python/apache_beam/testing/load_tests/build/srcs/sdks/python/apache_beam/testing/load_tests/build/srcs/sdks/python/apache_beam/testing/load_tests/build/srcs/sdks/python/apache_beam/testing/load_tests/build/srcs/sdks/python/apache_beam/testing/load_tests/build/srcs/sdks/python/apache_beam/testing/load_tests/build/srcs/sdks/python/apache_beam/testing/load_tests/build/srcs/sdks/python/apache_beam/testing/load_tests/build/srcs/sdks/python/apache_beam/testing/load_tests/build/srcs/sdks/python/apache_beam/testing/load_tests/build/srcs/sdks/python/apache_beam/testing/load_tests/build/srcs/sdks/python/apache_beam/testing/load_tests/build/srcs/sdks/python/apache_beam/testing/load_tests/build/srcs/sdks/python/apache_beam/testing/load_tests/build/srcs/sdks/python/apache_beam/testing/load_tests/build/srcs/sdks/python/apache_beam/testing/load_tests/build/srcs/sdks/python/apache_beam/testing/load_tests/build/srcs/sdks/python/apache_beam/testing/load_tests/build/srcs/sdks/python/apache_beam/testing/load_tests/build/srcs/sdks/python/apache_beam/testing/load_tests/build/srcs/sdks/python/apache_beam/testing/load_tests/build/srcs/sdks/python/apache_beam/testing/load_tests/build/srcs/sdks/python/apache_beam/testing/load_tests/build/srcs/sdks/python/apache_beam/testing/load_tests/build/srcs/sdks/python/apache_beam/testing/load_tests/build/srcs/sdks/python/apache_beam/testing/load_tests/build/srcs/sdks/python/apache_beam/testing/load_tests/build/srcs/sdks/python/apache_beam/testing/load_tests/build/srcs/sdks/python/apache_beam/testing/load_tests/build/srcs/sdks/python/apache_beam/testing/load_tests/build/srcs/sdks/python/apache_beam/testing/load_tests/build/srcs/sdks/python/apache_beam/testing/load_tests/build/srcs/sdks/python/apache_beam/testing/load_tests/build/srcs/sdks/python/apache_beam/testing/load_tests/build/srcs/sdks/python/apache_beam/testing/load_tests/build/srcs/sdks/python/apache_beam/testing/load_tests/build/srcs/sdks/python/apache_beam/testing/load_tests/build/srcs/sdks/python/apache_beam/testing/load_tests/build/srcs/sdks/python/apache_beam/testing/load_tests/build/srcs/sdks/python/apache_beam/testing/load_tests/build/srcs/sdks/python/apache_beam/testing/load_tests/build/srcs/sdks/python/container/vendor/go.opencensus.io/exporter/jaeger/internal/gen-go/baggage/baggage_restriction_manager-remote/baggage_restriction_manager-remote.go'> to '<https://builds.apache.org/job/beam_Release_NightlySnapshot/ws/src/sdks/python/test-suites/direct/py3/build/srcs/sdks/python/apache_beam/testing/load_tests/build/srcs/sdks/python/apache_beam/testing/load_tests/build/srcs/sdks/python/apache_beam/testing/load_tests/build/srcs/sdks/python/apache_beam/testing/load_tests/build/srcs/sdks/python/apache_beam/testing/load_tests/build/srcs/sdks/python/apache_beam/testing/load_tests/build/srcs/sdks/python/apache_beam/testing/load_tests/build/srcs/sdks/python/apache_beam/testing/load_tests/build/srcs/sdks/python/apache_beam/testing/load_tests/build/srcs/sdks/python/apache_beam/testing/load_tests/build/srcs/sdks/python/apache_beam/testing/load_tests/build/srcs/sdks/python/apache_beam/testing/load_tests/build/srcs/sdks/python/apache_beam/testing/load_tests/build/srcs/sdks/python/apache_beam/testing/load_tests/build/srcs/sdks/python/apache_beam/testing/load_tests/build/srcs/sdks/python/apache_beam/testing/load_tests/build/srcs/sdks/python/apache_beam/testing/load_tests/build/srcs/sdks/python/apache_beam/testing/load_tests/build/srcs/sdks/python/apache_beam/testing/load_tests/build/srcs/sdks/python/apache_beam/testing/load_tests/build/srcs/sdks/python/apache_beam/testing/load_tests/build/srcs/sdks/python/apache_beam/testing/load_tests/build/srcs/sdks/python/apache_beam/testing/load_tests/build/srcs/sdks/python/apache_beam/testing/load_tests/build/srcs/sdks/python/apache_beam/testing/load_tests/build/srcs/sdks/python/apache_beam/testing/load_tests/build/srcs/sdks/python/apache_beam/testing/load_tests/build/srcs/sdks/python/apache_beam/testing/load_tests/build/srcs/sdks/python/apache_beam/testing/load_tests/build/srcs/sdks/python/apache_beam/testing/load_tests/build/srcs/sdks/python/apache_beam/testing/load_tests/build/srcs/sdks/python/apache_beam/testing/load_tests/build/srcs/sdks/python/apache_beam/testing/load_tests/build/srcs/sdks/python/apache_beam/testing/load_tests/build/srcs/sdks/python/apache_beam/testing/load_tests/build/srcs/sdks/python/apache_beam/testing/load_tests/build/srcs/sdks/python/apache_beam/testing/load_tests/build/srcs/sdks/python/apache_beam/testing/load_tests/build/srcs/sdks/python/apache_beam/testing/load_tests/build/srcs/sdks/python/apache_beam/testing/load_tests/build/srcs/sdks/python/apache_beam/testing/load_tests/build/srcs/sdks/python/apache_beam/testing/load_tests/build/srcs/sdks/python/apache_beam/testing/load_tests/build/srcs/sdks/python/apache_beam/testing/load_tests/build/srcs/sdks/python/apache_beam/testing/load_tests/build/srcs/sdks/python/apache_beam/testing/load_tests/build/srcs/sdks/python/apache_beam/testing/load_tests/build/srcs/sdks/python/apache_beam/testing/load_tests/build/srcs/sdks/python/apache_beam/testing/load_tests/build/srcs/sdks/python/apache_beam/testing/load_tests/build/srcs/sdks/python/apache_beam/testing/load_tests/build/srcs/sdks/python/apache_beam/testing/load_tests/build/srcs/sdks/python/apache_beam/testing/load_tests/build/srcs/sdks/python/apache_beam/testing/load_tests/build/srcs/sdks/python/apache_beam/testing/load_tests/build/srcs/sdks/python/apache_beam/testing/load_tests/build/srcs/sdks/python/apache_beam/testing/load_tests/build/srcs/sdks/python/apache_beam/testing/load_tests/build/srcs/sdks/python/apache_beam/testing/load_tests/build/srcs/sdks/python/apache_beam/testing/load_tests/build/srcs/sdks/python/apache_beam/testing/load_tests/build/srcs/sdks/python/apache_beam/testing/load_tests/build/srcs/sdks/python/apache_beam/testing/load_tests/build/srcs/sdks/python/apache_beam/testing/load_tests/build/srcs/sdks/python/apache_beam/testing/load_tests/build/srcs/sdks/python/apache_beam/testing/load_tests/build/srcs/sdks/python/apache_beam/testing/load_tests/build/srcs/sdks/python/apache_beam/testing/load_tests/build/srcs/sdks/python/apache_beam/testing/load_tests/build/srcs/sdks/python/apache_beam/testing/load_tests/build/srcs/sdks/python/apache_beam/testing/load_tests/build/srcs/sdks/python/container/vendor/go.opencensus.io/exporter/jaeger/internal/gen-go/baggage/baggage_restriction_manager-remote/baggage_restriction_manager-remote.go'.>

* Try:
Run with --stacktrace option to get the stack trace. Run with --info or --debug option to get more log output. Run with --scan to get full insights.
==============================================================================

5: Task failed with an exception.
-----------
* What went wrong:
Execution failed for task ':beam-sdks-python-test-suites-tox-py35:sdist'.
> Could not copy file '<https://builds.apache.org/job/beam_Release_NightlySnapshot/ws/src/sdks/python/apache_beam/testing/load_tests/build/srcs/sdks/python/apache_beam/testing/load_tests/build/srcs/sdks/python/apache_beam/testing/load_tests/build/srcs/sdks/python/apache_beam/testing/load_tests/build/srcs/sdks/python/apache_beam/testing/load_tests/build/srcs/sdks/python/apache_beam/testing/load_tests/build/srcs/sdks/python/apache_beam/testing/load_tests/build/srcs/sdks/python/apache_beam/testing/load_tests/build/srcs/sdks/python/apache_beam/testing/load_tests/build/srcs/sdks/python/apache_beam/testing/load_tests/build/srcs/sdks/python/apache_beam/testing/load_tests/build/srcs/sdks/python/apache_beam/testing/load_tests/build/srcs/sdks/python/apache_beam/testing/load_tests/build/srcs/sdks/python/apache_beam/testing/load_tests/build/srcs/sdks/python/apache_beam/testing/load_tests/build/srcs/sdks/python/apache_beam/testing/load_tests/build/srcs/sdks/python/apache_beam/testing/load_tests/build/srcs/sdks/python/apache_beam/testing/load_tests/build/srcs/sdks/python/apache_beam/testing/load_tests/build/srcs/sdks/python/apache_beam/testing/load_tests/build/srcs/sdks/python/apache_beam/testing/load_tests/build/srcs/sdks/python/apache_beam/testing/load_tests/build/srcs/sdks/python/apache_beam/testing/load_tests/build/srcs/sdks/python/apache_beam/testing/load_tests/build/srcs/sdks/python/apache_beam/testing/load_tests/build/srcs/sdks/python/apache_beam/testing/load_tests/build/srcs/sdks/python/apache_beam/testing/load_tests/build/srcs/sdks/python/apache_beam/testing/load_tests/build/srcs/sdks/python/apache_beam/testing/load_tests/build/srcs/sdks/python/apache_beam/testing/load_tests/build/srcs/sdks/python/apache_beam/testing/load_tests/build/srcs/sdks/python/apache_beam/testing/load_tests/build/srcs/sdks/python/apache_beam/testing/load_tests/build/srcs/sdks/python/apache_beam/testing/load_tests/build/srcs/sdks/python/apache_beam/testing/load_tests/build/srcs/sdks/python/apache_beam/testing/load_tests/build/srcs/sdks/python/apache_beam/testing/load_tests/build/srcs/sdks/python/apache_beam/testing/load_tests/build/srcs/sdks/python/apache_beam/testing/load_tests/build/srcs/sdks/python/apache_beam/testing/load_tests/build/srcs/sdks/python/apache_beam/testing/load_tests/build/srcs/sdks/python/apache_beam/testing/load_tests/build/srcs/sdks/python/apache_beam/testing/load_tests/build/srcs/sdks/python/apache_beam/testing/load_tests/build/srcs/sdks/python/apache_beam/testing/load_tests/build/srcs/sdks/python/apache_beam/testing/load_tests/build/srcs/sdks/python/apache_beam/testing/load_tests/build/srcs/sdks/python/apache_beam/testing/load_tests/build/srcs/sdks/python/apache_beam/testing/load_tests/build/srcs/sdks/python/apache_beam/testing/load_tests/build/srcs/sdks/python/apache_beam/testing/load_tests/build/srcs/sdks/python/apache_beam/testing/load_tests/build/srcs/sdks/python/apache_beam/testing/load_tests/build/srcs/sdks/python/apache_beam/testing/load_tests/build/srcs/sdks/python/apache_beam/testing/load_tests/build/srcs/sdks/python/apache_beam/testing/load_tests/build/srcs/sdks/python/apache_beam/testing/load_tests/build/srcs/sdks/python/apache_beam/testing/load_tests/build/srcs/sdks/python/apache_beam/testing/load_tests/build/srcs/sdks/python/apache_beam/testing/load_tests/build/srcs/sdks/python/apache_beam/testing/load_tests/build/srcs/sdks/python/apache_beam/testing/load_tests/build/srcs/sdks/python/apache_beam/testing/load_tests/build/srcs/sdks/python/apache_beam/testing/load_tests/build/srcs/sdks/python/apache_beam/testing/load_tests/build/srcs/sdks/python/apache_beam/testing/load_tests/build/srcs/sdks/python/apache_beam/testing/load_tests/build/srcs/sdks/python/apache_beam/testing/load_tests/build/srcs/sdks/python/apache_beam/testing/load_tests/build/srcs/sdks/python/apache_beam/testing/load_tests/build/srcs/sdks/python/apache_beam/testing/load_tests/build/srcs/sdks/python/container/vendor/go.opencensus.io/exporter/jaeger/internal/gen-go/baggage/baggage_restriction_manager-remote/baggage_restriction_manager-remote.go'> to '<https://builds.apache.org/job/beam_Release_NightlySnapshot/ws/src/sdks/python/test-suites/tox/py35/build/srcs/sdks/python/apache_beam/testing/load_tests/build/srcs/sdks/python/apache_beam/testing/load_tests/build/srcs/sdks/python/apache_beam/testing/load_tests/build/srcs/sdks/python/apache_beam/testing/load_tests/build/srcs/sdks/python/apache_beam/testing/load_tests/build/srcs/sdks/python/apache_beam/testing/load_tests/build/srcs/sdks/python/apache_beam/testing/load_tests/build/srcs/sdks/python/apache_beam/testing/load_tests/build/srcs/sdks/python/apache_beam/testing/load_tests/build/srcs/sdks/python/apache_beam/testing/load_tests/build/srcs/sdks/python/apache_beam/testing/load_tests/build/srcs/sdks/python/apache_beam/testing/load_tests/build/srcs/sdks/python/apache_beam/testing/load_tests/build/srcs/sdks/python/apache_beam/testing/load_tests/build/srcs/sdks/python/apache_beam/testing/load_tests/build/srcs/sdks/python/apache_beam/testing/load_tests/build/srcs/sdks/python/apache_beam/testing/load_tests/build/srcs/sdks/python/apache_beam/testing/load_tests/build/srcs/sdks/python/apache_beam/testing/load_tests/build/srcs/sdks/python/apache_beam/testing/load_tests/build/srcs/sdks/python/apache_beam/testing/load_tests/build/srcs/sdks/python/apache_beam/testing/load_tests/build/srcs/sdks/python/apache_beam/testing/load_tests/build/srcs/sdks/python/apache_beam/testing/load_tests/build/srcs/sdks/python/apache_beam/testing/load_tests/build/srcs/sdks/python/apache_beam/testing/load_tests/build/srcs/sdks/python/apache_beam/testing/load_tests/build/srcs/sdks/python/apache_beam/testing/load_tests/build/srcs/sdks/python/apache_beam/testing/load_tests/build/srcs/sdks/python/apache_beam/testing/load_tests/build/srcs/sdks/python/apache_beam/testing/load_tests/build/srcs/sdks/python/apache_beam/testing/load_tests/build/srcs/sdks/python/apache_beam/testing/load_tests/build/srcs/sdks/python/apache_beam/testing/load_tests/build/srcs/sdks/python/apache_beam/testing/load_tests/build/srcs/sdks/python/apache_beam/testing/load_tests/build/srcs/sdks/python/apache_beam/testing/load_tests/build/srcs/sdks/python/apache_beam/testing/load_tests/build/srcs/sdks/python/apache_beam/testing/load_tests/build/srcs/sdks/python/apache_beam/testing/load_tests/build/srcs/sdks/python/apache_beam/testing/load_tests/build/srcs/sdks/python/apache_beam/testing/load_tests/build/srcs/sdks/python/apache_beam/testing/load_tests/build/srcs/sdks/python/apache_beam/testing/load_tests/build/srcs/sdks/python/apache_beam/testing/load_tests/build/srcs/sdks/python/apache_beam/testing/load_tests/build/srcs/sdks/python/apache_beam/testing/load_tests/build/srcs/sdks/python/apache_beam/testing/load_tests/build/srcs/sdks/python/apache_beam/testing/load_tests/build/srcs/sdks/python/apache_beam/testing/load_tests/build/srcs/sdks/python/apache_beam/testing/load_tests/build/srcs/sdks/python/apache_beam/testing/load_tests/build/srcs/sdks/python/apache_beam/testing/load_tests/build/srcs/sdks/python/apache_beam/testing/load_tests/build/srcs/sdks/python/apache_beam/testing/load_tests/build/srcs/sdks/python/apache_beam/testing/load_tests/build/srcs/sdks/python/apache_beam/testing/load_tests/build/srcs/sdks/python/apache_beam/testing/load_tests/build/srcs/sdks/python/apache_beam/testing/load_tests/build/srcs/sdks/python/apache_beam/testing/load_tests/build/srcs/sdks/python/apache_beam/testing/load_tests/build/srcs/sdks/python/apache_beam/testing/load_tests/build/srcs/sdks/python/apache_beam/testing/load_tests/build/srcs/sdks/python/apache_beam/testing/load_tests/build/srcs/sdks/python/apache_beam/testing/load_tests/build/srcs/sdks/python/apache_beam/testing/load_tests/build/srcs/sdks/python/apache_beam/testing/load_tests/build/srcs/sdks/python/apache_beam/testing/load_tests/build/srcs/sdks/python/apache_beam/testing/load_tests/build/srcs/sdks/python/apache_beam/testing/load_tests/build/srcs/sdks/python/apache_beam/testing/load_tests/build/srcs/sdks/python/container/vendor/go.opencensus.io/exporter/jaeger/internal/gen-go/baggage/baggage_restriction_manager-remote/baggage_restriction_manager-remote.go'.>

* Try:
Run with --stacktrace option to get the stack trace. Run with --info or --debug option to get more log output. Run with --scan to get full insights.
==============================================================================

6: Task failed with an exception.
-----------
* What went wrong:
Execution failed for task ':beam-sdks-python-test-suites-tox-py36:sdist'.
> Could not copy file '<https://builds.apache.org/job/beam_Release_NightlySnapshot/ws/src/sdks/python/apache_beam/testing/load_tests/build/srcs/sdks/python/apache_beam/testing/load_tests/build/srcs/sdks/python/apache_beam/testing/load_tests/build/srcs/sdks/python/apache_beam/testing/load_tests/build/srcs/sdks/python/apache_beam/testing/load_tests/build/srcs/sdks/python/apache_beam/testing/load_tests/build/srcs/sdks/python/apache_beam/testing/load_tests/build/srcs/sdks/python/apache_beam/testing/load_tests/build/srcs/sdks/python/apache_beam/testing/load_tests/build/srcs/sdks/python/apache_beam/testing/load_tests/build/srcs/sdks/python/apache_beam/testing/load_tests/build/srcs/sdks/python/apache_beam/testing/load_tests/build/srcs/sdks/python/apache_beam/testing/load_tests/build/srcs/sdks/python/apache_beam/testing/load_tests/build/srcs/sdks/python/apache_beam/testing/load_tests/build/srcs/sdks/python/apache_beam/testing/load_tests/build/srcs/sdks/python/apache_beam/testing/load_tests/build/srcs/sdks/python/apache_beam/testing/load_tests/build/srcs/sdks/python/apache_beam/testing/load_tests/build/srcs/sdks/python/apache_beam/testing/load_tests/build/srcs/sdks/python/apache_beam/testing/load_tests/build/srcs/sdks/python/apache_beam/testing/load_tests/build/srcs/sdks/python/apache_beam/testing/load_tests/build/srcs/sdks/python/apache_beam/testing/load_tests/build/srcs/sdks/python/apache_beam/testing/load_tests/build/srcs/sdks/python/apache_beam/testing/load_tests/build/srcs/sdks/python/apache_beam/testing/load_tests/build/srcs/sdks/python/apache_beam/testing/load_tests/build/srcs/sdks/python/apache_beam/testing/load_tests/build/srcs/sdks/python/apache_beam/testing/load_tests/build/srcs/sdks/python/apache_beam/testing/load_tests/build/srcs/sdks/python/apache_beam/testing/load_tests/build/srcs/sdks/python/apache_beam/testing/load_tests/build/srcs/sdks/python/apache_beam/testing/load_tests/build/srcs/sdks/python/apache_beam/testing/load_tests/build/srcs/sdks/python/apache_beam/testing/load_tests/build/srcs/sdks/python/apache_beam/testing/load_tests/build/srcs/sdks/python/apache_beam/testing/load_tests/build/srcs/sdks/python/apache_beam/testing/load_tests/build/srcs/sdks/python/apache_beam/testing/load_tests/build/srcs/sdks/python/apache_beam/testing/load_tests/build/srcs/sdks/python/apache_beam/testing/load_tests/build/srcs/sdks/python/apache_beam/testing/load_tests/build/srcs/sdks/python/apache_beam/testing/load_tests/build/srcs/sdks/python/apache_beam/testing/load_tests/build/srcs/sdks/python/apache_beam/testing/load_tests/build/srcs/sdks/python/apache_beam/testing/load_tests/build/srcs/sdks/python/apache_beam/testing/load_tests/build/srcs/sdks/python/apache_beam/testing/load_tests/build/srcs/sdks/python/apache_beam/testing/load_tests/build/srcs/sdks/python/apache_beam/testing/load_tests/build/srcs/sdks/python/apache_beam/testing/load_tests/build/srcs/sdks/python/apache_beam/testing/load_tests/build/srcs/sdks/python/apache_beam/testing/load_tests/build/srcs/sdks/python/apache_beam/testing/load_tests/build/srcs/sdks/python/apache_beam/testing/load_tests/build/srcs/sdks/python/apache_beam/testing/load_tests/build/srcs/sdks/python/apache_beam/testing/load_tests/build/srcs/sdks/python/apache_beam/testing/load_tests/build/srcs/sdks/python/apache_beam/testing/load_tests/build/srcs/sdks/python/apache_beam/testing/load_tests/build/srcs/sdks/python/apache_beam/testing/load_tests/build/srcs/sdks/python/apache_beam/testing/load_tests/build/srcs/sdks/python/apache_beam/testing/load_tests/build/srcs/sdks/python/apache_beam/testing/load_tests/build/srcs/sdks/python/apache_beam/testing/load_tests/build/srcs/sdks/python/apache_beam/testing/load_tests/build/srcs/sdks/python/apache_beam/testing/load_tests/build/srcs/sdks/python/apache_beam/testing/load_tests/build/srcs/sdks/python/apache_beam/testing/load_tests/build/srcs/sdks/python/apache_beam/testing/load_tests/build/srcs/sdks/python/container/vendor/go.opencensus.io/exporter/jaeger/internal/gen-go/baggage/baggage_restriction_manager-remote/baggage_restriction_manager-remote.go'> to '<https://builds.apache.org/job/beam_Release_NightlySnapshot/ws/src/sdks/python/test-suites/tox/py36/build/srcs/sdks/python/apache_beam/testing/load_tests/build/srcs/sdks/python/apache_beam/testing/load_tests/build/srcs/sdks/python/apache_beam/testing/load_tests/build/srcs/sdks/python/apache_beam/testing/load_tests/build/srcs/sdks/python/apache_beam/testing/load_tests/build/srcs/sdks/python/apache_beam/testing/load_tests/build/srcs/sdks/python/apache_beam/testing/load_tests/build/srcs/sdks/python/apache_beam/testing/load_tests/build/srcs/sdks/python/apache_beam/testing/load_tests/build/srcs/sdks/python/apache_beam/testing/load_tests/build/srcs/sdks/python/apache_beam/testing/load_tests/build/srcs/sdks/python/apache_beam/testing/load_tests/build/srcs/sdks/python/apache_beam/testing/load_tests/build/srcs/sdks/python/apache_beam/testing/load_tests/build/srcs/sdks/python/apache_beam/testing/load_tests/build/srcs/sdks/python/apache_beam/testing/load_tests/build/srcs/sdks/python/apache_beam/testing/load_tests/build/srcs/sdks/python/apache_beam/testing/load_tests/build/srcs/sdks/python/apache_beam/testing/load_tests/build/srcs/sdks/python/apache_beam/testing/load_tests/build/srcs/sdks/python/apache_beam/testing/load_tests/build/srcs/sdks/python/apache_beam/testing/load_tests/build/srcs/sdks/python/apache_beam/testing/load_tests/build/srcs/sdks/python/apache_beam/testing/load_tests/build/srcs/sdks/python/apache_beam/testing/load_tests/build/srcs/sdks/python/apache_beam/testing/load_tests/build/srcs/sdks/python/apache_beam/testing/load_tests/build/srcs/sdks/python/apache_beam/testing/load_tests/build/srcs/sdks/python/apache_beam/testing/load_tests/build/srcs/sdks/python/apache_beam/testing/load_tests/build/srcs/sdks/python/apache_beam/testing/load_tests/build/srcs/sdks/python/apache_beam/testing/load_tests/build/srcs/sdks/python/apache_beam/testing/load_tests/build/srcs/sdks/python/apache_beam/testing/load_tests/build/srcs/sdks/python/apache_beam/testing/load_tests/build/srcs/sdks/python/apache_beam/testing/load_tests/build/srcs/sdks/python/apache_beam/testing/load_tests/build/srcs/sdks/python/apache_beam/testing/load_tests/build/srcs/sdks/python/apache_beam/testing/load_tests/build/srcs/sdks/python/apache_beam/testing/load_tests/build/srcs/sdks/python/apache_beam/testing/load_tests/build/srcs/sdks/python/apache_beam/testing/load_tests/build/srcs/sdks/python/apache_beam/testing/load_tests/build/srcs/sdks/python/apache_beam/testing/load_tests/build/srcs/sdks/python/apache_beam/testing/load_tests/build/srcs/sdks/python/apache_beam/testing/load_tests/build/srcs/sdks/python/apache_beam/testing/load_tests/build/srcs/sdks/python/apache_beam/testing/load_tests/build/srcs/sdks/python/apache_beam/testing/load_tests/build/srcs/sdks/python/apache_beam/testing/load_tests/build/srcs/sdks/python/apache_beam/testing/load_tests/build/srcs/sdks/python/apache_beam/testing/load_tests/build/srcs/sdks/python/apache_beam/testing/load_tests/build/srcs/sdks/python/apache_beam/testing/load_tests/build/srcs/sdks/python/apache_beam/testing/load_tests/build/srcs/sdks/python/apache_beam/testing/load_tests/build/srcs/sdks/python/apache_beam/testing/load_tests/build/srcs/sdks/python/apache_beam/testing/load_tests/build/srcs/sdks/python/apache_beam/testing/load_tests/build/srcs/sdks/python/apache_beam/testing/load_tests/build/srcs/sdks/python/apache_beam/testing/load_tests/build/srcs/sdks/python/apache_beam/testing/load_tests/build/srcs/sdks/python/apache_beam/testing/load_tests/build/srcs/sdks/python/apache_beam/testing/load_tests/build/srcs/sdks/python/apache_beam/testing/load_tests/build/srcs/sdks/python/apache_beam/testing/load_tests/build/srcs/sdks/python/apache_beam/testing/load_tests/build/srcs/sdks/python/apache_beam/testing/load_tests/build/srcs/sdks/python/apache_beam/testing/load_tests/build/srcs/sdks/python/apache_beam/testing/load_tests/build/srcs/sdks/python/apache_beam/testing/load_tests/build/srcs/sdks/python/container/vendor/go.opencensus.io/exporter/jaeger/internal/gen-go/baggage/baggage_restriction_manager-remote/baggage_restriction_manager-remote.go'.>

* Try:
Run with --stacktrace option to get the stack trace. Run with --info or --debug option to get more log output. Run with --scan to get full insights.
==============================================================================

* Get more help at https://help.gradle.org

Deprecated Gradle features were used in this build, making it incompatible with Gradle 6.0.
Use '--warning-mode all' to show the individual deprecation warnings.
See https://docs.gradle.org/5.2.1/userguide/command_line_interface.html#sec:command_line_warnings

BUILD FAILED in 2h 4m 54s
1059 actionable tasks: 1028 executed, 31 from cache

Publishing build scan...
https://gradle.com/s/rllnbwj4lj4qc

Build step 'Invoke Gradle script' changed build result to FAILURE
Build step 'Invoke Gradle script' marked build as failure

---------------------------------------------------------------------
To unsubscribe, e-mail: builds-unsubscribe@beam.apache.org
For additional commands, e-mail: builds-help@beam.apache.org


Mime
View raw message