beam-builds mailing list archives

Site index · List index
Message view « Date » · « Thread »
Top « Date » · « Thread »
From Apache Jenkins Server <jenk...@builds.apache.org>
Subject Build failed in Jenkins: beam_PostCommit_Java11_ValidatesRunner_PortabilityApi_Dataflow #61
Date Thu, 28 Mar 2019 16:15:44 GMT
See <https://builds.apache.org/job/beam_PostCommit_Java11_ValidatesRunner_PortabilityApi_Dataflow/61/display/redirect?page=changes>

Changes:

[apilloud] Moving to 2.13.0-SNAPSHOT on master branch.

------------------------------------------
[...truncated 63.24 KB...]
    java.lang.RuntimeException at FlattenTest.java:130

org.apache.beam.sdk.transforms.GroupByKeyTest$BasicTests > testGroupByKey FAILED
    java.lang.RuntimeException at GroupByKeyTest.java:128

org.apache.beam.sdk.testing.PAssertTest > testPAssertEqualsSingletonFalse FAILED
    java.lang.AssertionError at PAssertTest.java:369

org.apache.beam.sdk.PipelineTest > testMultipleApply FAILED
    java.lang.RuntimeException at PipelineTest.java:228

org.apache.beam.sdk.transforms.ReshuffleTest > testReshuffleAfterSlidingWindows FAILED
    java.lang.RuntimeException at ReshuffleTest.java:251

org.apache.beam.sdk.transforms.CombineTest$BasicTests > testBasicCombineEmpty FAILED
    java.lang.RuntimeException at CombineTest.java:687

org.apache.beam.sdk.transforms.ParDoTest$BasicTests > testParDoEmptyOutputs FAILED
    java.lang.RuntimeException at ParDoTest.java:378

org.apache.beam.sdk.transforms.windowing.WindowingTest > testPartitioningWindowing FAILED
    java.lang.RuntimeException at WindowingTest.java:126

org.apache.beam.sdk.transforms.CombineTest$WindowingTests > testCombineGloballyInstanceMethodReference
FAILED
    java.lang.RuntimeException at CombineTest.java:1403

org.apache.beam.sdk.transforms.FlattenTest > testFlattenPCollectionsSingletonList FAILED
    java.lang.RuntimeException at FlattenTest.java:104

org.apache.beam.sdk.transforms.GroupByKeyTest$BasicTests > testLargeKeys10KB FAILED
    java.lang.RuntimeException at GroupByKeyTest.java:353

org.apache.beam.sdk.transforms.ParDoTest$StateTests > testCombiningStateParameterSuperclass
FAILED
    java.lang.RuntimeException at ParDoTest.java:1960

org.apache.beam.sdk.testing.PAssertTest > testPAssertEqualsSingletonFalseDefaultReasonString
FAILED
    java.lang.AssertionError at PAssertTest.java:385

org.apache.beam.sdk.transforms.ParDoTest$TimestampTests > testParDoShiftTimestamp FAILED
    java.lang.RuntimeException at ParDoTest.java:1303

org.apache.beam.sdk.transforms.ReshuffleTest > testReshufflePreservesTimestamps FAILED
    java.lang.RuntimeException at ReshuffleTest.java:148

org.apache.beam.sdk.transforms.FlattenTest > testFlattenPCollections FAILED
    java.lang.RuntimeException at FlattenTest.java:92

org.apache.beam.sdk.transforms.ParDoTest$StateTests > testValueStateDedup FAILED
    java.lang.RuntimeException at ParDoTest.java:1476

org.apache.beam.sdk.transforms.ParDoTest$MultipleInputsAndOutputTests > testSideInputsWithMultipleWindows
FAILED
    java.lang.RuntimeException at ParDoTest.java:895

org.apache.beam.sdk.transforms.CombineTest$WindowingTests > testSlidingWindowsCombineWithContext
FAILED
    java.lang.RuntimeException at CombineTest.java:1182

org.apache.beam.sdk.transforms.ViewTest > testMapAsEntrySetSideInput FAILED
    java.lang.RuntimeException at ViewTest.java:977

org.apache.beam.sdk.transforms.GroupByKeyTest$BasicTests > testLargeKeys100KB FAILED
    java.lang.RuntimeException at GroupByKeyTest.java:359

org.apache.beam.sdk.transforms.ParDoTest$TimestampTests > testParDoShiftTimestampUnlimited
FAILED
    java.lang.RuntimeException at ParDoTest.java:1392

org.apache.beam.sdk.transforms.ReshuffleTest > testReshuffleAfterSlidingWindowsAndGroupByKey
FAILED
    java.lang.RuntimeException at ReshuffleTest.java:211

org.apache.beam.sdk.transforms.FlattenTest > testFlattenPCollectionsThenParDo FAILED
    java.lang.RuntimeException at FlattenTest.java:118

org.apache.beam.sdk.transforms.ViewTest > testMultimapSideInput FAILED
    java.lang.RuntimeException at ViewTest.java:543

org.apache.beam.sdk.transforms.CombineTest$WindowingTests > testFixedWindowsCombineWithContext
FAILED
    java.lang.RuntimeException at CombineTest.java:1072

org.apache.beam.sdk.transforms.ReifyTimestampsTest > inValuesSucceeds FAILED
    java.lang.RuntimeException at ReifyTimestampsTest.java:60

org.apache.beam.sdk.testing.PAssertTest > testContainsInAnyOrder FAILED
    java.lang.RuntimeException at PAssertTest.java:396

org.apache.beam.sdk.transforms.ParDoTest$MultipleInputsAndOutputTests > testParDoEmptyWithTaggedOutput
FAILED
    java.lang.RuntimeException at ParDoTest.java:634

org.apache.beam.sdk.transforms.ParDoTest$MultipleInputsAndOutputTests > testParDoWithTaggedOutput
FAILED
    java.lang.RuntimeException at ParDoTest.java:592

org.apache.beam.sdk.transforms.FlattenTest > testFlattenMultiplePCollectionsHavingMultipleConsumers
FAILED
    java.lang.RuntimeException at FlattenTest.java:347

org.apache.beam.sdk.transforms.ViewTest > testEmptyIterableSideInput FAILED
    java.lang.RuntimeException at ViewTest.java:470

org.apache.beam.sdk.transforms.CombineTest$WindowingTests > testSessionsCombineWithContext
FAILED
    java.lang.RuntimeException at CombineTest.java:1286

org.apache.beam.sdk.testing.PAssertTest > testNotEqualTo FAILED
    java.lang.RuntimeException at PAssertTest.java:355

org.apache.beam.sdk.transforms.ParDoTest$MultipleInputsAndOutputTests > testMultiOutputParDoWithSideInputsIsCumulative
FAILED
    java.lang.RuntimeException at ParDoTest.java:847

org.apache.beam.sdk.transforms.FlattenTest > testFlattenIterables FAILED
    java.lang.RuntimeException at FlattenTest.java:252

org.apache.beam.sdk.transforms.ViewTest > testSideInputWithNestedIterables FAILED
    java.lang.RuntimeException at ViewTest.java:1539

org.apache.beam.sdk.testing.PAssertTest > testGlobalWindowContainsInAnyOrder FAILED
    java.lang.RuntimeException at PAssertTest.java:405

org.apache.beam.sdk.transforms.ParDoTest$MultipleInputsAndOutputTests > testParDoWithEmptyTaggedOutput
FAILED
    java.lang.RuntimeException at ParDoTest.java:658

org.apache.beam.sdk.transforms.FlattenTest > testFlattenIterablesSets FAILED
    java.lang.RuntimeException at FlattenTest.java:280

org.apache.beam.sdk.transforms.ViewTest > testListSideInput FAILED
    java.lang.RuntimeException at ViewTest.java:241

org.apache.beam.sdk.transforms.ParDoTest$MultipleInputsAndOutputTests > testParDoWithSideInputs
FAILED
    java.lang.RuntimeException at ParDoTest.java:737

org.apache.beam.sdk.testing.PAssertTest > testEmptyFalseDefaultReasonString FAILED
    java.lang.AssertionError at PAssertTest.java:500

org.apache.beam.sdk.transforms.FlattenTest > testFlattenPCollectionsEmptyThenParDo FAILED
    java.lang.RuntimeException at FlattenTest.java:224

org.apache.beam.sdk.transforms.ViewTest > testMapSideInput FAILED
    java.lang.RuntimeException at ViewTest.java:945

org.apache.beam.sdk.testing.PAssertTest > testAssertionSiteIsCapturedWithoutMessage FAILED
    java.lang.AssertionError at PAssertTest.java:541

org.apache.beam.sdk.transforms.ViewTest > testWindowedSideInputFixedToFixedWithDefault
FAILED
    java.lang.RuntimeException at ViewTest.java:1455

org.apache.beam.sdk.transforms.ParDoTest$MultipleInputsAndOutputTests > testParDoWithSideInputsIsCumulative
FAILED
    java.lang.RuntimeException at ParDoTest.java:771

org.apache.beam.sdk.testing.PAssertTest > testWindowedIsEqualTo FAILED
    java.lang.RuntimeException at PAssertTest.java:346

org.apache.beam.sdk.transforms.ViewTest > testWindowedIterableSideInput FAILED
    java.lang.RuntimeException at ViewTest.java:442

org.apache.beam.sdk.testing.PAssertTest > testContainsInAnyOrderFalse FAILED
    java.lang.AssertionError at PAssertTest.java:467

org.apache.beam.sdk.transforms.ViewTest > testWindowedSideInputFixedToGlobal FAILED
    java.lang.RuntimeException at ViewTest.java:1416

org.apache.beam.sdk.transforms.ViewTest > testEmptyMultimapSideInput FAILED
    java.lang.RuntimeException at ViewTest.java:830

org.apache.beam.sdk.transforms.ViewTest > testCombinedMapSideInput FAILED
    java.lang.RuntimeException at ViewTest.java:1334

org.apache.beam.sdk.transforms.ViewTest > testMultimapSideInputIsImmutable FAILED
    java.lang.RuntimeException at ViewTest.java:913

org.apache.beam.sdk.transforms.ViewTest > testWindowedMultimapAsEntrySetSideInput FAILED
    java.lang.RuntimeException at ViewTest.java:747

org.apache.beam.sdk.transforms.ViewTest > testWindowedSingletonSideInput FAILED
    java.lang.RuntimeException at ViewTest.java:152

org.apache.beam.sdk.transforms.ViewTest > testWindowedMultimapSideInput FAILED
    java.lang.RuntimeException at ViewTest.java:699

org.apache.beam.sdk.transforms.ViewTest > testSideInputWithNullDefault FAILED
    java.lang.RuntimeException at ViewTest.java:1484

org.apache.beam.sdk.transforms.ViewTest > testWindowedListSideInput FAILED
    java.lang.RuntimeException at ViewTest.java:290

org.apache.beam.sdk.transforms.ViewTest > testWindowedMapSideInput FAILED
    java.lang.RuntimeException at ViewTest.java:1056

org.apache.beam.sdk.transforms.ViewTest > testIterableSideInputIsImmutable FAILED
    java.lang.RuntimeException at ViewTest.java:505

org.apache.beam.sdk.transforms.ViewTest > testListSideInputIsImmutable FAILED
    java.lang.RuntimeException at ViewTest.java:368

org.apache.beam.sdk.transforms.ViewTest > testEmptyListSideInput FAILED
    java.lang.RuntimeException at ViewTest.java:319

org.apache.beam.sdk.transforms.ViewTest > testWindowedSideInputFixedToFixed FAILED
    java.lang.RuntimeException at ViewTest.java:1375

org.apache.beam.sdk.transforms.ViewTest > testIterableSideInput FAILED
    java.lang.RuntimeException at ViewTest.java:396

org.apache.beam.sdk.transforms.ViewTest > testEmptyMapSideInput FAILED
    java.lang.RuntimeException at ViewTest.java:1177

org.apache.beam.sdk.transforms.ViewTest > testMapSideInputIsImmutable FAILED
    java.lang.RuntimeException at ViewTest.java:1301

org.apache.beam.sdk.transforms.ViewTest > testWindowedMapAsEntrySetSideInput FAILED
    java.lang.RuntimeException at ViewTest.java:1099

org.apache.beam.sdk.transforms.ViewTest > testMultimapAsEntrySetSideInput FAILED
    java.lang.RuntimeException at ViewTest.java:581

org.apache.beam.sdk.transforms.ViewTest > testSingletonSideInput FAILED
    java.lang.RuntimeException at ViewTest.java:113

158 tests completed, 146 failed, 2 skipped

> Task :beam-runners-google-cloud-dataflow-java:validatesRunnerFnApiWorkerTest FAILED

> Task :beam-runners-google-cloud-dataflow-java:cleanUpDockerImages
Digests:
- us.gcr.io/apache-beam-testing/java-postcommit-it/java@sha256:95ce6ab5e3e67e9a97eea9435eb8bdbc980c8b60de359d0fb9f8e58eac5eac52
  Associated tags:
 - 20190328155146
Tags:
- us.gcr.io/apache-beam-testing/java-postcommit-it/java:20190328155146
Deleted [us.gcr.io/apache-beam-testing/java-postcommit-it/java:20190328155146].
Deleted [us.gcr.io/apache-beam-testing/java-postcommit-it/java@sha256:95ce6ab5e3e67e9a97eea9435eb8bdbc980c8b60de359d0fb9f8e58eac5eac52].

FAILURE: Build failed with an exception.

* What went wrong:
Execution failed for task ':beam-runners-google-cloud-dataflow-java:validatesRunnerFnApiWorkerTest'.
> There were failing tests. See the report at: file://<https://builds.apache.org/job/beam_PostCommit_Java11_ValidatesRunner_PortabilityApi_Dataflow/ws/src/runners/google-cloud-dataflow-java/build/reports/tests/validatesRunnerFnApiWorkerTest/index.html>

* Try:
Run with --stacktrace option to get the stack trace. Run with --info or --debug option to
get more log output. Run with --scan to get full insights.

* Get more help at https://help.gradle.org

Deprecated Gradle features were used in this build, making it incompatible with Gradle 6.0.
Use '--warning-mode all' to show the individual deprecation warnings.
See https://docs.gradle.org/5.2.1/userguide/command_line_interface.html#sec:command_line_warnings

BUILD FAILED in 24m 11s
76 actionable tasks: 74 executed, 1 from cache, 1 up-to-date

Publishing build scan...
https://gradle.com/s/mj3ugrgvk6rwg

Build step 'Invoke Gradle script' changed build result to FAILURE
Build step 'Invoke Gradle script' marked build as failure

---------------------------------------------------------------------
To unsubscribe, e-mail: builds-unsubscribe@beam.apache.org
For additional commands, e-mail: builds-help@beam.apache.org


Mime
View raw message