beam-builds mailing list archives

Site index · List index
Message view « Date » · « Thread »
Top « Date » · « Thread »
From Apache Jenkins Server <jenk...@builds.apache.org>
Subject Build failed in Jenkins: beam_PostCommit_Java_PVR_Reference #191
Date Sat, 02 Mar 2019 00:22:19 GMT
See <https://builds.apache.org/job/beam_PostCommit_Java_PVR_Reference/191/display/redirect>

------------------------------------------
[...truncated 47.00 KB...]
Note: Recompile with -Xlint:deprecation for details.
Note: Some input files use unchecked or unsafe operations.
Note: Recompile with -Xlint:unchecked for details.

> Task :beam-runners-reference-java:shadowTestJar
> Task :beam-runners-direct-java:testClasses
> Task :beam-sdks-go:installDependencies
> Task :beam-runners-direct-java:shadowTestJar
> Task :beam-sdks-go:buildLinuxAmd64
> Task :beam-sdks-go:goBuild

> Task :beam-sdks-java-container:resolveBuildDependencies
Resolving ./github.com/apache/beam/sdks/go@<https://builds.apache.org/job/beam_PostCommit_Java_PVR_Reference/ws/src/sdks/go>

> Task :beam-sdks-java-container:installDependencies
> Task :beam-sdks-java-container:buildLinuxAmd64
> Task :beam-sdks-java-container:goBuild
> Task :beam-sdks-java-container:dockerPrepare
> Task :beam-sdks-java-container:docker
> Task :beam-runners-direct-java:validatesPortableRunner

org.apache.beam.sdk.testing.PAssertTest > testEmpty FAILED
    org.apache.beam.vendor.grpc.v1p13p1.io.grpc.StatusRuntimeException at PAssertTest.java:451

org.apache.beam.sdk.testing.PAssertTest > testWindowedContainsInAnyOrder FAILED
    org.apache.beam.vendor.grpc.v1p13p1.io.grpc.StatusRuntimeException at PAssertTest.java:441

org.apache.beam.sdk.testing.PAssertTest > testContainsInAnyOrder FAILED
    org.apache.beam.vendor.grpc.v1p13p1.io.grpc.StatusRuntimeException at PAssertTest.java:396

org.apache.beam.sdk.testing.PAssertTest > testContainsInAnyOrderNotSerializable FAILED
    org.apache.beam.vendor.grpc.v1p13p1.io.grpc.StatusRuntimeException at PAssertTest.java:182

org.apache.beam.sdk.testing.PAssertTest > testSerializablePredicate FAILED
    org.apache.beam.vendor.grpc.v1p13p1.io.grpc.StatusRuntimeException at PAssertTest.java:203

org.apache.beam.sdk.testing.PAssertTest > testGlobalWindowContainsInAnyOrder FAILED
    org.apache.beam.vendor.grpc.v1p13p1.io.grpc.StatusRuntimeException at PAssertTest.java:405

org.apache.beam.sdk.testing.PAssertTest > testWindowedSerializablePredicate FAILED
    org.apache.beam.vendor.grpc.v1p13p1.io.grpc.StatusRuntimeException at PAssertTest.java:237

org.apache.beam.sdk.values.PCollectionTupleTest > testComposePCollectionTuple FAILED
    org.apache.beam.vendor.grpc.v1p13p1.io.grpc.StatusRuntimeException at PCollectionTupleTest.java:106

org.apache.beam.sdk.transforms.CombineFnsTest > testComposedCombineNullValues FAILED
    org.apache.beam.vendor.grpc.v1p13p1.io.grpc.StatusRuntimeException at CombineFnsTest.java:251

org.apache.beam.sdk.transforms.KeysTest > testKeys FAILED
    org.apache.beam.vendor.grpc.v1p13p1.io.grpc.StatusRuntimeException at KeysTest.java:60

org.apache.beam.sdk.transforms.KeysTest > testKeysEmpty FAILED
    org.apache.beam.vendor.grpc.v1p13p1.io.grpc.StatusRuntimeException at KeysTest.java:73

org.apache.beam.sdk.transforms.KvSwapTest > testKvSwap FAILED
    org.apache.beam.vendor.grpc.v1p13p1.io.grpc.StatusRuntimeException at KvSwapTest.java:77

org.apache.beam.sdk.transforms.GroupByKeyTest$WindowTests > testGroupByKeyMergingWindows
FAILED
    org.apache.beam.vendor.grpc.v1p13p1.io.grpc.StatusRuntimeException at GroupByKeyTest.java:480

org.apache.beam.sdk.transforms.GroupByKeyTest$WindowTests > testGroupByKeyMultipleWindows
FAILED
    org.apache.beam.vendor.grpc.v1p13p1.io.grpc.StatusRuntimeException at GroupByKeyTest.java:452

org.apache.beam.sdk.transforms.GroupByKeyTest$WindowTests > testGroupByKeyAndWindows FAILED
    org.apache.beam.vendor.grpc.v1p13p1.io.grpc.StatusRuntimeException at GroupByKeyTest.java:422

org.apache.beam.sdk.transforms.GroupByKeyTest$BasicTests > testLargeKeys1MB FAILED
    org.apache.beam.vendor.grpc.v1p13p1.io.grpc.StatusRuntimeException at GroupByKeyTest.java:365

org.apache.beam.sdk.transforms.GroupByKeyTest$BasicTests > testTimestampCombinerLatest
FAILED
    org.apache.beam.vendor.grpc.v1p13p1.io.grpc.StatusRuntimeException at GroupByKeyTest.java:290

org.apache.beam.sdk.transforms.GroupByKeyTest$BasicTests > testTimestampCombinerEarliest
FAILED
    org.apache.beam.vendor.grpc.v1p13p1.io.grpc.StatusRuntimeException at GroupByKeyTest.java:270

org.apache.beam.sdk.transforms.GroupByKeyTest$BasicTests > testGroupByKey FAILED
    org.apache.beam.vendor.grpc.v1p13p1.io.grpc.StatusRuntimeException at GroupByKeyTest.java:128

org.apache.beam.sdk.transforms.GroupByKeyTest$BasicTests > testGroupByKeyWithBadEqualsHashCode
FAILED
    org.apache.beam.vendor.grpc.v1p13p1.io.grpc.StatusRuntimeException at GroupByKeyTest.java:347

org.apache.beam.sdk.transforms.ImpulseTest > testImpulse FAILED
    org.apache.beam.vendor.grpc.v1p13p1.io.grpc.StatusRuntimeException at ImpulseTest.java:47

org.apache.beam.sdk.transforms.ReshuffleTest > testReshuffleAfterFixedWindowsAndGroupByKey
FAILED
    org.apache.beam.vendor.grpc.v1p13p1.io.grpc.StatusRuntimeException at ReshuffleTest.java:190

org.apache.beam.sdk.transforms.ReshuffleTest > testReshuffleAfterSlidingWindows FAILED
    org.apache.beam.vendor.grpc.v1p13p1.io.grpc.StatusRuntimeException at ReshuffleTest.java:251

org.apache.beam.sdk.transforms.ReshuffleTest > testReshuffleAfterSlidingWindowsAndGroupByKey
FAILED
    org.apache.beam.vendor.grpc.v1p13p1.io.grpc.StatusRuntimeException at ReshuffleTest.java:211

org.apache.beam.sdk.transforms.ReshuffleTest > testJustReshuffle FAILED
    org.apache.beam.vendor.grpc.v1p13p1.io.grpc.StatusRuntimeException at ReshuffleTest.java:102

org.apache.beam.sdk.transforms.CombineTest$BasicTests > testCombinePerKeyInstanceMethodReference
FAILED
    org.apache.beam.vendor.grpc.v1p13p1.io.grpc.StatusRuntimeException at CombineTest.java:921

org.apache.beam.sdk.transforms.CombineTest$BasicTests > testCombinePerKeyLambda FAILED
    org.apache.beam.vendor.grpc.v1p13p1.io.grpc.StatusRuntimeException at CombineTest.java:907

org.apache.beam.sdk.transforms.CombineTest$BasicTests > testHotKeyCombining FAILED
    org.apache.beam.vendor.grpc.v1p13p1.io.grpc.StatusRuntimeException at CombineTest.java:736

org.apache.beam.sdk.transforms.CombineTest$BasicTests > testHotKeyCombiningWithAccumulationMode
FAILED
    org.apache.beam.vendor.grpc.v1p13p1.io.grpc.StatusRuntimeException at CombineTest.java:761

org.apache.beam.sdk.transforms.CombineTest$WindowingTests > testSessionsCombine FAILED
    org.apache.beam.vendor.grpc.v1p13p1.io.grpc.StatusRuntimeException at CombineTest.java:1235

org.apache.beam.sdk.transforms.ParDoTest$TimestampTests > testParDoShiftTimestamp FAILED
    org.apache.beam.vendor.grpc.v1p13p1.io.grpc.StatusRuntimeException at ParDoTest.java:1303

org.apache.beam.sdk.transforms.ParDoTest$TimestampTests > testParDoShiftTimestampUnlimited
FAILED
    org.apache.beam.vendor.grpc.v1p13p1.io.grpc.StatusRuntimeException at ParDoTest.java:1392

org.apache.beam.sdk.transforms.FlattenTest > testFlattenIterablesEmpty FAILED
    org.apache.beam.vendor.grpc.v1p13p1.io.grpc.StatusRuntimeException at FlattenTest.java:312

org.apache.beam.sdk.transforms.FlattenTest > testFlattenInputMultipleCopies FAILED
    org.apache.beam.vendor.grpc.v1p13p1.io.grpc.StatusRuntimeException at FlattenTest.java:162

org.apache.beam.sdk.transforms.FlattenTest > testFlattenPCollectionsEmpty FAILED
    org.apache.beam.vendor.grpc.v1p13p1.io.grpc.StatusRuntimeException at FlattenTest.java:130

org.apache.beam.sdk.transforms.FlattenTest > testFlattenPCollectionsSingletonList FAILED
    org.apache.beam.vendor.grpc.v1p13p1.io.grpc.StatusRuntimeException at FlattenTest.java:104

org.apache.beam.sdk.transforms.FlattenTest > testFlattenPCollectionsThenParDo FAILED
    org.apache.beam.vendor.grpc.v1p13p1.io.grpc.StatusRuntimeException at FlattenTest.java:118

org.apache.beam.sdk.transforms.FlattenTest > testFlattenMultiplePCollectionsHavingMultipleConsumers
FAILED
    org.apache.beam.vendor.grpc.v1p13p1.io.grpc.StatusRuntimeException at FlattenTest.java:347

org.apache.beam.sdk.transforms.FlattenTest > testFlattenIterables FAILED
    org.apache.beam.vendor.grpc.v1p13p1.io.grpc.StatusRuntimeException at FlattenTest.java:252

org.apache.beam.sdk.transforms.FlattenTest > testFlattenIterablesSets FAILED
    org.apache.beam.vendor.grpc.v1p13p1.io.grpc.StatusRuntimeException at FlattenTest.java:280

org.apache.beam.sdk.transforms.ParDoTest$BasicTests > testParDo FAILED
    org.apache.beam.vendor.grpc.v1p13p1.io.grpc.StatusRuntimeException at ParDoTest.java:346

org.apache.beam.sdk.transforms.ParDoTest$BasicTests > testPipelineOptionsParameter FAILED
    org.apache.beam.vendor.grpc.v1p13p1.io.grpc.StatusRuntimeException at ParDoTest.java:544

org.apache.beam.sdk.transforms.ParDoTest$BasicTests > testParDoEmpty FAILED
    org.apache.beam.vendor.grpc.v1p13p1.io.grpc.StatusRuntimeException at ParDoTest.java:362

org.apache.beam.sdk.transforms.ParDoTest$BasicTests > testParDoInCustomTransform FAILED
    org.apache.beam.vendor.grpc.v1p13p1.io.grpc.StatusRuntimeException at ParDoTest.java:408

org.apache.beam.sdk.transforms.ParDoTest$BasicTests > testParDoEmptyOutputs FAILED
    org.apache.beam.vendor.grpc.v1p13p1.io.grpc.StatusRuntimeException at ParDoTest.java:378

org.apache.beam.sdk.transforms.CreateTest > testCreateEmpty FAILED
    org.apache.beam.vendor.grpc.v1p13p1.io.grpc.StatusRuntimeException at CreateTest.java:101

org.apache.beam.sdk.transforms.CreateTest > testCreateWithVoidType FAILED
    org.apache.beam.vendor.grpc.v1p13p1.io.grpc.StatusRuntimeException at CreateTest.java:325

org.apache.beam.sdk.transforms.ParDoSchemaTest > testSchemasPassedThrough FAILED
    org.apache.beam.vendor.grpc.v1p13p1.io.grpc.StatusRuntimeException at ParDoSchemaTest.java:408

org.apache.beam.sdk.transforms.ParDoSchemaTest > testInferredSchemaPipeline FAILED
    org.apache.beam.vendor.grpc.v1p13p1.io.grpc.StatusRuntimeException at ParDoSchemaTest.java:395

org.apache.beam.sdk.transforms.ParDoSchemaTest > testFieldAccessSchemaPipeline FAILED
    org.apache.beam.vendor.grpc.v1p13p1.io.grpc.StatusRuntimeException at ParDoSchemaTest.java:316

org.apache.beam.sdk.transforms.ParDoSchemaTest > testSimpleSchemaPipeline FAILED
    org.apache.beam.vendor.grpc.v1p13p1.io.grpc.StatusRuntimeException at ParDoSchemaTest.java:90

org.apache.beam.sdk.transforms.ParDoSchemaTest > testSchemaConversionPipeline FAILED
    org.apache.beam.vendor.grpc.v1p13p1.io.grpc.StatusRuntimeException at ParDoSchemaTest.java:443

org.apache.beam.sdk.transforms.ParDoSchemaTest > testReadAndWriteWithSchemaRegistry FAILED
    org.apache.beam.vendor.grpc.v1p13p1.io.grpc.StatusRuntimeException at ParDoSchemaTest.java:281

org.apache.beam.sdk.transforms.ParDoSchemaTest > testReadAndWriteMultiOutput FAILED
    org.apache.beam.vendor.grpc.v1p13p1.io.grpc.StatusRuntimeException at ParDoSchemaTest.java:236

org.apache.beam.sdk.transforms.ParDoTest$MultipleInputsAndOutputTests > testParDoWithOnlyTaggedOutput
FAILED
    org.apache.beam.vendor.grpc.v1p13p1.io.grpc.StatusRuntimeException at ParDoTest.java:687

org.apache.beam.sdk.transforms.ParDoTest$MultipleInputsAndOutputTests > testParDoEmptyWithTaggedOutput
FAILED
    org.apache.beam.vendor.grpc.v1p13p1.io.grpc.StatusRuntimeException at ParDoTest.java:634

org.apache.beam.sdk.transforms.ParDoTest$MultipleInputsAndOutputTests > testParDoWithTaggedOutput
FAILED
    org.apache.beam.vendor.grpc.v1p13p1.io.grpc.StatusRuntimeException at ParDoTest.java:592

org.apache.beam.sdk.transforms.ParDoTest$MultipleInputsAndOutputTests > testParDoWithEmptyTaggedOutput
FAILED
    org.apache.beam.vendor.grpc.v1p13p1.io.grpc.StatusRuntimeException at ParDoTest.java:658

org.apache.beam.sdk.transforms.ParDoTest$LifecycleTests > testWindowingInStartAndFinishBundle
FAILED
    org.apache.beam.vendor.grpc.v1p13p1.io.grpc.StatusRuntimeException at ParDoTest.java:1220

org.apache.beam.sdk.transforms.windowing.WindowingTest > testMergingWindowing FAILED
    org.apache.beam.vendor.grpc.v1p13p1.io.grpc.StatusRuntimeException at WindowingTest.java:168

org.apache.beam.sdk.transforms.windowing.WindowingTest > testPartitioningWindowing FAILED
    org.apache.beam.vendor.grpc.v1p13p1.io.grpc.StatusRuntimeException at WindowingTest.java:126

org.apache.beam.sdk.transforms.windowing.WindowTest > testTimestampCombinerEndOfWindow
FAILED
    org.apache.beam.vendor.grpc.v1p13p1.io.grpc.StatusRuntimeException at WindowTest.java:498

org.apache.beam.sdk.transforms.WithTimestampsTest > withTimestampsShouldApplyTimestamps
FAILED
    org.apache.beam.vendor.grpc.v1p13p1.io.grpc.StatusRuntimeException at WithTimestampsTest.java:78

org.apache.beam.sdk.transforms.WithTimestampsTest > withTimestampsBackwardsInTimeAndWithAllowedTimestampSkewShouldSucceed
FAILED
    org.apache.beam.vendor.grpc.v1p13p1.io.grpc.StatusRuntimeException at WithTimestampsTest.java:142

org.apache.beam.sdk.transforms.WithTimestampsTest > withTimestampsLambdaShouldApplyTimestamps
FAILED
    org.apache.beam.vendor.grpc.v1p13p1.io.grpc.StatusRuntimeException at WithTimestampsTest.java:205

org.apache.beam.sdk.transforms.ReifyTimestampsTest > extractFromValuesWhenValueTimestampedLaterSucceeds
FAILED
    org.apache.beam.vendor.grpc.v1p13p1.io.grpc.StatusRuntimeException at ReifyTimestampsTest.java:128

org.apache.beam.sdk.transforms.ReifyTimestampsTest > extractFromValuesSucceeds FAILED
    org.apache.beam.vendor.grpc.v1p13p1.io.grpc.StatusRuntimeException at ReifyTimestampsTest.java:92

102 tests completed, 67 failed, 1 skipped

> Task :beam-runners-direct-java:validatesPortableRunner FAILED

FAILURE: Build failed with an exception.

* What went wrong:
Execution failed for task ':beam-runners-direct-java:validatesPortableRunner'.
> There were failing tests. See the report at: file://<https://builds.apache.org/job/beam_PostCommit_Java_PVR_Reference/ws/src/runners/direct-java/build/reports/tests/validatesPortableRunner/index.html>

* Try:
Run with --stacktrace option to get the stack trace. Run with --info or --debug option to
get more log output. Run with --scan to get full insights.

* Get more help at https://help.gradle.org

Deprecated Gradle features were used in this build, making it incompatible with Gradle 6.0.
Use '--warning-mode all' to show the individual deprecation warnings.
See https://docs.gradle.org/5.2.1/userguide/command_line_interface.html#sec:command_line_warnings

BUILD FAILED in 22m 3s
72 actionable tasks: 54 executed, 17 from cache, 1 up-to-date

Publishing build scan...
https://gradle.com/s/x5qexiqhcmjb4

Build step 'Invoke Gradle script' changed build result to FAILURE
Build step 'Invoke Gradle script' marked build as failure

---------------------------------------------------------------------
To unsubscribe, e-mail: builds-unsubscribe@beam.apache.org
For additional commands, e-mail: builds-help@beam.apache.org


Mime
View raw message