beam-builds mailing list archives

Site index · List index
Message view « Date » · « Thread »
Top « Date » · « Thread »
From Apache Jenkins Server <jenk...@builds.apache.org>
Subject Build failed in Jenkins: beam_PostRelease_NightlySnapshot #568
Date Thu, 28 Mar 2019 11:17:36 GMT
See <https://builds.apache.org/job/beam_PostRelease_NightlySnapshot/568/display/redirect?page=changes>

Changes:

[github] Add link to dashboard to doc.

[github] Update contribution guide with links

[iemejia] [BEAM-6861] Add support to specify a query in CassandraIO

[iemejia] [BEAM-6861] Simplify code and javadoc on withQUery

[iemejia] [BEAM-6861] Miscellanous fixes on CassandraIO after static analysis

[github] Merge pull request #8093 from pabloem/sch-dest-bq

[iemejia] [BEAM-6324] Remove withWhere from CassandraIO (superceded by withQuery)

[mxm] [BEAM-6924] Prevent overflow for Flink bundle timeout

[github] Correct flag name in warning (#8138)

[amyrvold] Fix ./gradlew :beam-test-tools:goTest

[iemejia] [BEAM-6241] Add support for aggreagates using withQueryFn to MongoDbIO

------------------------------------------
[...truncated 3.97 MB...]
[INFO] Downloaded from central: https://repo.maven.apache.org/maven2/org/codehaus/plexus/plexus-component-annotations/1.6/plexus-component-annotations-1.6.jar
(4.3 kB at 80 kB/s)
[INFO] Downloading from central: https://repo.maven.apache.org/maven2/jdom/jdom/1.0/jdom-1.0.jar
[INFO] Downloaded from central: https://repo.maven.apache.org/maven2/net/sourceforge/jchardet/jchardet/1.0/jchardet-1.0.jar
(27 kB at 416 kB/s)
[INFO] Downloading from central: https://repo.maven.apache.org/maven2/org/apache/maven/maven-artifact/3.0/maven-artifact-3.0.jar
[INFO] Downloaded from central: https://repo.maven.apache.org/maven2/xml-apis/xml-apis/1.0.b2/xml-apis-1.0.b2.jar
(109 kB at 1.6 MB/s)
[INFO] Downloading from central: https://repo.maven.apache.org/maven2/org/apache/maven/maven-settings-builder/3.0/maven-settings-builder-3.0.jar
[INFO] Downloaded from central: https://repo.maven.apache.org/maven2/dom4j/dom4j/1.6.1/dom4j-1.6.1.jar
(314 kB at 4.4 MB/s)
[INFO] Downloading from central: https://repo.maven.apache.org/maven2/commons-io/commons-io/2.2/commons-io-2.2.jar
[INFO] Downloaded from central: https://repo.maven.apache.org/maven2/org/apache/maven/maven-settings-builder/3.0/maven-settings-builder-3.0.jar
(38 kB at 402 kB/s)
[INFO] Downloading from central: https://repo.maven.apache.org/maven2/org/codehaus/plexus/plexus-velocity/1.1.8/plexus-velocity-1.1.8.jar
[INFO] Downloaded from central: https://repo.maven.apache.org/maven2/org/apache/maven/archetype/archetype-common/3.0.1/archetype-common-3.0.1.jar
(331 kB at 3.3 MB/s)
[INFO] Downloaded from central: https://repo.maven.apache.org/maven2/org/apache/maven/maven-artifact/3.0/maven-artifact-3.0.jar
(52 kB at 530 kB/s)
[INFO] Downloading from central: https://repo.maven.apache.org/maven2/org/apache/velocity/velocity/1.7/velocity-1.7.jar
[INFO] Downloading from central: https://repo.maven.apache.org/maven2/commons-lang/commons-lang/2.4/commons-lang-2.4.jar
[INFO] Downloaded from central: https://repo.maven.apache.org/maven2/commons-io/commons-io/2.2/commons-io-2.2.jar
(174 kB at 1.6 MB/s)
[INFO] Downloading from central: https://repo.maven.apache.org/maven2/org/apache/maven/wagon/wagon-provider-api/2.8/wagon-provider-api-2.8.jar
[INFO] Downloaded from central: https://repo.maven.apache.org/maven2/jdom/jdom/1.0/jdom-1.0.jar
(153 kB at 1.3 MB/s)
[INFO] Downloading from central: https://repo.maven.apache.org/maven2/org/codehaus/groovy/groovy/1.8.3/groovy-1.8.3.jar
[INFO] Downloaded from central: https://repo.maven.apache.org/maven2/org/codehaus/plexus/plexus-velocity/1.1.8/plexus-velocity-1.1.8.jar
(7.9 kB at 66 kB/s)
[INFO] Downloading from central: https://repo.maven.apache.org/maven2/antlr/antlr/2.7.7/antlr-2.7.7.jar
[INFO] Downloaded from central: https://repo.maven.apache.org/maven2/org/apache/maven/wagon/wagon-provider-api/2.8/wagon-provider-api-2.8.jar
(53 kB at 392 kB/s)
[INFO] Downloading from central: https://repo.maven.apache.org/maven2/asm/asm/3.2/asm-3.2.jar
[INFO] Downloaded from central: https://repo.maven.apache.org/maven2/commons-lang/commons-lang/2.4/commons-lang-2.4.jar
(262 kB at 1.8 MB/s)
[INFO] Downloading from central: https://repo.maven.apache.org/maven2/asm/asm-commons/3.2/asm-commons-3.2.jar
[INFO] Downloaded from central: https://repo.maven.apache.org/maven2/org/apache/velocity/velocity/1.7/velocity-1.7.jar
(450 kB at 2.7 MB/s)
[INFO] Downloading from central: https://repo.maven.apache.org/maven2/asm/asm-util/3.2/asm-util-3.2.jar
[INFO] Downloaded from central: https://repo.maven.apache.org/maven2/asm/asm/3.2/asm-3.2.jar
(43 kB at 261 kB/s)
[INFO] Downloading from central: https://repo.maven.apache.org/maven2/asm/asm-analysis/3.2/asm-analysis-3.2.jar
[INFO] Downloaded from central: https://repo.maven.apache.org/maven2/antlr/antlr/2.7.7/antlr-2.7.7.jar
(445 kB at 2.5 MB/s)
[INFO] Downloading from central: https://repo.maven.apache.org/maven2/asm/asm-tree/3.2/asm-tree-3.2.jar
[INFO] Downloaded from central: https://repo.maven.apache.org/maven2/asm/asm-commons/3.2/asm-commons-3.2.jar
(33 kB at 186 kB/s)
[INFO] Downloading from central: https://repo.maven.apache.org/maven2/org/codehaus/plexus/plexus-utils/3.0.21/plexus-utils-3.0.21.jar
[INFO] Downloaded from central: https://repo.maven.apache.org/maven2/asm/asm-util/3.2/asm-util-3.2.jar
(37 kB at 191 kB/s)
[INFO] Downloading from central: https://repo.maven.apache.org/maven2/org/codehaus/plexus/plexus-interactivity-api/1.0-alpha-6/plexus-interactivity-api-1.0-alpha-6.jar
[INFO] Downloaded from central: https://repo.maven.apache.org/maven2/asm/asm-analysis/3.2/asm-analysis-3.2.jar
(18 kB at 93 kB/s)
[INFO] Downloading from central: https://repo.maven.apache.org/maven2/org/apache/maven/maven-plugin-api/3.0/maven-plugin-api-3.0.jar
[INFO] Downloaded from central: https://repo.maven.apache.org/maven2/asm/asm-tree/3.2/asm-tree-3.2.jar
(22 kB at 106 kB/s)
[INFO] Downloading from central: https://repo.maven.apache.org/maven2/org/sonatype/sisu/sisu-inject-plexus/1.4.2/sisu-inject-plexus-1.4.2.jar
[INFO] Downloaded from central: https://repo.maven.apache.org/maven2/org/codehaus/plexus/plexus-interactivity-api/1.0-alpha-6/plexus-interactivity-api-1.0-alpha-6.jar
(12 kB at 54 kB/s)
[INFO] Downloading from central: https://repo.maven.apache.org/maven2/org/sonatype/sisu/sisu-inject-bean/1.4.2/sisu-inject-bean-1.4.2.jar
[INFO] Downloaded from central: https://repo.maven.apache.org/maven2/org/apache/maven/maven-plugin-api/3.0/maven-plugin-api-3.0.jar
(49 kB at 222 kB/s)
[INFO] Downloading from central: https://repo.maven.apache.org/maven2/org/sonatype/sisu/sisu-guice/2.1.7/sisu-guice-2.1.7-noaop.jar
[INFO] Downloaded from central: https://repo.maven.apache.org/maven2/org/codehaus/plexus/plexus-utils/3.0.21/plexus-utils-3.0.21.jar
(245 kB at 1.1 MB/s)
[INFO] Downloading from central: https://repo.maven.apache.org/maven2/org/apache/maven/maven-core/3.0/maven-core-3.0.jar
[INFO] Downloaded from central: https://repo.maven.apache.org/maven2/org/sonatype/sisu/sisu-inject-plexus/1.4.2/sisu-inject-plexus-1.4.2.jar
(202 kB at 830 kB/s)
[INFO] Downloading from central: https://repo.maven.apache.org/maven2/org/apache/maven/maven-repository-metadata/3.0/maven-repository-metadata-3.0.jar
[INFO] Downloaded from central: https://repo.maven.apache.org/maven2/org/sonatype/sisu/sisu-inject-bean/1.4.2/sisu-inject-bean-1.4.2.jar
(153 kB at 586 kB/s)
[INFO] Downloading from central: https://repo.maven.apache.org/maven2/org/apache/maven/maven-model-builder/3.0/maven-model-builder-3.0.jar
[INFO] Downloaded from central: https://repo.maven.apache.org/maven2/org/apache/maven/maven-repository-metadata/3.0/maven-repository-metadata-3.0.jar
(30 kB at 110 kB/s)
[INFO] Downloading from central: https://repo.maven.apache.org/maven2/org/apache/maven/maven-aether-provider/3.0/maven-aether-provider-3.0.jar
[INFO] Downloaded from central: https://repo.maven.apache.org/maven2/org/sonatype/sisu/sisu-guice/2.1.7/sisu-guice-2.1.7-noaop.jar
(472 kB at 1.7 MB/s)
[INFO] Downloading from central: https://repo.maven.apache.org/maven2/org/sonatype/aether/aether-impl/1.7/aether-impl-1.7.jar
[INFO] Downloaded from central: https://repo.maven.apache.org/maven2/org/apache/maven/maven-core/3.0/maven-core-3.0.jar
(527 kB at 1.8 MB/s)
[INFO] Downloading from central: https://repo.maven.apache.org/maven2/org/sonatype/aether/aether-spi/1.7/aether-spi-1.7.jar
[INFO] Downloaded from central: https://repo.maven.apache.org/maven2/org/apache/maven/maven-model-builder/3.0/maven-model-builder-3.0.jar
(148 kB at 497 kB/s)
[INFO] Downloading from central: https://repo.maven.apache.org/maven2/org/sonatype/aether/aether-api/1.7/aether-api-1.7.jar
[INFO] Downloaded from central: https://repo.maven.apache.org/maven2/org/apache/maven/maven-aether-provider/3.0/maven-aether-provider-3.0.jar
(51 kB at 167 kB/s)
[INFO] Downloading from central: https://repo.maven.apache.org/maven2/org/sonatype/aether/aether-util/1.7/aether-util-1.7.jar
[INFO] Downloaded from central: https://repo.maven.apache.org/maven2/org/sonatype/aether/aether-spi/1.7/aether-spi-1.7.jar
(14 kB at 42 kB/s)
[INFO] Downloading from central: https://repo.maven.apache.org/maven2/org/codehaus/plexus/plexus-interpolation/1.14/plexus-interpolation-1.14.jar
[INFO] Downloaded from central: https://repo.maven.apache.org/maven2/org/sonatype/aether/aether-impl/1.7/aether-impl-1.7.jar
(106 kB at 331 kB/s)
[INFO] Downloading from central: https://repo.maven.apache.org/maven2/org/codehaus/plexus/plexus-classworlds/2.2.3/plexus-classworlds-2.2.3.jar
[INFO] Downloaded from central: https://repo.maven.apache.org/maven2/org/sonatype/aether/aether-api/1.7/aether-api-1.7.jar
(74 kB at 220 kB/s)
[INFO] Downloading from central: https://repo.maven.apache.org/maven2/org/sonatype/plexus/plexus-sec-dispatcher/1.3/plexus-sec-dispatcher-1.3.jar
[INFO] Downloaded from central: https://repo.maven.apache.org/maven2/org/sonatype/aether/aether-util/1.7/aether-util-1.7.jar
(108 kB at 311 kB/s)
[INFO] Downloading from central: https://repo.maven.apache.org/maven2/org/sonatype/plexus/plexus-cipher/1.4/plexus-cipher-1.4.jar
[INFO] Downloaded from central: https://repo.maven.apache.org/maven2/org/codehaus/plexus/plexus-classworlds/2.2.3/plexus-classworlds-2.2.3.jar
(46 kB at 131 kB/s)
[INFO] Downloading from central: https://repo.maven.apache.org/maven2/org/apache/maven/maven-model/3.0/maven-model-3.0.jar
[INFO] Downloaded from central: https://repo.maven.apache.org/maven2/org/codehaus/plexus/plexus-interpolation/1.14/plexus-interpolation-1.14.jar
(61 kB at 173 kB/s)
[INFO] Downloading from central: https://repo.maven.apache.org/maven2/org/apache/maven/maven-settings/3.0/maven-settings-3.0.jar
[INFO] Downloaded from central: https://repo.maven.apache.org/maven2/org/sonatype/plexus/plexus-sec-dispatcher/1.3/plexus-sec-dispatcher-1.3.jar
(29 kB at 78 kB/s)
[INFO] Downloading from central: https://repo.maven.apache.org/maven2/org/apache/maven/shared/maven-invoker/2.2/maven-invoker-2.2.jar
[INFO] Downloaded from central: https://repo.maven.apache.org/maven2/org/sonatype/plexus/plexus-cipher/1.4/plexus-cipher-1.4.jar
(13 kB at 36 kB/s)
[INFO] Downloading from central: https://repo.maven.apache.org/maven2/org/apache/maven/shared/maven-artifact-transfer/0.9.0/maven-artifact-transfer-0.9.0.jar
[INFO] Downloaded from central: https://repo.maven.apache.org/maven2/org/apache/maven/maven-model/3.0/maven-model-3.0.jar
(165 kB at 421 kB/s)
[INFO] Downloading from central: https://repo.maven.apache.org/maven2/org/apache/maven/shared/maven-common-artifact-filters/3.0.0/maven-common-artifact-filters-3.0.0.jar
[INFO] Downloaded from central: https://repo.maven.apache.org/maven2/org/apache/maven/maven-settings/3.0/maven-settings-3.0.jar
(47 kB at 119 kB/s)
[INFO] Downloading from central: https://repo.maven.apache.org/maven2/org/apache/maven/shared/maven-shared-utils/3.0.0/maven-shared-utils-3.0.0.jar
[INFO] Downloaded from central: https://repo.maven.apache.org/maven2/org/apache/maven/shared/maven-invoker/2.2/maven-invoker-2.2.jar
(30 kB at 73 kB/s)
[INFO] Downloading from central: https://repo.maven.apache.org/maven2/com/google/code/findbugs/jsr305/2.0.1/jsr305-2.0.1.jar
[INFO] Downloaded from central: https://repo.maven.apache.org/maven2/org/apache/maven/shared/maven-artifact-transfer/0.9.0/maven-artifact-transfer-0.9.0.jar
(123 kB at 295 kB/s)
[INFO] Downloading from central: https://repo.maven.apache.org/maven2/commons-codec/commons-codec/1.6/commons-codec-1.6.jar
[INFO] Downloaded from central: https://repo.maven.apache.org/maven2/org/apache/maven/shared/maven-shared-utils/3.0.0/maven-shared-utils-3.0.0.jar
(155 kB at 357 kB/s)
[INFO] Downloading from central: https://repo.maven.apache.org/maven2/org/slf4j/slf4j-api/1.7.5/slf4j-api-1.7.5.jar
[INFO] Downloaded from central: https://repo.maven.apache.org/maven2/org/apache/maven/shared/maven-common-artifact-filters/3.0.0/maven-common-artifact-filters-3.0.0.jar
(57 kB at 131 kB/s)
[INFO] Downloading from central: https://repo.maven.apache.org/maven2/commons-collections/commons-collections/3.2.1/commons-collections-3.2.1.jar
[INFO] Downloaded from central: https://repo.maven.apache.org/maven2/com/google/code/findbugs/jsr305/2.0.1/jsr305-2.0.1.jar
(32 kB at 72 kB/s)
[INFO] Downloading from central: https://repo.maven.apache.org/maven2/org/apache/maven/shared/maven-script-interpreter/1.0/maven-script-interpreter-1.0.jar
[INFO] Downloaded from central: https://repo.maven.apache.org/maven2/commons-codec/commons-codec/1.6/commons-codec-1.6.jar
(233 kB at 504 kB/s)
[INFO] Downloaded from central: https://repo.maven.apache.org/maven2/org/slf4j/slf4j-api/1.7.5/slf4j-api-1.7.5.jar
(26 kB at 56 kB/s)
[INFO] Downloading from central: https://repo.maven.apache.org/maven2/org/beanshell/bsh/2.0b4/bsh-2.0b4.jar
[INFO] Downloading from central: https://repo.maven.apache.org/maven2/org/apache/ant/ant/1.8.1/ant-1.8.1.jar
[INFO] Downloaded from central: https://repo.maven.apache.org/maven2/org/apache/maven/shared/maven-script-interpreter/1.0/maven-script-interpreter-1.0.jar
(21 kB at 43 kB/s)
[INFO] Downloaded from central: https://repo.maven.apache.org/maven2/commons-collections/commons-collections/3.2.1/commons-collections-3.2.1.jar
(575 kB at 1.1 MB/s)
[INFO] Downloaded from central: https://repo.maven.apache.org/maven2/org/codehaus/groovy/groovy/1.8.3/groovy-1.8.3.jar
(5.5 MB at 10 MB/s)
[INFO] Downloaded from central: https://repo.maven.apache.org/maven2/org/beanshell/bsh/2.0b4/bsh-2.0b4.jar
(282 kB at 528 kB/s)
[INFO] Downloaded from central: https://repo.maven.apache.org/maven2/org/apache/ant/ant/1.8.1/ant-1.8.1.jar
(1.5 MB at 2.4 MB/s)
[INFO] Generating project in Batch mode
[INFO] Archetype repository not defined. Using the one from [org.apache.beam:beam-sdks-java-maven-archetypes-examples:2.11.0]
found in catalog remote
[INFO] Downloading from test.release: https://repository.apache.org/content/repositories/snapshots/org/apache/beam/beam-sdks-java-maven-archetypes-examples/2.12.0-SNAPSHOT/maven-metadata.xml
[INFO] Downloaded from test.release: https://repository.apache.org/content/repositories/snapshots/org/apache/beam/beam-sdks-java-maven-archetypes-examples/2.12.0-SNAPSHOT/maven-metadata.xml
(1.7 kB at 3.9 kB/s)
[INFO] Downloading from test.release: https://repository.apache.org/content/repositories/snapshots/org/apache/beam/beam-sdks-java-maven-archetypes-examples/2.12.0-SNAPSHOT/beam-sdks-java-maven-archetypes-examples-2.12.0-20190224.091202-8.pom
[INFO] Downloaded from test.release: https://repository.apache.org/content/repositories/snapshots/org/apache/beam/beam-sdks-java-maven-archetypes-examples/2.12.0-SNAPSHOT/beam-sdks-java-maven-archetypes-examples-2.12.0-20190224.091202-8.pom
(4.1 kB at 11 kB/s)
[INFO] Downloading from test.release: https://repository.apache.org/content/repositories/snapshots/org/apache/beam/beam-sdks-java-maven-archetypes-examples/2.12.0-SNAPSHOT/beam-sdks-java-maven-archetypes-examples-2.12.0-20190224.091202-8.jar
[INFO] Downloaded from test.release: https://repository.apache.org/content/repositories/snapshots/org/apache/beam/beam-sdks-java-maven-archetypes-examples/2.12.0-SNAPSHOT/beam-sdks-java-maven-archetypes-examples-2.12.0-20190224.091202-8.jar
(3.0 MB at 4.0 MB/s)
[INFO] ----------------------------------------------------------------------------
[INFO] Using following parameters for creating project from Archetype: beam-sdks-java-maven-archetypes-examples:2.12.0-SNAPSHOT
[INFO] ----------------------------------------------------------------------------
[INFO] Parameter: groupId, Value: org.example
[INFO] Parameter: artifactId, Value: word-count-beam
[INFO] Parameter: version, Value: 0.1
[INFO] Parameter: package, Value: org.apache.beam.examples
[INFO] Parameter: packageInPathFormat, Value: org/apache/beam/examples
[INFO] Parameter: package, Value: org.apache.beam.examples
[INFO] Parameter: version, Value: 0.1
[INFO] Parameter: groupId, Value: org.example
[INFO] Parameter: targetPlatform, Value: 1.8
[INFO] Parameter: artifactId, Value: word-count-beam
[INFO] Project created from Archetype in dir: /tmp/groovy-generated-1144607038285898024-tmpdir/word-count-beam
[INFO] ------------------------------------------------------------------------
[INFO] BUILD SUCCESS
[INFO] ------------------------------------------------------------------------
[INFO] Total time: 9.796 s
[INFO] Finished at: 2019-03-28T11:15:51Z
[INFO] Final Memory: 26M/1260M
[INFO] ------------------------------------------------------------------------
Verified [INFO] BUILD SUCCESS
cd word-count-beam
ls
pom.xml
src
Verified pom.xml
Verified src
ls src/main/java/org/apache/beam/examples/
common
complete
DebuggingWordCount.java
MinimalWordCount.java
subprocess
WindowedWordCount.java
WordCount.java
Verified WordCount.java
ls src/main/java/org/apache/beam/examples/complete/game/
GameStats.java
HourlyTeamScore.java
injector
LeaderBoard.java
StatefulTeamScore.java
UserScore.java
utils
Verified UserScore.java

**************************************
* Test: Runs the WordCount Code with Direct runner
**************************************

mvn compile exec:java -q       -Dexec.mainClass=org.apache.beam.examples.WordCount       -Dexec.args="--inputFile=pom.xml
--output=counts"       -Pdirect-runner
Using maven /home/jenkins/tools/maven/apache-maven-3.5.2
Mar 28, 2019 11:17:28 AM org.apache.beam.sdk.io.FileBasedSource getEstimatedSizeBytes
INFO: Filepattern pom.xml matched 1 files with total size 17300
Mar 28, 2019 11:17:28 AM org.apache.beam.sdk.io.FileBasedSource split
INFO: Splitting filepattern pom.xml into bundles of size 1081 took 1 ms and produced 1 files
and 16 bundles
Mar 28, 2019 11:17:31 AM org.apache.beam.sdk.io.WriteFiles$WriteShardsIntoTempFilesFn processElement
INFO: Opening writer 7f73107f-3568-4cb7-bfc5-2e3d4eef4d5e for window org.apache.beam.sdk.transforms.windowing.GlobalWindow@6ed09307
pane PaneInfo{isFirst=true, isLast=true, timing=ON_TIME, index=0, onTimeIndex=0} destination
null
Mar 28, 2019 11:17:31 AM org.apache.beam.sdk.io.WriteFiles$WriteShardsIntoTempFilesFn processElement
INFO: Opening writer f3849f4a-c3f0-4c25-9bf2-a9613d0f0d59 for window org.apache.beam.sdk.transforms.windowing.GlobalWindow@6ed09307
pane PaneInfo{isFirst=true, isLast=true, timing=ON_TIME, index=0, onTimeIndex=0} destination
null
Mar 28, 2019 11:17:31 AM org.apache.beam.sdk.io.FileBasedSink$Writer close
INFO: Successfully wrote temporary file /tmp/groovy-generated-1144607038285898024-tmpdir/word-count-beam/.temp-beam-2019-03-28_11-17-27-1/7f73107f-3568-4cb7-bfc5-2e3d4eef4d5e
Mar 28, 2019 11:17:31 AM org.apache.beam.sdk.io.WriteFiles$WriteShardsIntoTempFilesFn processElement
INFO: Opening writer 0bcb27d3-dccd-4cde-bd05-41f135d50d4b for window org.apache.beam.sdk.transforms.windowing.GlobalWindow@6ed09307
pane PaneInfo{isFirst=true, isLast=true, timing=ON_TIME, index=0, onTimeIndex=0} destination
null
Mar 28, 2019 11:17:31 AM org.apache.beam.sdk.io.WriteFiles$WriteShardsIntoTempFilesFn processElement
INFO: Opening writer a4666d7d-fb5d-45da-b253-93c55057e5b0 for window org.apache.beam.sdk.transforms.windowing.GlobalWindow@6ed09307
pane PaneInfo{isFirst=true, isLast=true, timing=ON_TIME, index=0, onTimeIndex=0} destination
null
Mar 28, 2019 11:17:31 AM org.apache.beam.sdk.io.FileBasedSink$Writer close
INFO: Successfully wrote temporary file /tmp/groovy-generated-1144607038285898024-tmpdir/word-count-beam/.temp-beam-2019-03-28_11-17-27-1/a4666d7d-fb5d-45da-b253-93c55057e5b0
Mar 28, 2019 11:17:31 AM org.apache.beam.sdk.io.WriteFiles$WriteShardsIntoTempFilesFn processElement
INFO: Opening writer e2226503-e1cc-4f39-82ab-be7611a64f25 for window org.apache.beam.sdk.transforms.windowing.GlobalWindow@6ed09307
pane PaneInfo{isFirst=true, isLast=true, timing=ON_TIME, index=0, onTimeIndex=0} destination
null
Mar 28, 2019 11:17:31 AM org.apache.beam.sdk.io.FileBasedSink$Writer close
INFO: Successfully wrote temporary file /tmp/groovy-generated-1144607038285898024-tmpdir/word-count-beam/.temp-beam-2019-03-28_11-17-27-1/f3849f4a-c3f0-4c25-9bf2-a9613d0f0d59
Mar 28, 2019 11:17:31 AM org.apache.beam.sdk.io.FileBasedSink$Writer close
INFO: Successfully wrote temporary file /tmp/groovy-generated-1144607038285898024-tmpdir/word-count-beam/.temp-beam-2019-03-28_11-17-27-1/e2226503-e1cc-4f39-82ab-be7611a64f25
Mar 28, 2019 11:17:31 AM org.apache.beam.sdk.io.FileBasedSink$Writer close
INFO: Successfully wrote temporary file /tmp/groovy-generated-1144607038285898024-tmpdir/word-count-beam/.temp-beam-2019-03-28_11-17-27-1/0bcb27d3-dccd-4cde-bd05-41f135d50d4b
Mar 28, 2019 11:17:31 AM org.apache.beam.sdk.io.WriteFiles$FinalizeTempFileBundles$FinalizeFn
process
INFO: Finalizing 5 file results
Mar 28, 2019 11:17:31 AM org.apache.beam.sdk.io.FileBasedSink$WriteOperation createMissingEmptyShards
INFO: Finalizing for destination null num shards 5.
Mar 28, 2019 11:17:31 AM org.apache.beam.sdk.io.FileBasedSink$WriteOperation moveToOutputFiles
INFO: Will copy temporary file FileResult{tempFilename=/tmp/groovy-generated-1144607038285898024-tmpdir/word-count-beam/.temp-beam-2019-03-28_11-17-27-1/0bcb27d3-dccd-4cde-bd05-41f135d50d4b,
shard=1, window=org.apache.beam.sdk.transforms.windowing.GlobalWindow@6ed09307, paneInfo=PaneInfo{isFirst=true,
isLast=true, timing=ON_TIME, index=0, onTimeIndex=0}} to final location /tmp/groovy-generated-1144607038285898024-tmpdir/word-count-beam/counts-00001-of-00005
Mar 28, 2019 11:17:31 AM org.apache.beam.sdk.io.FileBasedSink$WriteOperation moveToOutputFiles
INFO: Will copy temporary file FileResult{tempFilename=/tmp/groovy-generated-1144607038285898024-tmpdir/word-count-beam/.temp-beam-2019-03-28_11-17-27-1/a4666d7d-fb5d-45da-b253-93c55057e5b0,
shard=0, window=org.apache.beam.sdk.transforms.windowing.GlobalWindow@6ed09307, paneInfo=PaneInfo{isFirst=true,
isLast=true, timing=ON_TIME, index=0, onTimeIndex=0}} to final location /tmp/groovy-generated-1144607038285898024-tmpdir/word-count-beam/counts-00000-of-00005
Mar 28, 2019 11:17:31 AM org.apache.beam.sdk.io.FileBasedSink$WriteOperation moveToOutputFiles
INFO: Will copy temporary file FileResult{tempFilename=/tmp/groovy-generated-1144607038285898024-tmpdir/word-count-beam/.temp-beam-2019-03-28_11-17-27-1/f3849f4a-c3f0-4c25-9bf2-a9613d0f0d59,
shard=2, window=org.apache.beam.sdk.transforms.windowing.GlobalWindow@6ed09307, paneInfo=PaneInfo{isFirst=true,
isLast=true, timing=ON_TIME, index=0, onTimeIndex=0}} to final location /tmp/groovy-generated-1144607038285898024-tmpdir/word-count-beam/counts-00002-of-00005
Mar 28, 2019 11:17:31 AM org.apache.beam.sdk.io.FileBasedSink$WriteOperation moveToOutputFiles
INFO: Will copy temporary file FileResult{tempFilename=/tmp/groovy-generated-1144607038285898024-tmpdir/word-count-beam/.temp-beam-2019-03-28_11-17-27-1/e2226503-e1cc-4f39-82ab-be7611a64f25,
shard=4, window=org.apache.beam.sdk.transforms.windowing.GlobalWindow@6ed09307, paneInfo=PaneInfo{isFirst=true,
isLast=true, timing=ON_TIME, index=0, onTimeIndex=0}} to final location /tmp/groovy-generated-1144607038285898024-tmpdir/word-count-beam/counts-00004-of-00005
Mar 28, 2019 11:17:31 AM org.apache.beam.sdk.io.FileBasedSink$WriteOperation moveToOutputFiles
INFO: Will copy temporary file FileResult{tempFilename=/tmp/groovy-generated-1144607038285898024-tmpdir/word-count-beam/.temp-beam-2019-03-28_11-17-27-1/7f73107f-3568-4cb7-bfc5-2e3d4eef4d5e,
shard=3, window=org.apache.beam.sdk.transforms.windowing.GlobalWindow@6ed09307, paneInfo=PaneInfo{isFirst=true,
isLast=true, timing=ON_TIME, index=0, onTimeIndex=0}} to final location /tmp/groovy-generated-1144607038285898024-tmpdir/word-count-beam/counts-00003-of-00005
Mar 28, 2019 11:17:31 AM org.apache.beam.sdk.io.FileBasedSink$WriteOperation removeTemporaryFiles
INFO: Will remove known temporary file /tmp/groovy-generated-1144607038285898024-tmpdir/word-count-beam/.temp-beam-2019-03-28_11-17-27-1/f3849f4a-c3f0-4c25-9bf2-a9613d0f0d59
Mar 28, 2019 11:17:31 AM org.apache.beam.sdk.io.FileBasedSink$WriteOperation removeTemporaryFiles
INFO: Will remove known temporary file /tmp/groovy-generated-1144607038285898024-tmpdir/word-count-beam/.temp-beam-2019-03-28_11-17-27-1/7f73107f-3568-4cb7-bfc5-2e3d4eef4d5e
Mar 28, 2019 11:17:31 AM org.apache.beam.sdk.io.FileBasedSink$WriteOperation removeTemporaryFiles
INFO: Will remove known temporary file /tmp/groovy-generated-1144607038285898024-tmpdir/word-count-beam/.temp-beam-2019-03-28_11-17-27-1/a4666d7d-fb5d-45da-b253-93c55057e5b0
Mar 28, 2019 11:17:31 AM org.apache.beam.sdk.io.FileBasedSink$WriteOperation removeTemporaryFiles
INFO: Will remove known temporary file /tmp/groovy-generated-1144607038285898024-tmpdir/word-count-beam/.temp-beam-2019-03-28_11-17-27-1/0bcb27d3-dccd-4cde-bd05-41f135d50d4b
Mar 28, 2019 11:17:31 AM org.apache.beam.sdk.io.FileBasedSink$WriteOperation removeTemporaryFiles
INFO: Will remove known temporary file /tmp/groovy-generated-1144607038285898024-tmpdir/word-count-beam/.temp-beam-2019-03-28_11-17-27-1/e2226503-e1cc-4f39-82ab-be7611a64f25
Mar 28, 2019 11:17:31 AM org.apache.beam.sdk.io.FileBasedSink$WriteOperation removeTemporaryFiles
WARNING: Failed to match temporary files under: [/tmp/groovy-generated-1144607038285898024-tmpdir/word-count-beam/.temp-beam-2019-03-28_11-17-27-1/].
grep Foundation counts*
counts-00002-of-00005:Foundation: 1
Verified Foundation: 1
[SUCCESS]

FAILURE: Build completed with 2 failures.

1: Task failed with an exception.
-----------
* What went wrong:
Execution failed for task ':beam-runners-google-cloud-dataflow-java:runMobileGamingJavaDataflow'.
> Process 'command '/usr/local/asfpackages/java/jdk1.8.0_191/bin/java'' finished with non-zero
exit value 1

* Try:
Run with --stacktrace option to get the stack trace. Run with --info or --debug option to
get more log output. Run with --scan to get full insights.
==============================================================================

2: Task failed with an exception.
-----------
* What went wrong:
Execution failed for task ':beam-runners-google-cloud-dataflow-java:runQuickstartJavaDataflow'.
> Process 'command '/usr/local/asfpackages/java/jdk1.8.0_191/bin/java'' finished with non-zero
exit value 1

* Try:
Run with --stacktrace option to get the stack trace. Run with --info or --debug option to
get more log output. Run with --scan to get full insights.
==============================================================================

* Get more help at https://help.gradle.org

Deprecated Gradle features were used in this build, making it incompatible with Gradle 6.0.
Use '--warning-mode all' to show the individual deprecation warnings.
See https://docs.gradle.org/5.2.1/userguide/command_line_interface.html#sec:command_line_warnings

BUILD FAILED in 17m 22s
8 actionable tasks: 7 executed, 1 from cache

Publishing build scan...
https://gradle.com/s/as4lrudbmuyhg

Build step 'Invoke Gradle script' changed build result to FAILURE
Build step 'Invoke Gradle script' marked build as failure

---------------------------------------------------------------------
To unsubscribe, e-mail: builds-unsubscribe@beam.apache.org
For additional commands, e-mail: builds-help@beam.apache.org


Mime
View raw message