beam-builds mailing list archives

Site index · List index
Message view « Date » · « Thread »
Top « Date » · « Thread »
From Apache Jenkins Server <jenk...@builds.apache.org>
Subject Build failed in Jenkins: beam_PostCommit_Java11_ValidatesRunner_Direct #163
Date Thu, 28 Mar 2019 00:04:21 GMT
See <https://builds.apache.org/job/beam_PostCommit_Java11_ValidatesRunner_Direct/163/display/redirect>

------------------------------------------
Started by timer
[EnvInject] - Loading node environment variables.
Building remotely on beam13 (beam) in workspace <https://builds.apache.org/job/beam_PostCommit_Java11_ValidatesRunner_Direct/ws/>
No credentials specified
 > git rev-parse --is-inside-work-tree # timeout=10
Fetching changes from the remote Git repository
 > git config remote.origin.url https://github.com/apache/beam.git # timeout=10
Fetching upstream changes from https://github.com/apache/beam.git
 > git --version # timeout=10
 > git fetch --tags --progress https://github.com/apache/beam.git +refs/heads/*:refs/remotes/origin/*
+refs/pull/${ghprbPullId}/*:refs/remotes/origin/pr/${ghprbPullId}/*
 > git rev-parse origin/master^{commit} # timeout=10
Checking out Revision 1d9daf1aca101fa5a194cbbba969886734e08902 (origin/master)
 > git config core.sparsecheckout # timeout=10
 > git checkout -f 1d9daf1aca101fa5a194cbbba969886734e08902
Commit message: "Merge pull request #8154: [BEAM-6924] Prevent overflow for Flink bundle timeout"
 > git rev-list --no-walk 1d9daf1aca101fa5a194cbbba969886734e08902 # timeout=10
Cleaning workspace
 > git rev-parse --verify HEAD # timeout=10
Resetting working tree
 > git reset --hard # timeout=10
 > git clean -fdx # timeout=10
No emails were triggered.
[EnvInject] - Executing scripts and injecting environment variables after the SCM step.
[EnvInject] - Injecting as environment variables the properties content 
SPARK_LOCAL_IP=127.0.0.1

[EnvInject] - Variables injected successfully.
[Gradle] - Launching build.
[src] $ <https://builds.apache.org/job/beam_PostCommit_Java11_ValidatesRunner_Direct/ws/src/gradlew>
-Dorg.gradle.java.home=/home/jenkins/tools/java/latest1.8 :beam-runners-direct-java:shadowJar
:beam-runners-direct-java:shadowTestJar
To honour the JVM settings for this build a new JVM will be forked. Please consider using
the daemon: https://docs.gradle.org/5.2.1/userguide/gradle_daemon.html.
Daemon will be stopped at the end of the build stopping after processing
> Task :buildSrc:compileJava NO-SOURCE
> Task :buildSrc:compileGroovy FROM-CACHE
> Task :buildSrc:pluginDescriptors
> Task :buildSrc:processResources
> Task :buildSrc:classes
> Task :buildSrc:jar
> Task :buildSrc:assemble
> Task :buildSrc:spotlessGroovy
> Task :buildSrc:spotlessGroovyCheck
> Task :buildSrc:spotlessGroovyGradle
> Task :buildSrc:spotlessGroovyGradleCheck
> Task :buildSrc:spotlessCheck
> Task :buildSrc:pluginUnderTestMetadata
> Task :buildSrc:compileTestJava NO-SOURCE
> Task :buildSrc:compileTestGroovy NO-SOURCE
> Task :buildSrc:processTestResources NO-SOURCE
> Task :buildSrc:testClasses UP-TO-DATE
> Task :buildSrc:test NO-SOURCE
> Task :buildSrc:validateTaskProperties FROM-CACHE
> Task :buildSrc:check
> Task :buildSrc:build
Configuration on demand is an incubating feature.
> Task :beam-runners-direct-java:processResources NO-SOURCE
> Task :beam-runners-core-construction-java:processResources NO-SOURCE
> Task :beam-sdks-java-extensions-google-cloud-platform-core:processResources NO-SOURCE
> Task :beam-runners-core-java:processResources NO-SOURCE
> Task :beam-sdks-java-core:generateAvroProtocol NO-SOURCE
> Task :beam-sdks-java-harness:processResources NO-SOURCE
> Task :beam-runners-local-java-core:processResources NO-SOURCE
> Task :beam-sdks-java-fn-execution:processResources NO-SOURCE
> Task :beam-runners-java-fn-execution:processResources NO-SOURCE
> Task :beam-vendor-sdks-java-extensions-protobuf:processResources NO-SOURCE
> Task :beam-runners-direct-java:processTestResources NO-SOURCE
> Task :beam-sdks-java-core:generateAvroJava NO-SOURCE
> Task :beam-runners-core-java:processTestResources NO-SOURCE
> Task :beam-model-job-management:extractProto
> Task :beam-model-fn-execution:extractProto
> Task :beam-sdks-java-core:generateGrammarSource FROM-CACHE
> Task :beam-model-job-management:processResources
> Task :beam-model-fn-execution:processResources
> Task :beam-sdks-java-core:processResources
> Task :beam-sdks-java-core:generateTestAvroProtocol NO-SOURCE
> Task :beam-model-pipeline:extractIncludeProto
> Task :beam-model-pipeline:extractProto
> Task :beam-sdks-java-core:generateTestAvroJava
> Task :beam-sdks-java-core:generateTestGrammarSource NO-SOURCE
> Task :beam-sdks-java-core:processTestResources NO-SOURCE
> Task :beam-model-pipeline:generateProto
> Task :beam-model-pipeline:compileJava FROM-CACHE
> Task :beam-model-pipeline:processResources
> Task :beam-model-pipeline:classes
> Task :beam-model-pipeline:jar
> Task :beam-model-job-management:extractIncludeProto
> Task :beam-model-fn-execution:extractIncludeProto
> Task :beam-model-job-management:generateProto
> Task :beam-model-fn-execution:generateProto
> Task :beam-model-job-management:compileJava FROM-CACHE
> Task :beam-model-job-management:classes
> Task :beam-model-fn-execution:compileJava FROM-CACHE
> Task :beam-model-fn-execution:classes
> Task :beam-model-pipeline:shadowJar
> Task :beam-model-job-management:shadowJar
> Task :beam-model-fn-execution:shadowJar
> Task :beam-sdks-java-core:compileJava FROM-CACHE
> Task :beam-sdks-java-core:classes
> Task :beam-sdks-java-core:shadowJar
> Task :beam-sdks-java-core:compileTestJava FROM-CACHE
> Task :beam-sdks-java-core:testClasses UP-TO-DATE
> Task :beam-runners-local-java-core:compileJava FROM-CACHE
> Task :beam-runners-local-java-core:classes UP-TO-DATE
> Task :beam-sdks-java-fn-execution:compileJava FROM-CACHE
> Task :beam-sdks-java-fn-execution:classes UP-TO-DATE
> Task :beam-runners-local-java-core:shadowJar
> Task :beam-sdks-java-extensions-google-cloud-platform-core:compileJava FROM-CACHE
> Task :beam-sdks-java-extensions-google-cloud-platform-core:classes UP-TO-DATE
> Task :beam-vendor-sdks-java-extensions-protobuf:compileJava FROM-CACHE
> Task :beam-vendor-sdks-java-extensions-protobuf:classes UP-TO-DATE
> Task :beam-runners-core-construction-java:compileJava FROM-CACHE
> Task :beam-runners-core-construction-java:classes UP-TO-DATE
> Task :beam-sdks-java-fn-execution:shadowJar
> Task :beam-runners-core-construction-java:shadowJar
> Task :beam-runners-core-java:compileJava FROM-CACHE
> Task :beam-runners-core-java:classes UP-TO-DATE
> Task :beam-runners-core-java:shadowJar
> Task :beam-vendor-sdks-java-extensions-protobuf:shadowJar
> Task :beam-sdks-java-extensions-google-cloud-platform-core:shadowJar
> Task :beam-sdks-java-harness:compileJava FROM-CACHE
> Task :beam-sdks-java-harness:classes UP-TO-DATE
> Task :beam-sdks-java-harness:jar
> Task :beam-sdks-java-core:shadowTestJar
> Task :beam-runners-core-java:compileTestJava FROM-CACHE
> Task :beam-runners-core-java:testClasses UP-TO-DATE
> Task :beam-runners-core-java:shadowTestJar
> Task :beam-sdks-java-harness:shadowJar
> Task :beam-runners-java-fn-execution:compileJava FROM-CACHE
> Task :beam-runners-java-fn-execution:classes UP-TO-DATE
> Task :beam-runners-java-fn-execution:shadowJar
> Task :beam-runners-direct-java:compileJava FROM-CACHE
> Task :beam-runners-direct-java:classes UP-TO-DATE
> Task :beam-runners-direct-java:shadowJar
> Task :beam-runners-direct-java:compileTestJava FROM-CACHE
> Task :beam-runners-direct-java:testClasses UP-TO-DATE
> Task :beam-runners-direct-java:shadowTestJar

Deprecated Gradle features were used in this build, making it incompatible with Gradle 6.0.
Use '--warning-mode all' to show the individual deprecation warnings.
See https://docs.gradle.org/5.2.1/userguide/command_line_interface.html#sec:command_line_warnings

BUILD SUCCESSFUL in 1m 28s
49 actionable tasks: 32 executed, 17 from cache

Publishing build scan...
https://gradle.com/s/lrv54c24qoi3w

Build step 'Invoke Gradle script' changed build result to SUCCESS
[Gradle] - Launching build.
[src] $ <https://builds.apache.org/job/beam_PostCommit_Java11_ValidatesRunner_Direct/ws/src/gradlew>
-Dorg.gradle.java.home=/home/jenkins/tools/java/latest11 -x shadowJar -x shadowTestJar -x
compileJava -x compileTestJava :beam-runners-direct-java:validatesRunner
To honour the JVM settings for this build a new JVM will be forked. Please consider using
the daemon: https://docs.gradle.org/5.2.1/userguide/gradle_daemon.html.
Daemon will be stopped at the end of the build stopping after processing
> Task :buildSrc:compileJava NO-SOURCE
> Task :buildSrc:compileGroovy FROM-CACHE
> Task :buildSrc:pluginDescriptors UP-TO-DATE
> Task :buildSrc:processResources UP-TO-DATE
> Task :buildSrc:classes UP-TO-DATE
> Task :buildSrc:jar
> Task :buildSrc:assemble
> Task :buildSrc:spotlessGroovy
> Task :buildSrc:spotlessGroovyCheck
> Task :buildSrc:spotlessGroovyGradle
> Task :buildSrc:spotlessGroovyGradleCheck
> Task :buildSrc:spotlessCheck
> Task :buildSrc:pluginUnderTestMetadata
> Task :buildSrc:compileTestJava NO-SOURCE
> Task :buildSrc:compileTestGroovy NO-SOURCE
> Task :buildSrc:processTestResources NO-SOURCE
> Task :buildSrc:testClasses UP-TO-DATE
> Task :buildSrc:test NO-SOURCE
> Task :buildSrc:validateTaskProperties FROM-CACHE
> Task :buildSrc:check
> Task :buildSrc:build
Configuration on demand is an incubating feature.

> Configure project :beam-test-infra-metrics
Applying groovy nature

> Task :beam-sdks-java-core:processTestResources NO-SOURCE
> Task :beam-runners-core-java:processTestResources NO-SOURCE
> Task :beam-runners-direct-java:processTestResources NO-SOURCE
> Task :beam-runners-core-construction-java:processTestResources NO-SOURCE
> Task :beam-runners-core-construction-java:testClasses
> Task :beam-runners-direct-java:testClasses
> Task :beam-sdks-java-core:testClasses
> Task :beam-runners-core-java:testClasses

> Task :beam-runners-direct-java:validatesRunner
WARNING: An illegal reflective access operation has occurred
WARNING: Illegal reflective access by org.apache.beam.vendor.grpc.v1p13p1.com.google.protobuf.UnsafeUtil
(file:/home/jenkins/.gradle/caches/modules-2/files-2.1/org.apache.beam/beam-vendor-grpc-1_13_1/0.2/249a9a576fc6541d87972e2dc24cf11ea8129b8f/beam-vendor-grpc-1_13_1-0.2.jar)
to field java.nio.Buffer.address
WARNING: Please consider reporting this to the maintainers of org.apache.beam.vendor.grpc.v1p13p1.com.google.protobuf.UnsafeUtil
WARNING: Use --illegal-access=warn to enable warnings of further illegal reflective access
operations
WARNING: All illegal access operations will be denied in a future release

org.apache.beam.sdk.metrics.MetricsTest$AttemptedMetricTests > testAttemptedDistributionMetrics
FAILED
    java.lang.AssertionError at MetricsTest.java:368

258 tests completed, 1 failed, 3 skipped

> Task :beam-runners-direct-java:validatesRunner FAILED

FAILURE: Build failed with an exception.

* What went wrong:
Execution failed for task ':beam-runners-direct-java:validatesRunner'.
> There were failing tests. See the report at: file://<https://builds.apache.org/job/beam_PostCommit_Java11_ValidatesRunner_Direct/ws/src/runners/direct-java/build/reports/tests/validatesRunner/index.html>

* Try:
Run with --stacktrace option to get the stack trace. Run with --info or --debug option to
get more log output. Run with --scan to get full insights.

* Get more help at https://help.gradle.org

Deprecated Gradle features were used in this build, making it incompatible with Gradle 6.0.
Use '--warning-mode all' to show the individual deprecation warnings.
See https://docs.gradle.org/5.2.1/userguide/command_line_interface.html#sec:command_line_warnings

BUILD FAILED in 2m 41s
1 actionable task: 1 executed

Publishing build scan...
https://gradle.com/s/5bacfwb6zy2tq

Build step 'Invoke Gradle script' changed build result to FAILURE
Build step 'Invoke Gradle script' marked build as failure

---------------------------------------------------------------------
To unsubscribe, e-mail: builds-unsubscribe@beam.apache.org
For additional commands, e-mail: builds-help@beam.apache.org


Mime
View raw message