beam-builds mailing list archives

Site index · List index
Message view « Date » · « Thread »
Top « Date » · « Thread »
From Apache Jenkins Server <jenk...@builds.apache.org>
Subject Build failed in Jenkins: beam_PostCommit_Java_ValidatesRunner_PortabilityApi_Dataflow #1025
Date Thu, 28 Mar 2019 16:40:58 GMT
See <https://builds.apache.org/job/beam_PostCommit_Java_ValidatesRunner_PortabilityApi_Dataflow/1025/display/redirect?page=changes>

Changes:

[apilloud] Moving to 2.13.0-SNAPSHOT on master branch.

------------------------------------------
[...truncated 60.25 KB...]
org.apache.beam.sdk.transforms.ViewTest > testSideInputWithNestedIterables FAILED
    java.lang.RuntimeException at ViewTest.java:1539

org.apache.beam.sdk.transforms.CombineTest$BasicTests > testHotKeyCombiningWithAccumulationMode
FAILED
    java.lang.RuntimeException at CombineTest.java:761

org.apache.beam.sdk.transforms.SplittableDoFnTest > testAdditionalOutputBounded FAILED
    java.lang.RuntimeException at SplittableDoFnTest.java:634

org.apache.beam.sdk.transforms.ParDoTest$TimestampTests > testParDoShiftTimestamp FAILED
    java.lang.RuntimeException at ParDoTest.java:1303

org.apache.beam.sdk.transforms.CombineTest$WindowingTests > testSessionsCombine FAILED
    java.lang.RuntimeException at CombineTest.java:1235

org.apache.beam.sdk.transforms.ReshuffleTest > testReshufflePreservesTimestamps FAILED
    java.lang.RuntimeException at ReshuffleTest.java:148

org.apache.beam.sdk.testing.PAssertTest > testWindowedContainsInAnyOrder FAILED
    java.lang.RuntimeException at PAssertTest.java:441

org.apache.beam.sdk.transforms.FlattenTest > testFlattenInputMultipleCopies FAILED
    java.lang.RuntimeException at FlattenTest.java:162

org.apache.beam.sdk.transforms.CreateTest > testCreate FAILED
    java.lang.RuntimeException at CreateTest.java:90

org.apache.beam.sdk.transforms.ParDoTest$BasicTests > testParDoEmptyOutputs FAILED
    java.lang.RuntimeException at ParDoTest.java:378

org.apache.beam.sdk.transforms.ParDoTest$StateTests > testCombiningStateParameterSuperclass
FAILED
    java.lang.RuntimeException at ParDoTest.java:1960

org.apache.beam.sdk.transforms.ViewTest > testListSideInput FAILED
    java.lang.RuntimeException at ViewTest.java:241

org.apache.beam.sdk.transforms.GroupByKeyTest$BasicTests > testGroupByKey FAILED
    java.lang.RuntimeException at GroupByKeyTest.java:128

org.apache.beam.sdk.transforms.ParDoTest$MultipleInputsAndOutputTests > testParDoWithTaggedOutput
FAILED
    java.lang.RuntimeException at ParDoTest.java:592

org.apache.beam.sdk.transforms.CombineTest$BasicTests > testBasicCombineEmpty FAILED
    java.lang.RuntimeException at CombineTest.java:687

org.apache.beam.sdk.transforms.ParDoTest$TimestampTests > testParDoShiftTimestampUnlimited
FAILED
    java.lang.RuntimeException at ParDoTest.java:1392

org.apache.beam.sdk.transforms.CombineTest$WindowingTests > testWindowedCombineGloballyAsSingletonView
FAILED
    java.lang.RuntimeException at CombineTest.java:1369

org.apache.beam.sdk.testing.PAssertTest > testPAssertEqualsSingletonFalse FAILED
    java.lang.AssertionError at PAssertTest.java:369

org.apache.beam.sdk.transforms.FlattenTest > testFlattenPCollectionsEmpty FAILED
    java.lang.RuntimeException at FlattenTest.java:130

org.apache.beam.sdk.transforms.ReshuffleTest > testReshuffleAfterSlidingWindowsAndGroupByKey
FAILED
    java.lang.RuntimeException at ReshuffleTest.java:211

org.apache.beam.sdk.transforms.ParDoTest$StateTests > testValueStateDedup FAILED
    java.lang.RuntimeException at ParDoTest.java:1476

org.apache.beam.sdk.transforms.ViewTest > testMapSideInput FAILED
    java.lang.RuntimeException at ViewTest.java:945

org.apache.beam.sdk.transforms.GroupByKeyTest$BasicTests > testLargeKeys10KB FAILED
    java.lang.RuntimeException at GroupByKeyTest.java:353

org.apache.beam.sdk.transforms.ParDoTest$MultipleInputsAndOutputTests > testMultiOutputParDoWithSideInputsIsCumulative
FAILED
    java.lang.RuntimeException at ParDoTest.java:847

org.apache.beam.sdk.transforms.CombineTest$WindowingTests > testCombineGloballyInstanceMethodReference
FAILED
    java.lang.RuntimeException at CombineTest.java:1403

org.apache.beam.sdk.testing.PAssertTest > testPAssertEqualsSingletonFalseDefaultReasonString
FAILED
    java.lang.AssertionError at PAssertTest.java:385

org.apache.beam.sdk.transforms.ReshuffleTest > testJustReshuffle FAILED
    java.lang.RuntimeException at ReshuffleTest.java:102

org.apache.beam.sdk.transforms.ViewTest > testWindowedSideInputFixedToFixedWithDefault
FAILED
    java.lang.RuntimeException at ViewTest.java:1455

org.apache.beam.sdk.transforms.FlattenTest > testFlattenPCollectionsSingletonList FAILED
    java.lang.RuntimeException at FlattenTest.java:104

org.apache.beam.sdk.transforms.GroupByKeyTest$BasicTests > testLargeKeys100KB FAILED
    java.lang.RuntimeException at GroupByKeyTest.java:359

org.apache.beam.sdk.transforms.ParDoTest$MultipleInputsAndOutputTests > testParDoWithEmptyTaggedOutput
FAILED
    java.lang.RuntimeException at ParDoTest.java:658

org.apache.beam.sdk.transforms.CombineTest$WindowingTests > testSlidingWindowsCombineWithContext
FAILED
    java.lang.RuntimeException at CombineTest.java:1182

org.apache.beam.sdk.testing.PAssertTest > testContainsInAnyOrder FAILED
    java.lang.RuntimeException at PAssertTest.java:396

org.apache.beam.sdk.transforms.ViewTest > testWindowedIterableSideInput FAILED
    java.lang.RuntimeException at ViewTest.java:442

org.apache.beam.sdk.transforms.FlattenTest > testFlattenPCollections FAILED
    java.lang.RuntimeException at FlattenTest.java:92

org.apache.beam.sdk.transforms.ParDoTest$MultipleInputsAndOutputTests > testParDoWithSideInputs
FAILED
    java.lang.RuntimeException at ParDoTest.java:737

org.apache.beam.sdk.transforms.CombineTest$WindowingTests > testFixedWindowsCombineWithContext
FAILED
    java.lang.RuntimeException at CombineTest.java:1072

org.apache.beam.sdk.transforms.FlattenTest > testFlattenPCollectionsThenParDo FAILED
    java.lang.RuntimeException at FlattenTest.java:118

org.apache.beam.sdk.transforms.ViewTest > testWindowedSideInputFixedToGlobal FAILED
    java.lang.RuntimeException at ViewTest.java:1416

org.apache.beam.sdk.testing.PAssertTest > testNotEqualTo FAILED
    java.lang.RuntimeException at PAssertTest.java:355

org.apache.beam.sdk.transforms.CombineTest$WindowingTests > testSessionsCombineWithContext
FAILED
    java.lang.RuntimeException at CombineTest.java:1286

org.apache.beam.sdk.transforms.ParDoTest$MultipleInputsAndOutputTests > testParDoWithSideInputsIsCumulative
FAILED
    java.lang.RuntimeException at ParDoTest.java:771

org.apache.beam.sdk.transforms.FlattenTest > testFlattenMultiplePCollectionsHavingMultipleConsumers
FAILED
    java.lang.RuntimeException at FlattenTest.java:347

org.apache.beam.sdk.transforms.ViewTest > testEmptyMultimapSideInput FAILED
    java.lang.RuntimeException at ViewTest.java:830

org.apache.beam.sdk.testing.PAssertTest > testGlobalWindowContainsInAnyOrder FAILED
    java.lang.RuntimeException at PAssertTest.java:405

org.apache.beam.sdk.transforms.ViewTest > testCombinedMapSideInput FAILED
    java.lang.RuntimeException at ViewTest.java:1334

org.apache.beam.sdk.transforms.FlattenTest > testFlattenIterables FAILED
    java.lang.RuntimeException at FlattenTest.java:252

org.apache.beam.sdk.testing.PAssertTest > testEmptyFalseDefaultReasonString FAILED
    java.lang.AssertionError at PAssertTest.java:500

org.apache.beam.sdk.transforms.FlattenTest > testFlattenIterablesSets FAILED
    java.lang.RuntimeException at FlattenTest.java:280

org.apache.beam.sdk.transforms.ViewTest > testMultimapSideInputIsImmutable FAILED
    java.lang.RuntimeException at ViewTest.java:913

org.apache.beam.sdk.testing.PAssertTest > testAssertionSiteIsCapturedWithoutMessage FAILED
    java.lang.AssertionError at PAssertTest.java:541

org.apache.beam.sdk.transforms.FlattenTest > testFlattenPCollectionsEmptyThenParDo FAILED
    java.lang.RuntimeException at FlattenTest.java:224

org.apache.beam.sdk.transforms.ViewTest > testWindowedMultimapAsEntrySetSideInput FAILED
    java.lang.RuntimeException at ViewTest.java:747

org.apache.beam.sdk.testing.PAssertTest > testWindowedIsEqualTo FAILED
    java.lang.RuntimeException at PAssertTest.java:346

org.apache.beam.sdk.transforms.ViewTest > testWindowedSingletonSideInput FAILED
    java.lang.RuntimeException at ViewTest.java:152

org.apache.beam.sdk.testing.PAssertTest > testContainsInAnyOrderFalse FAILED
    java.lang.AssertionError at PAssertTest.java:467

org.apache.beam.sdk.transforms.ViewTest > testWindowedMultimapSideInput FAILED
    java.lang.RuntimeException at ViewTest.java:699

org.apache.beam.sdk.transforms.ViewTest > testSideInputWithNullDefault FAILED
    java.lang.RuntimeException at ViewTest.java:1484

org.apache.beam.sdk.transforms.ViewTest > testWindowedListSideInput FAILED
    java.lang.RuntimeException at ViewTest.java:290

org.apache.beam.sdk.transforms.ViewTest > testWindowedMapSideInput FAILED
    java.lang.RuntimeException at ViewTest.java:1056

org.apache.beam.sdk.transforms.ViewTest > testIterableSideInputIsImmutable FAILED
    java.lang.RuntimeException at ViewTest.java:505

org.apache.beam.sdk.transforms.ViewTest > testListSideInputIsImmutable FAILED
    java.lang.RuntimeException at ViewTest.java:368

org.apache.beam.sdk.transforms.ViewTest > testEmptyListSideInput FAILED
    java.lang.RuntimeException at ViewTest.java:319

org.apache.beam.sdk.transforms.ViewTest > testWindowedSideInputFixedToFixed FAILED
    java.lang.RuntimeException at ViewTest.java:1375

org.apache.beam.sdk.transforms.ViewTest > testIterableSideInput FAILED
    java.lang.RuntimeException at ViewTest.java:396

org.apache.beam.sdk.transforms.ViewTest > testEmptyMapSideInput FAILED
    java.lang.RuntimeException at ViewTest.java:1177

org.apache.beam.sdk.transforms.ViewTest > testMapSideInputIsImmutable FAILED
    java.lang.RuntimeException at ViewTest.java:1301

org.apache.beam.sdk.transforms.ViewTest > testWindowedMapAsEntrySetSideInput FAILED
    java.lang.RuntimeException at ViewTest.java:1099

org.apache.beam.sdk.transforms.ViewTest > testMultimapAsEntrySetSideInput FAILED
    java.lang.RuntimeException at ViewTest.java:581

org.apache.beam.sdk.transforms.ViewTest > testSingletonSideInput FAILED
    java.lang.RuntimeException at ViewTest.java:113

158 tests completed, 147 failed, 2 skipped

> Task :beam-runners-google-cloud-dataflow-java:validatesRunnerFnApiWorkerTest FAILED

> Task :beam-runners-google-cloud-dataflow-java:cleanUpDockerImages
Untagged: us.gcr.io/apache-beam-testing/java-postcommit-it/java:20190328162223
Untagged: us.gcr.io/apache-beam-testing/java-postcommit-it/java@sha256:0c8b935d075b7c338b7f16f108727b6b821852c7c889ce98bc32f922e05f6775
Digests:
- us.gcr.io/apache-beam-testing/java-postcommit-it/java@sha256:0c8b935d075b7c338b7f16f108727b6b821852c7c889ce98bc32f922e05f6775
  Associated tags:
 - 20190328162223
Tags:
- us.gcr.io/apache-beam-testing/java-postcommit-it/java:20190328162223
Deleted [us.gcr.io/apache-beam-testing/java-postcommit-it/java:20190328162223].
Deleted [us.gcr.io/apache-beam-testing/java-postcommit-it/java@sha256:0c8b935d075b7c338b7f16f108727b6b821852c7c889ce98bc32f922e05f6775].

FAILURE: Build failed with an exception.

* What went wrong:
Execution failed for task ':beam-runners-google-cloud-dataflow-java:validatesRunnerFnApiWorkerTest'.
> There were failing tests. See the report at: file://<https://builds.apache.org/job/beam_PostCommit_Java_ValidatesRunner_PortabilityApi_Dataflow/ws/src/runners/google-cloud-dataflow-java/build/reports/tests/validatesRunnerFnApiWorkerTest/index.html>

* Try:
Run with --stacktrace option to get the stack trace. Run with --info or --debug option to
get more log output. Run with --scan to get full insights.

* Get more help at https://help.gradle.org

Deprecated Gradle features were used in this build, making it incompatible with Gradle 6.0.
Use '--warning-mode all' to show the individual deprecation warnings.
See https://docs.gradle.org/5.2.1/userguide/command_line_interface.html#sec:command_line_warnings

BUILD FAILED in 18m 46s
76 actionable tasks: 58 executed, 17 from cache, 1 up-to-date

Publishing build scan...
https://gradle.com/s/4jt24d5rail6y

Build step 'Invoke Gradle script' changed build result to FAILURE
Build step 'Invoke Gradle script' marked build as failure

---------------------------------------------------------------------
To unsubscribe, e-mail: builds-unsubscribe@beam.apache.org
For additional commands, e-mail: builds-help@beam.apache.org


Mime
View raw message