beam-builds mailing list archives

Site index · List index
Message view « Date » · « Thread »
Top « Date » · « Thread »
From Apache Jenkins Server <jenk...@builds.apache.org>
Subject Build failed in Jenkins: beam_PostCommit_Java_PVR_Flink_Streaming #935
Date Fri, 01 Mar 2019 19:16:08 GMT
See <https://builds.apache.org/job/beam_PostCommit_Java_PVR_Flink_Streaming/935/display/redirect?page=changes>

Changes:

[kenn] [BEAM-6554] Adjust Jenkins directory for spotbugs report

------------------------------------------
[...truncated 81.34 KB...]
org.apache.beam.sdk.transforms.CreateTest > testCreateWithVoidType FAILED
    java.lang.IllegalArgumentException at CreateTest.java:325
        Caused by: java.lang.reflect.InvocationTargetException at CreateTest.java:325
            Caused by: java.io.IOException at CreateTest.java:325
                Caused by: java.net.BindException

org.apache.beam.sdk.transforms.CreateTest > testCreate FAILED
    java.lang.IllegalArgumentException at CreateTest.java:90
        Caused by: java.lang.reflect.InvocationTargetException at CreateTest.java:90
            Caused by: java.io.IOException at CreateTest.java:90
                Caused by: java.net.BindException

org.apache.beam.sdk.transforms.ParDoSchemaTest > testReadAndWrite FAILED
    java.lang.IllegalArgumentException at ParDoSchemaTest.java:142
        Caused by: java.lang.reflect.InvocationTargetException at ParDoSchemaTest.java:142
            Caused by: java.io.IOException at ParDoSchemaTest.java:142
                Caused by: java.net.BindException

org.apache.beam.sdk.transforms.ParDoSchemaTest > testSchemasPassedThrough FAILED
    java.lang.IllegalArgumentException at ParDoSchemaTest.java:408
        Caused by: java.lang.reflect.InvocationTargetException at ParDoSchemaTest.java:408
            Caused by: java.io.IOException at ParDoSchemaTest.java:408
                Caused by: java.net.BindException

org.apache.beam.sdk.transforms.ParDoSchemaTest > testInferredSchemaPipeline FAILED
    java.lang.IllegalArgumentException at ParDoSchemaTest.java:395
        Caused by: java.lang.reflect.InvocationTargetException at ParDoSchemaTest.java:395
            Caused by: java.io.IOException at ParDoSchemaTest.java:395
                Caused by: java.net.BindException

org.apache.beam.sdk.transforms.ParDoSchemaTest > testFieldAccessSchemaPipeline FAILED
    java.lang.IllegalArgumentException at ParDoSchemaTest.java:316
        Caused by: java.lang.reflect.InvocationTargetException at ParDoSchemaTest.java:316
            Caused by: java.io.IOException at ParDoSchemaTest.java:316
                Caused by: java.net.BindException

org.apache.beam.sdk.transforms.ParDoSchemaTest > testSimpleSchemaPipeline FAILED
    java.lang.IllegalArgumentException at ParDoSchemaTest.java:90
        Caused by: java.lang.reflect.InvocationTargetException at ParDoSchemaTest.java:90
            Caused by: java.io.IOException at ParDoSchemaTest.java:90
                Caused by: java.net.BindException

org.apache.beam.sdk.transforms.ParDoSchemaTest > testSchemaConversionPipeline FAILED
    java.lang.IllegalArgumentException at ParDoSchemaTest.java:443
        Caused by: java.lang.reflect.InvocationTargetException at ParDoSchemaTest.java:443
            Caused by: java.io.IOException at ParDoSchemaTest.java:443
                Caused by: java.net.BindException

org.apache.beam.sdk.transforms.ParDoSchemaTest > testReadAndWriteWithSchemaRegistry FAILED
    java.lang.IllegalArgumentException at ParDoSchemaTest.java:281
        Caused by: java.lang.reflect.InvocationTargetException at ParDoSchemaTest.java:281
            Caused by: java.io.IOException at ParDoSchemaTest.java:281
                Caused by: java.net.BindException

org.apache.beam.sdk.transforms.ParDoSchemaTest > testReadAndWriteMultiOutput FAILED
    java.lang.IllegalArgumentException at ParDoSchemaTest.java:236
        Caused by: java.lang.reflect.InvocationTargetException at ParDoSchemaTest.java:236
            Caused by: java.io.IOException at ParDoSchemaTest.java:236
                Caused by: java.net.BindException

org.apache.beam.sdk.transforms.ParDoTest$TimerCoderInferenceTests > testValueStateCoderInferenceFromInputCoder
FAILED
    java.lang.IllegalArgumentException at ParDoTest.java:3305
        Caused by: java.lang.reflect.InvocationTargetException at ParDoTest.java:3305
            Caused by: java.io.IOException at ParDoTest.java:3305
                Caused by: java.net.BindException

org.apache.beam.sdk.transforms.ParDoTest$TimerCoderInferenceTests > testValueStateCoderInference
FAILED
    java.lang.IllegalArgumentException at ParDoTest.java:3235
        Caused by: java.lang.reflect.InvocationTargetException at ParDoTest.java:3235
            Caused by: java.io.IOException at ParDoTest.java:3235
                Caused by: java.net.BindException

org.apache.beam.sdk.transforms.ParDoTest$MultipleInputsAndOutputTests > testParDoWithOnlyTaggedOutput
FAILED
    java.lang.IllegalArgumentException at ParDoTest.java:687
        Caused by: java.lang.reflect.InvocationTargetException at ParDoTest.java:687
            Caused by: java.io.IOException at ParDoTest.java:687
                Caused by: java.net.BindException

org.apache.beam.sdk.transforms.ParDoTest$MultipleInputsAndOutputTests > testMultiOutputParDoWithSideInputs
FAILED
    java.lang.IllegalArgumentException at ParDoTest.java:809
        Caused by: java.lang.reflect.InvocationTargetException at ParDoTest.java:809
            Caused by: java.io.IOException at ParDoTest.java:809
                Caused by: java.net.BindException

org.apache.beam.sdk.transforms.ParDoTest$MultipleInputsAndOutputTests > testSideInputsWithMultipleWindows
FAILED
    java.lang.IllegalArgumentException at ParDoTest.java:895
        Caused by: java.lang.reflect.InvocationTargetException at ParDoTest.java:895
            Caused by: java.io.IOException at ParDoTest.java:895
                Caused by: java.net.BindException

org.apache.beam.sdk.transforms.ParDoTest$MultipleInputsAndOutputTests > testParDoEmptyWithTaggedOutput
FAILED
    java.lang.IllegalArgumentException at ParDoTest.java:634
        Caused by: java.lang.reflect.InvocationTargetException at ParDoTest.java:634
            Caused by: java.io.IOException at ParDoTest.java:634
                Caused by: java.net.BindException

org.apache.beam.sdk.transforms.ParDoTest$MultipleInputsAndOutputTests > testParDoWithTaggedOutput
FAILED
    java.lang.IllegalArgumentException at ParDoTest.java:592
        Caused by: java.lang.reflect.InvocationTargetException at ParDoTest.java:592
            Caused by: java.io.IOException at ParDoTest.java:592
                Caused by: java.net.BindException

org.apache.beam.sdk.transforms.ParDoTest$MultipleInputsAndOutputTests > testMultiOutputParDoWithSideInputsIsCumulative
FAILED
    java.lang.IllegalArgumentException at ParDoTest.java:847
        Caused by: java.lang.reflect.InvocationTargetException at ParDoTest.java:847
            Caused by: java.io.IOException at ParDoTest.java:847
                Caused by: java.net.BindException

org.apache.beam.sdk.transforms.ParDoTest$MultipleInputsAndOutputTests > testParDoWithEmptyTaggedOutput
FAILED
    java.lang.IllegalArgumentException at ParDoTest.java:658
        Caused by: java.lang.reflect.InvocationTargetException at ParDoTest.java:658
            Caused by: java.io.IOException at ParDoTest.java:658
                Caused by: java.net.BindException

org.apache.beam.sdk.transforms.ParDoTest$MultipleInputsAndOutputTests > testParDoWithSideInputs
FAILED
    java.lang.IllegalArgumentException at ParDoTest.java:737
        Caused by: java.lang.reflect.InvocationTargetException at ParDoTest.java:737
            Caused by: java.io.IOException at ParDoTest.java:737
                Caused by: java.net.BindException

org.apache.beam.sdk.transforms.ParDoTest$MultipleInputsAndOutputTests > testParDoWithSideInputsIsCumulative
FAILED
    java.lang.IllegalArgumentException at ParDoTest.java:771
        Caused by: java.lang.reflect.InvocationTargetException at ParDoTest.java:771
            Caused by: java.io.IOException at ParDoTest.java:771
                Caused by: java.net.BindException

org.apache.beam.sdk.transforms.ParDoTest$LifecycleTests > testWindowingInStartAndFinishBundle
FAILED
    java.lang.IllegalArgumentException at ParDoTest.java:1220
        Caused by: java.lang.reflect.InvocationTargetException at ParDoTest.java:1220
            Caused by: java.io.IOException at ParDoTest.java:1220
                Caused by: java.net.BindException

org.apache.beam.sdk.transforms.windowing.WindowingTest > testMergingWindowing FAILED
    java.lang.IllegalArgumentException at WindowingTest.java:168
        Caused by: java.lang.reflect.InvocationTargetException at WindowingTest.java:168
            Caused by: java.io.IOException at WindowingTest.java:168
                Caused by: java.net.BindException

org.apache.beam.sdk.transforms.windowing.WindowingTest > testWindowPreservation FAILED
    java.lang.IllegalArgumentException at WindowingTest.java:197
        Caused by: java.lang.reflect.InvocationTargetException at WindowingTest.java:197
            Caused by: java.io.IOException at WindowingTest.java:197
                Caused by: java.net.BindException

org.apache.beam.sdk.transforms.windowing.WindowingTest > testNonPartitioningWindowing FAILED
    java.lang.IllegalArgumentException at WindowingTest.java:150
        Caused by: java.lang.reflect.InvocationTargetException at WindowingTest.java:150
            Caused by: java.io.IOException at WindowingTest.java:150
                Caused by: java.net.BindException

org.apache.beam.sdk.transforms.windowing.WindowingTest > testPartitioningWindowing FAILED
    java.lang.IllegalArgumentException at WindowingTest.java:126
        Caused by: java.lang.reflect.InvocationTargetException at WindowingTest.java:126
            Caused by: java.io.IOException at WindowingTest.java:126
                Caused by: java.net.BindException

org.apache.beam.sdk.transforms.windowing.WindowTest > testTimestampCombinerEndOfWindow
FAILED
    java.lang.IllegalArgumentException at WindowTest.java:498
        Caused by: java.lang.reflect.InvocationTargetException at WindowTest.java:498
            Caused by: java.io.IOException at WindowTest.java:498
                Caused by: java.net.BindException

org.apache.beam.sdk.transforms.windowing.WindowTest > testTimestampCombinerDefault FAILED
    java.lang.IllegalArgumentException at WindowTest.java:468
        Caused by: java.lang.reflect.InvocationTargetException at WindowTest.java:468
            Caused by: java.io.IOException at WindowTest.java:468
                Caused by: java.net.BindException

org.apache.beam.sdk.transforms.windowing.WindowTest > testNoWindowFnDoesNotReassignWindows
FAILED
    java.lang.IllegalArgumentException at WindowTest.java:434
        Caused by: java.lang.reflect.InvocationTargetException at WindowTest.java:434
            Caused by: java.io.IOException at WindowTest.java:434
                Caused by: java.net.BindException

org.apache.beam.sdk.transforms.WithTimestampsTest > withTimestampsShouldApplyTimestamps
FAILED
    java.lang.IllegalArgumentException at WithTimestampsTest.java:78
        Caused by: java.lang.reflect.InvocationTargetException at WithTimestampsTest.java:78
            Caused by: java.io.IOException at WithTimestampsTest.java:78
                Caused by: java.net.BindException

org.apache.beam.sdk.transforms.WithTimestampsTest > withTimestampsBackwardsInTimeAndWithAllowedTimestampSkewShouldSucceed
FAILED
    java.lang.IllegalArgumentException at WithTimestampsTest.java:142
        Caused by: java.lang.reflect.InvocationTargetException at WithTimestampsTest.java:142
            Caused by: java.io.IOException at WithTimestampsTest.java:142
                Caused by: java.net.BindException

org.apache.beam.sdk.transforms.WithTimestampsTest > withTimestampsLambdaShouldApplyTimestamps
FAILED
    java.lang.IllegalArgumentException at WithTimestampsTest.java:205
        Caused by: java.lang.reflect.InvocationTargetException at WithTimestampsTest.java:205
            Caused by: java.io.IOException at WithTimestampsTest.java:205
                Caused by: java.net.BindException

org.apache.beam.sdk.transforms.ReifyTimestampsTest > extractFromValuesWhenValueTimestampedLaterSucceeds
FAILED
    java.lang.IllegalArgumentException at ReifyTimestampsTest.java:128
        Caused by: java.lang.reflect.InvocationTargetException at ReifyTimestampsTest.java:128
            Caused by: java.io.IOException at ReifyTimestampsTest.java:128
                Caused by: java.net.BindException

org.apache.beam.sdk.transforms.ReifyTimestampsTest > extractFromValuesSucceeds FAILED
    java.lang.IllegalArgumentException at ReifyTimestampsTest.java:92
        Caused by: java.lang.reflect.InvocationTargetException at ReifyTimestampsTest.java:92
            Caused by: java.io.IOException at ReifyTimestampsTest.java:92
                Caused by: java.net.BindException

org.apache.beam.sdk.transforms.ReifyTimestampsTest > inValuesSucceeds FAILED
    java.lang.IllegalArgumentException at ReifyTimestampsTest.java:60
        Caused by: java.lang.reflect.InvocationTargetException at ReifyTimestampsTest.java:60
            Caused by: java.io.IOException at ReifyTimestampsTest.java:60
                Caused by: java.net.BindException

org.apache.beam.sdk.io.CountingSourceTest > testUnboundedSourceSplits FAILED
    java.lang.IllegalArgumentException at CountingSourceTest.java:246
        Caused by: java.lang.reflect.InvocationTargetException at CountingSourceTest.java:246
            Caused by: java.io.IOException at CountingSourceTest.java:246
                Caused by: java.net.BindException

org.apache.beam.sdk.io.CountingSourceTest > testBoundedSourceSplits FAILED
    java.lang.IllegalArgumentException at CountingSourceTest.java:121
        Caused by: java.lang.reflect.InvocationTargetException at CountingSourceTest.java:121
            Caused by: java.io.IOException at CountingSourceTest.java:121
                Caused by: java.net.BindException

195 tests completed, 181 failed, 2 skipped

> Task :beam-runners-flink_2.11-job-server:validatesPortableRunnerStreaming FAILED

FAILURE: Build failed with an exception.

* What went wrong:
Execution failed for task ':beam-runners-flink_2.11-job-server:validatesPortableRunnerStreaming'.
> There were failing tests. See the report at: file://<https://builds.apache.org/job/beam_PostCommit_Java_PVR_Flink_Streaming/ws/src/runners/flink/job-server/build/reports/tests/validatesPortableRunnerStreaming/index.html>

* Try:
Run with --stacktrace option to get the stack trace. Run with --info or --debug option to
get more log output. Run with --scan to get full insights.

* Get more help at https://help.gradle.org

Deprecated Gradle features were used in this build, making it incompatible with Gradle 6.0.
Use '--warning-mode all' to show the individual deprecation warnings.
See https://docs.gradle.org/5.2.1/userguide/command_line_interface.html#sec:command_line_warnings

BUILD FAILED in 2m 36s
62 actionable tasks: 41 executed, 21 from cache

Publishing build scan...
https://gradle.com/s/4ymptql7inh5c

Build step 'Invoke Gradle script' changed build result to FAILURE
Build step 'Invoke Gradle script' marked build as failure

---------------------------------------------------------------------
To unsubscribe, e-mail: builds-unsubscribe@beam.apache.org
For additional commands, e-mail: builds-help@beam.apache.org


Mime
View raw message