beam-builds mailing list archives

Site index · List index
Message view « Date » · « Thread »
Top « Date » · « Thread »
From Apache Jenkins Server <jenk...@builds.apache.org>
Subject Build failed in Jenkins: beam_PostCommit_Java_ValidatesRunner_PortabilityApi_Dataflow #852
Date Fri, 01 Mar 2019 14:29:44 GMT
See <https://builds.apache.org/job/beam_PostCommit_Java_ValidatesRunner_PortabilityApi_Dataflow/852/display/redirect?page=changes>

Changes:

[ttanay100] Fix link to Design Principles in PTransform Style Guide

[ttanay100] Change text as well

------------------------------------------
[...truncated 30.72 KB...]
Resolving cached github.com/coreos/etcd: commit='11214aa33bf5a47d3d9d8dafe0f6b97237dfe921',
urls=[https://github.com/coreos/etcd.git, git@github.com:coreos/etcd.git]
Resolving github.com/spf13/afero: commit='bb8f1927f2a9d3ab41c9340aa034f6b803f4359c', urls=[https://github.com/spf13/afero.git,
git@github.com:spf13/afero.git]
Resolving github.com/spf13/cast: commit='acbeb36b902d72a7a4c18e8f3241075e7ab763e4', urls=[https://github.com/spf13/cast.git,
git@github.com:spf13/cast.git]
Resolving github.com/spf13/cobra: commit='93959269ad99e80983c9ba742a7e01203a4c0e4f', urls=[https://github.com/spf13/cobra.git,
git@github.com:spf13/cobra.git]
Resolving github.com/spf13/jwalterweatherman: commit='7c0cea34c8ece3fbeb2b27ab9b59511d360fb394',
urls=[https://github.com/spf13/jwalterweatherman.git, git@github.com:spf13/jwalterweatherman.git]
Resolving cached github.com/coreos/etcd: commit='11214aa33bf5a47d3d9d8dafe0f6b97237dfe921',
urls=[https://github.com/coreos/etcd.git, git@github.com:coreos/etcd.git]
Resolving github.com/spf13/viper: commit='aafc9e6bc7b7bb53ddaa75a5ef49a17d6e654be5', urls=[https://github.com/spf13/viper.git,
git@github.com:spf13/viper.git]
Resolving github.com/stathat/go: commit='74669b9f388d9d788c97399a0824adbfee78400e', urls=[https://github.com/stathat/go.git,
git@github.com:stathat/go.git]
Resolving cached github.com/coreos/etcd: commit='11214aa33bf5a47d3d9d8dafe0f6b97237dfe921',
urls=[https://github.com/coreos/etcd.git, git@github.com:coreos/etcd.git]
Resolving cached github.com/coreos/etcd: commit='11214aa33bf5a47d3d9d8dafe0f6b97237dfe921',
urls=[https://github.com/coreos/etcd.git, git@github.com:coreos/etcd.git]
Resolving cached github.com/coreos/etcd: commit='11214aa33bf5a47d3d9d8dafe0f6b97237dfe921',
urls=[https://github.com/coreos/etcd.git, git@github.com:coreos/etcd.git]
Resolving cached github.com/coreos/etcd: commit='11214aa33bf5a47d3d9d8dafe0f6b97237dfe921',
urls=[https://github.com/coreos/etcd.git, git@github.com:coreos/etcd.git]
Resolving github.com/xordataexchange/crypt: commit='b2862e3d0a775f18c7cfe02273500ae307b61218',
urls=[https://github.com/xordataexchange/crypt.git, git@github.com:xordataexchange/crypt.git]
Resolving go.opencensus.io: commit='aa2b39d1618ef56ba156f27cfcdae9042f68f0bc', urls=[https://github.com/census-instrumentation/opencensus-go]
Resolving golang.org/x/crypto: commit='d9133f5469342136e669e85192a26056b587f503', urls=[https://go.googlesource.com/crypto]
Resolving golang.org/x/debug: commit='95515998a8a4bd7448134b2cb5971dbeb12e0b77', urls=[https://go.googlesource.com/debug]

> Task :beam-sdks-java-core:shadowJar
> Task :beam-sdks-java-extensions-protobuf:extractIncludeProto
> Task :beam-sdks-java-extensions-protobuf:generateProto NO-SOURCE

> Task :beam-sdks-go:resolveBuildDependencies
Resolving golang.org/x/net: commit='2fb46b16b8dda405028c50f7c7f0f9dd1fa6bfb1', urls=[https://go.googlesource.com/net]
Resolving golang.org/x/oauth2: commit='a032972e28060ca4f5644acffae3dfc268cc09db', urls=[https://go.googlesource.com/oauth2]
Resolving golang.org/x/sync: commit='fd80eb99c8f653c847d294a001bdf2a3a6f768f5', urls=[https://go.googlesource.com/sync]

> Task :beam-sdks-java-core:compileTestJava FROM-CACHE
> Task :beam-sdks-java-core:testClasses UP-TO-DATE
> Task :beam-vendor-sdks-java-extensions-protobuf:compileJava FROM-CACHE
> Task :beam-vendor-sdks-java-extensions-protobuf:classes UP-TO-DATE
> Task :beam-sdks-java-fn-execution:compileJava FROM-CACHE
> Task :beam-sdks-java-fn-execution:classes UP-TO-DATE
> Task :beam-runners-core-construction-java:compileJava FROM-CACHE
> Task :beam-runners-core-construction-java:classes UP-TO-DATE
> Task :beam-sdks-java-extensions-google-cloud-platform-core:compileJava FROM-CACHE
> Task :beam-sdks-java-extensions-google-cloud-platform-core:classes UP-TO-DATE
> Task :beam-sdks-java-fn-execution:shadowJar
> Task :beam-sdks-java-extensions-protobuf:compileJava FROM-CACHE
> Task :beam-sdks-java-extensions-protobuf:classes UP-TO-DATE
> Task :beam-sdks-java-extensions-protobuf:shadowJar
> Task :beam-runners-core-construction-java:shadowJar
> Task :beam-runners-core-java:compileJava FROM-CACHE
> Task :beam-runners-core-java:classes UP-TO-DATE
> Task :beam-runners-core-java:shadowJar
> Task :beam-vendor-sdks-java-extensions-protobuf:shadowJar
> Task :beam-sdks-java-extensions-google-cloud-platform-core:shadowJar
> Task :beam-sdks-java-harness:compileJava FROM-CACHE
> Task :beam-sdks-java-harness:classes UP-TO-DATE
> Task :beam-sdks-java-io-google-cloud-platform:compileJava FROM-CACHE
> Task :beam-sdks-java-io-google-cloud-platform:classes UP-TO-DATE

> Task :beam-sdks-go:resolveBuildDependencies
Resolving golang.org/x/sys: commit='37707fdb30a5b38865cfb95e5aab41707daec7fd', urls=[https://go.googlesource.com/sys]
Resolving cached github.com/coreos/etcd: commit='11214aa33bf5a47d3d9d8dafe0f6b97237dfe921',
urls=[https://github.com/coreos/etcd.git, git@github.com:coreos/etcd.git]
Resolving cached github.com/coreos/etcd: commit='11214aa33bf5a47d3d9d8dafe0f6b97237dfe921',
urls=[https://github.com/coreos/etcd.git, git@github.com:coreos/etcd.git]

> Task :beam-sdks-java-io-google-cloud-platform:shadowJar
> Task :beam-runners-google-cloud-dataflow-java:compileJava FROM-CACHE
> Task :beam-runners-google-cloud-dataflow-java:classes
> Task :beam-runners-google-cloud-dataflow-java:shadowJar
> Task :beam-sdks-java-core:shadowTestJar
> Task :beam-sdks-java-harness:shadowJar
> Task :beam-sdks-java-harness:jar
> Task :beam-sdks-java-container:copyDockerfileDependencies
> Task :beam-runners-java-fn-execution:compileJava FROM-CACHE
> Task :beam-runners-java-fn-execution:classes UP-TO-DATE
> Task :beam-runners-java-fn-execution:shadowJar

> Task :beam-runners-google-cloud-dataflow-java-fn-api-worker:compileJava
Note: Some input files use or override a deprecated API.
Note: Recompile with -Xlint:deprecation for details.
Note: Some input files use unchecked or unsafe operations.
Note: Recompile with -Xlint:unchecked for details.

> Task :beam-runners-google-cloud-dataflow-java-fn-api-worker:classes

> Task :beam-sdks-go:resolveBuildDependencies
Resolving google.golang.org/api: commit='386d4e5f4f92f86e6aec85985761bba4b938a2d5', urls=[https://code.googlesource.com/google-api-go-client]
Resolving google.golang.org/genproto: commit='2b5a72b8730b0b16380010cfe5286c42108d88e7', urls=[https://github.com/google/go-genproto]
Resolving google.golang.org/grpc: commit='7646b5360d049a7ca31e9133315db43456f39e2e', urls=[https://github.com/grpc/grpc-go]
Resolving cached github.com/coreos/etcd: commit='11214aa33bf5a47d3d9d8dafe0f6b97237dfe921',
urls=[https://github.com/coreos/etcd.git, git@github.com:coreos/etcd.git]
Resolving cached github.com/coreos/etcd: commit='11214aa33bf5a47d3d9d8dafe0f6b97237dfe921',
urls=[https://github.com/coreos/etcd.git, git@github.com:coreos/etcd.git]

> Task :beam-runners-google-cloud-dataflow-java-fn-api-worker:shadowJar
> Task :beam-sdks-go:installDependencies
> Task :beam-sdks-go:buildLinuxAmd64
> Task :beam-sdks-go:goBuild

> Task :beam-sdks-java-container:resolveBuildDependencies
Resolving ./github.com/apache/beam/sdks/go@<https://builds.apache.org/job/beam_PostCommit_Java_ValidatesRunner_PortabilityApi_Dataflow/ws/src/sdks/go>

> Task :beam-sdks-java-container:installDependencies
> Task :beam-sdks-java-container:buildLinuxAmd64
> Task :beam-sdks-java-container:goBuild
> Task :beam-sdks-java-container:dockerPrepare
> Task :beam-sdks-java-container:docker

> Task :beam-runners-google-cloud-dataflow-java:buildAndPushDockerContainer
WARNING: `gcloud docker` will not be supported for Docker client versions above 18.03.

As an alternative, use `gcloud auth configure-docker` to configure `docker` to
use `gcloud` as a credential helper, then use `docker` as you would for non-GCR
registries, e.g. `docker pull gcr.io/project-id/my-image`. Add
`--verbosity=error` to silence this warning: `gcloud docker
--verbosity=error -- pull gcr.io/project-id/my-image`.

See: https://cloud.google.com/container-registry/docs/support/deprecation-notices#gcloud-docker

The push refers to a repository [us.gcr.io/apache-beam-testing/java-postcommit-it/java]
5dadf50af191: Preparing
9381ea099d31: Preparing
3cbdc0b776b2: Preparing
80de1d6a8751: Preparing
b98fdbf8cf7f: Preparing
ad6eaafe7ab3: Preparing
57eab9d93a79: Preparing
364be905de1c: Preparing
6257fa9f9597: Preparing
578414b395b9: Preparing
ad6eaafe7ab3: Waiting
364be905de1c: Waiting
abc3250a6c7f: Preparing
13d5529fd232: Preparing
13d5529fd232: Waiting
abc3250a6c7f: Waiting
b98fdbf8cf7f: Layer already exists
ad6eaafe7ab3: Layer already exists
57eab9d93a79: Layer already exists
364be905de1c: Layer already exists
6257fa9f9597: Layer already exists
578414b395b9: Layer already exists
abc3250a6c7f: Layer already exists
13d5529fd232: Layer already exists
3cbdc0b776b2: Pushed
80de1d6a8751: Pushed
5dadf50af191: Pushed
9381ea099d31: Pushed
20190301125537: digest: sha256:dfc744fd3f92ec306d58547d127bcdaa0ed0b11631835a83ad03fc2651a01845
size: 2841

> Task :beam-runners-google-cloud-dataflow-java:validatesRunnerFnApiWorkerTest

org.apache.beam.sdk.transforms.CombineTest$WindowingTests > testFixedWindowsCombineWithContext
FAILED
    java.lang.RuntimeException at CombineTest.java:1072

org.apache.beam.sdk.transforms.CombineTest$WindowingTests > testSessionsCombineWithContext
FAILED
    java.lang.RuntimeException at CombineTest.java:1286

org.apache.beam.sdk.transforms.ParDoTest$MultipleInputsAndOutputTests > testParDoWithSideInputsIsCumulative
FAILED
    java.lang.RuntimeException at ParDoTest.java:771

org.apache.beam.sdk.testing.PAssertTest > testGlobalWindowContainsInAnyOrder FAILED
    java.lang.RuntimeException at PAssertTest.java:405

org.apache.beam.sdk.transforms.FlattenTest > testFlattenMultiplePCollectionsHavingMultipleConsumers
FAILED
    java.lang.RuntimeException at FlattenTest.java:347

org.apache.beam.sdk.transforms.FlattenTest > testFlattenIterables FAILED
    java.lang.RuntimeException at FlattenTest.java:252

org.apache.beam.sdk.transforms.FlattenTest > testFlattenIterablesSets FAILED
    java.lang.RuntimeException at FlattenTest.java:280
        Caused by: com.google.api.client.googleapis.json.GoogleJsonResponseException at FlattenTest.java:280

org.apache.beam.sdk.testing.PAssertTest > testEmptyFalseDefaultReasonString FAILED
    java.lang.AssertionError at PAssertTest.java:500

org.apache.beam.sdk.transforms.FlattenTest > testFlattenPCollectionsEmptyThenParDo FAILED
    java.lang.RuntimeException at FlattenTest.java:224

org.apache.beam.sdk.testing.PAssertTest > testAssertionSiteIsCapturedWithoutMessage FAILED
    java.lang.AssertionError at PAssertTest.java:541

org.apache.beam.sdk.transforms.ViewTest > testEmptyMultimapSideInput FAILED
    java.lang.RuntimeException at ViewTest.java:830

org.apache.beam.sdk.transforms.ViewTest > testCombinedMapSideInput FAILED
    java.lang.RuntimeException at ViewTest.java:1334
        Caused by: com.google.api.client.googleapis.json.GoogleJsonResponseException at ViewTest.java:1334

org.apache.beam.sdk.testing.PAssertTest > testWindowedIsEqualTo FAILED
    java.lang.RuntimeException at PAssertTest.java:346

org.apache.beam.sdk.transforms.ViewTest > testMultimapSideInputIsImmutable FAILED
    java.lang.RuntimeException at ViewTest.java:913

org.apache.beam.sdk.transforms.ViewTest > testWindowedMultimapAsEntrySetSideInput FAILED
    java.lang.RuntimeException at ViewTest.java:747

org.apache.beam.sdk.testing.PAssertTest > testContainsInAnyOrderFalse FAILED
    java.lang.AssertionError at PAssertTest.java:467

org.apache.beam.sdk.transforms.ViewTest > testWindowedSingletonSideInput FAILED
    java.lang.RuntimeException at ViewTest.java:152

org.apache.beam.sdk.transforms.ViewTest > testSideInputWithNullDefault FAILED
    java.lang.RuntimeException at ViewTest.java:1484

org.apache.beam.sdk.transforms.ViewTest > testWindowedListSideInput FAILED
    java.lang.RuntimeException at ViewTest.java:290

org.apache.beam.sdk.transforms.ViewTest > testWindowedMapSideInput FAILED
    java.lang.RuntimeException at ViewTest.java:1056

org.apache.beam.sdk.transforms.ViewTest > testIterableSideInputIsImmutable FAILED
    java.lang.RuntimeException at ViewTest.java:505

org.apache.beam.sdk.transforms.ViewTest > testListSideInputIsImmutable FAILED
    java.lang.RuntimeException at ViewTest.java:368
        Caused by: com.google.api.client.googleapis.json.GoogleJsonResponseException at ViewTest.java:368

158 tests completed, 22 failed, 2 skipped

> Task :beam-runners-google-cloud-dataflow-java:validatesRunnerFnApiWorkerTest FAILED

> Task :beam-runners-google-cloud-dataflow-java:cleanUpDockerImages
Untagged: us.gcr.io/apache-beam-testing/java-postcommit-it/java:20190301125537
Untagged: us.gcr.io/apache-beam-testing/java-postcommit-it/java@sha256:dfc744fd3f92ec306d58547d127bcdaa0ed0b11631835a83ad03fc2651a01845
Digests:
- us.gcr.io/apache-beam-testing/java-postcommit-it/java@sha256:dfc744fd3f92ec306d58547d127bcdaa0ed0b11631835a83ad03fc2651a01845
  Associated tags:
 - 20190301125537
Tags:
- us.gcr.io/apache-beam-testing/java-postcommit-it/java:20190301125537
Deleted [us.gcr.io/apache-beam-testing/java-postcommit-it/java:20190301125537].
Deleted [us.gcr.io/apache-beam-testing/java-postcommit-it/java@sha256:dfc744fd3f92ec306d58547d127bcdaa0ed0b11631835a83ad03fc2651a01845].

FAILURE: Build failed with an exception.

* What went wrong:
Execution failed for task ':beam-runners-google-cloud-dataflow-java:validatesRunnerFnApiWorkerTest'.
> There were failing tests. See the report at: file://<https://builds.apache.org/job/beam_PostCommit_Java_ValidatesRunner_PortabilityApi_Dataflow/ws/src/runners/google-cloud-dataflow-java/build/reports/tests/validatesRunnerFnApiWorkerTest/index.html>

* Try:
Run with --stacktrace option to get the stack trace. Run with --info or --debug option to
get more log output. Run with --scan to get full insights.

* Get more help at https://help.gradle.org

Deprecated Gradle features were used in this build, making it incompatible with Gradle 6.0.
Use '--warning-mode all' to show the individual deprecation warnings.
See https://docs.gradle.org/5.2.1/userguide/command_line_interface.html#sec:command_line_warnings

BUILD FAILED in 1h 34m 16s
76 actionable tasks: 58 executed, 17 from cache, 1 up-to-date

Publishing build scan...
https://gradle.com/s/5mqvsdnimhpv6

Build step 'Invoke Gradle script' changed build result to FAILURE
Build step 'Invoke Gradle script' marked build as failure

---------------------------------------------------------------------
To unsubscribe, e-mail: builds-unsubscribe@beam.apache.org
For additional commands, e-mail: builds-help@beam.apache.org


Mime
View raw message