beam-builds mailing list archives

Site index · List index
Message view « Date » · « Thread »
Top « Date » · « Thread »
From Apache Jenkins Server <jenk...@builds.apache.org>
Subject Build failed in Jenkins: beam_PostCommit_Java_ValidatesRunner_Dataflow #2369
Date Thu, 28 Mar 2019 20:32:21 GMT
See <https://builds.apache.org/job/beam_PostCommit_Java_ValidatesRunner_Dataflow/2369/display/redirect?page=changes>

Changes:

[boyuanz] self.assertEquals is depecrated.

------------------------------------------
Started by GitHub push by pabloem
[EnvInject] - Loading node environment variables.
Building remotely on beam14 (beam) in workspace <https://builds.apache.org/job/beam_PostCommit_Java_ValidatesRunner_Dataflow/ws/>
No credentials specified
 > git rev-parse --is-inside-work-tree # timeout=10
Fetching changes from the remote Git repository
 > git config remote.origin.url https://github.com/apache/beam.git # timeout=10
Fetching upstream changes from https://github.com/apache/beam.git
 > git --version # timeout=10
 > git fetch --tags --progress https://github.com/apache/beam.git +refs/heads/*:refs/remotes/origin/*
+refs/pull/${ghprbPullId}/*:refs/remotes/origin/pr/${ghprbPullId}/*
 > git rev-parse origin/master^{commit} # timeout=10
Checking out Revision 49ebfc2560bb9a565638b40d980a7a0d2c26549f (origin/master)
 > git config core.sparsecheckout # timeout=10
 > git checkout -f 49ebfc2560bb9a565638b40d980a7a0d2c26549f
Commit message: "Merge pull request #8137 from boyuanzz/fix_py"
 > git rev-list --no-walk 4a3cb6964c18410ad39fca00cdef06e05fa52da6 # timeout=10
Cleaning workspace
 > git rev-parse --verify HEAD # timeout=10
Resetting working tree
 > git reset --hard # timeout=10
 > git clean -fdx # timeout=10
No emails were triggered.
[EnvInject] - Executing scripts and injecting environment variables after the SCM step.
[EnvInject] - Injecting as environment variables the properties content 
SPARK_LOCAL_IP=127.0.0.1

[EnvInject] - Variables injected successfully.
[Gradle] - Launching build.
[src] $ <https://builds.apache.org/job/beam_PostCommit_Java_ValidatesRunner_Dataflow/ws/src/gradlew>
--continue --max-workers=120 -Dorg.gradle.jvmargs=-Xms2g -Dorg.gradle.jvmargs=-Xmx4g :beam-runners-google-cloud-dataflow-java:validatesRunner
To honour the JVM settings for this build a new JVM will be forked. Please consider using
the daemon: https://docs.gradle.org/5.2.1/userguide/gradle_daemon.html.
Daemon will be stopped at the end of the build stopping after processing
> Task :buildSrc:compileJava NO-SOURCE
> Task :buildSrc:compileGroovy FROM-CACHE
> Task :buildSrc:pluginDescriptors
> Task :buildSrc:processResources
> Task :buildSrc:classes
> Task :buildSrc:jar
> Task :buildSrc:assemble
> Task :buildSrc:spotlessGroovy
> Task :buildSrc:spotlessGroovyCheck
> Task :buildSrc:spotlessGroovyGradle
> Task :buildSrc:spotlessGroovyGradleCheck
> Task :buildSrc:spotlessCheck
> Task :buildSrc:pluginUnderTestMetadata
> Task :buildSrc:compileTestJava NO-SOURCE
> Task :buildSrc:compileTestGroovy NO-SOURCE
> Task :buildSrc:processTestResources NO-SOURCE
> Task :buildSrc:testClasses UP-TO-DATE
> Task :buildSrc:test NO-SOURCE
> Task :buildSrc:validateTaskProperties FROM-CACHE
> Task :buildSrc:check
> Task :buildSrc:build
Configuration on demand is an incubating feature.
> Task :beam-sdks-java-fn-execution:processResources NO-SOURCE
> Task :beam-sdks-java-harness:processResources NO-SOURCE
> Task :beam-sdks-java-io-google-cloud-platform:processResources NO-SOURCE
> Task :beam-runners-google-cloud-dataflow-java-legacy-worker:processResources NO-SOURCE
> Task :beam-runners-java-fn-execution:processResources NO-SOURCE
> Task :beam-sdks-java-core:generateAvroProtocol NO-SOURCE
> Task :beam-runners-core-java:processResources NO-SOURCE
> Task :beam-vendor-sdks-java-extensions-protobuf:processResources NO-SOURCE
> Task :beam-sdks-java-extensions-google-cloud-platform-core:processResources NO-SOURCE
> Task :beam-runners-core-construction-java:processResources NO-SOURCE
> Task :beam-model-job-management:extractProto
> Task :beam-model-fn-execution:extractProto
> Task :beam-sdks-java-extensions-protobuf:extractProto
> Task :beam-sdks-java-core:generateAvroJava NO-SOURCE
> Task :beam-sdks-java-extensions-protobuf:processResources NO-SOURCE
> Task :beam-model-job-management:processResources
> Task :beam-model-fn-execution:processResources
> Task :beam-runners-google-cloud-dataflow-java:processResources
> Task :beam-sdks-java-core:generateGrammarSource FROM-CACHE
> Task :beam-sdks-java-core:processResources
> Task :beam-sdks-java-core:generateTestAvroProtocol NO-SOURCE
> Task :beam-model-pipeline:extractIncludeProto
> Task :beam-model-pipeline:extractProto
> Task :beam-runners-google-cloud-dataflow-java-windmill:extractIncludeProto
> Task :beam-runners-google-cloud-dataflow-java-windmill:extractProto
> Task :beam-sdks-java-core:generateTestAvroJava
> Task :beam-sdks-java-core:generateTestGrammarSource NO-SOURCE
> Task :beam-sdks-java-core:processTestResources NO-SOURCE
> Task :beam-runners-google-cloud-dataflow-java-windmill:generateProto
> Task :beam-runners-google-cloud-dataflow-java-windmill:compileJava FROM-CACHE
> Task :beam-runners-google-cloud-dataflow-java-windmill:processResources
> Task :beam-runners-google-cloud-dataflow-java-windmill:classes
> Task :beam-model-pipeline:generateProto
> Task :beam-model-pipeline:compileJava FROM-CACHE
> Task :beam-model-pipeline:processResources
> Task :beam-model-pipeline:classes
> Task :beam-model-pipeline:jar
> Task :beam-model-job-management:extractIncludeProto
> Task :beam-model-fn-execution:extractIncludeProto
> Task :beam-model-job-management:generateProto
> Task :beam-model-fn-execution:generateProto
> Task :beam-model-job-management:compileJava FROM-CACHE
> Task :beam-model-job-management:classes
> Task :beam-model-fn-execution:compileJava FROM-CACHE
> Task :beam-model-fn-execution:classes
> Task :beam-runners-google-cloud-dataflow-java-windmill:shadowJar
> Task :beam-model-pipeline:shadowJar
> Task :beam-model-job-management:shadowJar
> Task :beam-sdks-java-core:compileJava FROM-CACHE
> Task :beam-sdks-java-core:classes
> Task :beam-model-fn-execution:shadowJar
> Task :beam-sdks-java-core:shadowJar
> Task :beam-sdks-java-extensions-protobuf:extractIncludeProto
> Task :beam-sdks-java-extensions-protobuf:generateProto NO-SOURCE
> Task :beam-sdks-java-core:compileTestJava FROM-CACHE
> Task :beam-sdks-java-core:testClasses UP-TO-DATE
> Task :beam-vendor-sdks-java-extensions-protobuf:compileJava FROM-CACHE
> Task :beam-vendor-sdks-java-extensions-protobuf:classes UP-TO-DATE
> Task :beam-runners-core-construction-java:compileJava FROM-CACHE
> Task :beam-runners-core-construction-java:classes UP-TO-DATE
> Task :beam-sdks-java-extensions-google-cloud-platform-core:compileJava FROM-CACHE
> Task :beam-sdks-java-extensions-google-cloud-platform-core:classes UP-TO-DATE
> Task :beam-sdks-java-fn-execution:compileJava FROM-CACHE
> Task :beam-sdks-java-fn-execution:classes UP-TO-DATE
> Task :beam-sdks-java-fn-execution:shadowJar
> Task :beam-sdks-java-extensions-protobuf:compileJava FROM-CACHE
> Task :beam-sdks-java-extensions-protobuf:classes UP-TO-DATE
> Task :beam-sdks-java-extensions-protobuf:shadowJar
> Task :beam-runners-core-construction-java:shadowJar
> Task :beam-runners-core-java:compileJava FROM-CACHE
> Task :beam-runners-core-java:classes UP-TO-DATE
> Task :beam-runners-core-java:shadowJar
> Task :beam-vendor-sdks-java-extensions-protobuf:shadowJar
> Task :beam-sdks-java-extensions-google-cloud-platform-core:shadowJar
> Task :beam-sdks-java-harness:compileJava FROM-CACHE
> Task :beam-sdks-java-harness:classes UP-TO-DATE
> Task :beam-sdks-java-harness:jar
> Task :beam-sdks-java-io-google-cloud-platform:compileJava FROM-CACHE
> Task :beam-sdks-java-io-google-cloud-platform:classes UP-TO-DATE
> Task :beam-sdks-java-io-google-cloud-platform:shadowJar
> Task :beam-runners-google-cloud-dataflow-java:compileJava FROM-CACHE
> Task :beam-runners-google-cloud-dataflow-java:classes
> Task :beam-runners-google-cloud-dataflow-java:shadowJar
> Task :beam-sdks-java-core:shadowTestJar
> Task :beam-sdks-java-harness:shadowJar
> Task :beam-runners-java-fn-execution:compileJava FROM-CACHE
> Task :beam-runners-java-fn-execution:classes UP-TO-DATE
> Task :beam-runners-java-fn-execution:shadowJar
> Task :beam-runners-google-cloud-dataflow-java-legacy-worker:compileJava FROM-CACHE
> Task :beam-runners-google-cloud-dataflow-java-legacy-worker:classes UP-TO-DATE
> Task :beam-runners-google-cloud-dataflow-java-legacy-worker:shadowJar
> Task :beam-runners-google-cloud-dataflow-java:validatesRunnerLegacyWorkerTest

org.apache.beam.sdk.transforms.ViewTest > testEmptyListSideInput FAILED
    java.lang.RuntimeException at ViewTest.java:319

215 tests completed, 1 failed, 2 skipped

> Task :beam-runners-google-cloud-dataflow-java:validatesRunnerLegacyWorkerTest FAILED

FAILURE: Build failed with an exception.

* What went wrong:
Execution failed for task ':beam-runners-google-cloud-dataflow-java:validatesRunnerLegacyWorkerTest'.
> There were failing tests. See the report at: file://<https://builds.apache.org/job/beam_PostCommit_Java_ValidatesRunner_Dataflow/ws/src/runners/google-cloud-dataflow-java/build/reports/tests/validatesRunnerLegacyWorkerTest/index.html>

* Try:
Run with --stacktrace option to get the stack trace. Run with --info or --debug option to
get more log output. Run with --scan to get full insights.

* Get more help at https://help.gradle.org

Deprecated Gradle features were used in this build, making it incompatible with Gradle 6.0.
Use '--warning-mode all' to show the individual deprecation warnings.
See https://docs.gradle.org/5.2.1/userguide/command_line_interface.html#sec:command_line_warnings

BUILD FAILED in 2h 52m 16s
59 actionable tasks: 41 executed, 18 from cache

Publishing build scan...
https://gradle.com/s/qakbjxdc3zhcs

Build step 'Invoke Gradle script' changed build result to FAILURE
Build step 'Invoke Gradle script' marked build as failure

---------------------------------------------------------------------
To unsubscribe, e-mail: builds-unsubscribe@beam.apache.org
For additional commands, e-mail: builds-help@beam.apache.org


Mime
View raw message