beam-builds mailing list archives

Site index · List index
Message view « Date » · « Thread »
Top « Date » · « Thread »
From Apache Jenkins Server <jenk...@builds.apache.org>
Subject Build failed in Jenkins: beam_PostCommit_Java_ValidatesRunner_Samza #2431
Date Fri, 01 Mar 2019 04:03:38 GMT
See <https://builds.apache.org/job/beam_PostCommit_Java_ValidatesRunner_Samza/2431/display/redirect?page=changes>

Changes:

[kenn] [BEAM-6554] Migrate from findbugs to spotbugs

------------------------------------------
[...truncated 54.33 KB...]
        Caused by: java.lang.OutOfMemoryError

org.apache.beam.sdk.transforms.ParDoTest$BasicTests > testPipelineOptionsParameter FAILED
    org.apache.beam.sdk.Pipeline$PipelineExecutionException at ParDoTest.java:544
        Caused by: java.lang.OutOfMemoryError

org.apache.beam.sdk.transforms.ParDoTest$BasicTests > testParDoEmpty FAILED
    org.apache.beam.sdk.Pipeline$PipelineExecutionException at ParDoTest.java:362
        Caused by: java.lang.OutOfMemoryError

org.apache.beam.sdk.transforms.ParDoTest$BasicTests > testParDoInCustomTransform FAILED
    org.apache.beam.sdk.Pipeline$PipelineExecutionException at ParDoTest.java:408
        Caused by: java.lang.OutOfMemoryError

org.apache.beam.sdk.transforms.ParDoTest$BasicTests > testParDoEmptyOutputs FAILED
    org.apache.beam.sdk.Pipeline$PipelineExecutionException at ParDoTest.java:378
        Caused by: java.lang.OutOfMemoryError

org.apache.beam.sdk.transforms.CombineTest$AccumulationTests > testAccumulatingCombine
FAILED
    org.apache.beam.sdk.Pipeline$PipelineExecutionException at CombineTest.java:1417
        Caused by: java.lang.OutOfMemoryError

org.apache.beam.sdk.transforms.CombineTest$AccumulationTests > testAccumulatingCombineEmpty
FAILED
    org.apache.beam.sdk.Pipeline$PipelineExecutionException at CombineTest.java:1430
        Caused by: java.lang.OutOfMemoryError

org.apache.beam.sdk.transforms.CreateTest > testCreateEmpty FAILED
    org.apache.beam.sdk.Pipeline$PipelineExecutionException at CreateTest.java:101
        Caused by: java.lang.OutOfMemoryError

org.apache.beam.sdk.transforms.CreateTest > testCreateWithKVVoidType FAILED
    org.apache.beam.sdk.Pipeline$PipelineExecutionException at CreateTest.java:337
        Caused by: java.lang.OutOfMemoryError

org.apache.beam.sdk.transforms.CreateTest > testCreateWithNullsAndValues FAILED
    org.apache.beam.sdk.Pipeline$PipelineExecutionException at CreateTest.java:161
        Caused by: java.lang.OutOfMemoryError

org.apache.beam.sdk.transforms.CreateTest > testCreateWithVoidType FAILED
    org.apache.beam.sdk.Pipeline$PipelineExecutionException at CreateTest.java:325
        Caused by: java.lang.OutOfMemoryError

org.apache.beam.sdk.transforms.CreateTest > testCreate FAILED
    org.apache.beam.sdk.Pipeline$PipelineExecutionException at CreateTest.java:90
        Caused by: java.lang.OutOfMemoryError

org.apache.beam.sdk.transforms.ParDoSchemaTest > testReadAndWrite FAILED
    org.apache.beam.sdk.Pipeline$PipelineExecutionException at ParDoSchemaTest.java:142
        Caused by: java.lang.OutOfMemoryError

org.apache.beam.sdk.transforms.ParDoSchemaTest > testSchemasPassedThrough FAILED
    org.apache.beam.sdk.Pipeline$PipelineExecutionException at ParDoSchemaTest.java:408
        Caused by: java.lang.OutOfMemoryError

org.apache.beam.sdk.transforms.ParDoSchemaTest > testInferredSchemaPipeline FAILED
    org.apache.beam.sdk.Pipeline$PipelineExecutionException at ParDoSchemaTest.java:395
        Caused by: java.lang.OutOfMemoryError

org.apache.beam.sdk.transforms.ParDoSchemaTest > testFieldAccessSchemaPipeline FAILED
    org.apache.beam.sdk.Pipeline$PipelineExecutionException at ParDoSchemaTest.java:316
        Caused by: java.lang.OutOfMemoryError

org.apache.beam.sdk.transforms.ParDoSchemaTest > testSimpleSchemaPipeline FAILED
    org.apache.beam.sdk.Pipeline$PipelineExecutionException at ParDoSchemaTest.java:90
        Caused by: java.lang.OutOfMemoryError

org.apache.beam.sdk.transforms.ParDoSchemaTest > testSchemaConversionPipeline FAILED
    org.apache.beam.sdk.Pipeline$PipelineExecutionException at ParDoSchemaTest.java:443
        Caused by: java.lang.OutOfMemoryError

org.apache.beam.sdk.transforms.ParDoSchemaTest > testReadAndWriteWithSchemaRegistry FAILED
    org.apache.beam.sdk.Pipeline$PipelineExecutionException at ParDoSchemaTest.java:281
        Caused by: java.lang.OutOfMemoryError

org.apache.beam.sdk.transforms.ParDoSchemaTest > testReadAndWriteMultiOutput FAILED
    org.apache.beam.sdk.Pipeline$PipelineExecutionException at ParDoSchemaTest.java:236
        Caused by: java.lang.OutOfMemoryError

org.apache.beam.sdk.transforms.ParDoTest$TimerCoderInferenceTests > testValueStateCoderInferenceFromInputCoder
FAILED
    org.apache.beam.sdk.Pipeline$PipelineExecutionException at ParDoTest.java:3305
        Caused by: java.lang.OutOfMemoryError

org.apache.beam.sdk.transforms.ParDoTest$TimerCoderInferenceTests > testValueStateCoderInference
FAILED
    org.apache.beam.sdk.Pipeline$PipelineExecutionException at ParDoTest.java:3235
        Caused by: java.lang.OutOfMemoryError

org.apache.beam.sdk.transforms.ParDoTest$MultipleInputsAndOutputTests > testParDoWithOnlyTaggedOutput
FAILED
    org.apache.beam.sdk.Pipeline$PipelineExecutionException at ParDoTest.java:687
        Caused by: java.lang.OutOfMemoryError

org.apache.beam.sdk.transforms.ParDoTest$MultipleInputsAndOutputTests > testMultiOutputParDoWithSideInputs
FAILED
    org.apache.beam.sdk.Pipeline$PipelineExecutionException at ParDoTest.java:809
        Caused by: java.lang.OutOfMemoryError

org.apache.beam.sdk.transforms.ParDoTest$MultipleInputsAndOutputTests > testSideInputsWithMultipleWindows
FAILED
    org.apache.beam.sdk.Pipeline$PipelineExecutionException at ParDoTest.java:895
        Caused by: java.lang.OutOfMemoryError

org.apache.beam.sdk.transforms.ParDoTest$MultipleInputsAndOutputTests > testParDoEmptyWithTaggedOutput
FAILED
    org.apache.beam.sdk.Pipeline$PipelineExecutionException at ParDoTest.java:634
        Caused by: java.lang.OutOfMemoryError

org.apache.beam.sdk.transforms.ParDoTest$MultipleInputsAndOutputTests > testParDoWithTaggedOutput
FAILED
    org.apache.beam.sdk.Pipeline$PipelineExecutionException at ParDoTest.java:592
        Caused by: java.lang.OutOfMemoryError

org.apache.beam.sdk.transforms.ParDoTest$MultipleInputsAndOutputTests > testMultiOutputParDoWithSideInputsIsCumulative
FAILED
    org.apache.beam.sdk.Pipeline$PipelineExecutionException at ParDoTest.java:847
        Caused by: java.lang.OutOfMemoryError

org.apache.beam.sdk.transforms.ParDoTest$MultipleInputsAndOutputTests > testParDoWithEmptyTaggedOutput
FAILED
    org.apache.beam.sdk.Pipeline$PipelineExecutionException at ParDoTest.java:658
        Caused by: java.lang.OutOfMemoryError

org.apache.beam.sdk.transforms.ParDoTest$MultipleInputsAndOutputTests > testParDoWithSideInputs
FAILED
    org.apache.beam.sdk.Pipeline$PipelineExecutionException at ParDoTest.java:737
        Caused by: java.lang.OutOfMemoryError

org.apache.beam.sdk.transforms.ParDoTest$MultipleInputsAndOutputTests > testParDoWithSideInputsIsCumulative
FAILED
    org.apache.beam.sdk.Pipeline$PipelineExecutionException at ParDoTest.java:771
        Caused by: java.lang.OutOfMemoryError

org.apache.beam.sdk.transforms.ParDoTest$LifecycleTests > testWindowingInStartAndFinishBundle
FAILED
    org.apache.beam.sdk.Pipeline$PipelineExecutionException at ParDoTest.java:1220
        Caused by: java.lang.OutOfMemoryError

org.apache.beam.sdk.transforms.windowing.WindowingTest > testMergingWindowing FAILED
    org.apache.beam.sdk.Pipeline$PipelineExecutionException at WindowingTest.java:168
        Caused by: java.lang.OutOfMemoryError

org.apache.beam.sdk.transforms.windowing.WindowingTest > testWindowPreservation FAILED
    org.apache.beam.sdk.Pipeline$PipelineExecutionException at WindowingTest.java:197
        Caused by: java.lang.OutOfMemoryError

org.apache.beam.sdk.transforms.windowing.WindowingTest > testNonPartitioningWindowing FAILED
    org.apache.beam.sdk.Pipeline$PipelineExecutionException at WindowingTest.java:150
        Caused by: java.lang.OutOfMemoryError

org.apache.beam.sdk.transforms.windowing.WindowingTest > testPartitioningWindowing FAILED
    org.apache.beam.sdk.Pipeline$PipelineExecutionException at WindowingTest.java:126
        Caused by: java.lang.OutOfMemoryError

org.apache.beam.sdk.transforms.windowing.WindowTest > testTimestampCombinerEndOfWindow
FAILED
    org.apache.beam.sdk.Pipeline$PipelineExecutionException at WindowTest.java:498
        Caused by: java.lang.OutOfMemoryError

org.apache.beam.sdk.transforms.windowing.WindowTest > testTimestampCombinerDefault FAILED
    org.apache.beam.sdk.Pipeline$PipelineExecutionException at WindowTest.java:468
        Caused by: java.lang.OutOfMemoryError

org.apache.beam.sdk.transforms.windowing.WindowTest > testMergingCustomWindows FAILED
    org.apache.beam.sdk.Pipeline$PipelineExecutionException at WindowTest.java:632
        Caused by: java.lang.OutOfMemoryError

org.apache.beam.sdk.transforms.windowing.WindowTest > testNoWindowFnDoesNotReassignWindows
FAILED
    org.apache.beam.sdk.Pipeline$PipelineExecutionException at WindowTest.java:434
        Caused by: java.lang.OutOfMemoryError

org.apache.beam.sdk.transforms.windowing.WindowTest > testMergingCustomWindowsKeyedCollection
FAILED
    org.apache.beam.sdk.Pipeline$PipelineExecutionException at WindowTest.java:659
        Caused by: java.lang.OutOfMemoryError

org.apache.beam.sdk.transforms.WithTimestampsTest > withTimestampsShouldApplyTimestamps
FAILED
    org.apache.beam.sdk.Pipeline$PipelineExecutionException at WithTimestampsTest.java:78
        Caused by: java.lang.OutOfMemoryError

org.apache.beam.sdk.transforms.WithTimestampsTest > withTimestampsBackwardsInTimeAndWithAllowedTimestampSkewShouldSucceed
FAILED
    org.apache.beam.sdk.Pipeline$PipelineExecutionException at WithTimestampsTest.java:142
        Caused by: java.lang.OutOfMemoryError

org.apache.beam.sdk.transforms.WithTimestampsTest > withTimestampsLambdaShouldApplyTimestamps
FAILED
    org.apache.beam.sdk.Pipeline$PipelineExecutionException at WithTimestampsTest.java:205
        Caused by: java.lang.OutOfMemoryError

org.apache.beam.sdk.transforms.SplittableDoFnTest > testSideInputBounded FAILED
    org.apache.beam.sdk.Pipeline$PipelineExecutionException at SplittableDoFnTest.java:375
        Caused by: java.lang.OutOfMemoryError

org.apache.beam.sdk.transforms.SplittableDoFnTest > testPairWithIndexWindowedTimestampedBounded
FAILED
    org.apache.beam.sdk.Pipeline$PipelineExecutionException at SplittableDoFnTest.java:219
        Caused by: java.lang.OutOfMemoryError

org.apache.beam.sdk.transforms.SplittableDoFnTest > testWindowedSideInputBounded FAILED
    org.apache.beam.sdk.Pipeline$PipelineExecutionException at SplittableDoFnTest.java:427
        Caused by: java.lang.OutOfMemoryError

org.apache.beam.sdk.transforms.SplittableDoFnTest > testWindowedSideInputWithCheckpointsBounded
FAILED
    org.apache.beam.sdk.Pipeline$PipelineExecutionException at SplittableDoFnTest.java:561
        Caused by: java.lang.OutOfMemoryError

org.apache.beam.sdk.transforms.SplittableDoFnTest > testPairWithIndexBasicBounded FAILED
    org.apache.beam.sdk.Pipeline$PipelineExecutionException at SplittableDoFnTest.java:152
        Caused by: java.lang.OutOfMemoryError

org.apache.beam.sdk.transforms.SplittableDoFnTest > testOutputAfterCheckpointBounded FAILED
    org.apache.beam.sdk.Pipeline$PipelineExecutionException at SplittableDoFnTest.java:309
        Caused by: java.lang.OutOfMemoryError

org.apache.beam.sdk.transforms.SplittableDoFnTest > testAdditionalOutputBounded FAILED
    org.apache.beam.sdk.Pipeline$PipelineExecutionException at SplittableDoFnTest.java:634
        Caused by: java.lang.OutOfMemoryError

org.apache.beam.sdk.transforms.ReifyTimestampsTest > extractFromValuesWhenValueTimestampedLaterSucceeds
FAILED
    org.apache.beam.sdk.Pipeline$PipelineExecutionException at ReifyTimestampsTest.java:128
        Caused by: java.lang.OutOfMemoryError

org.apache.beam.sdk.transforms.ReifyTimestampsTest > extractFromValuesSucceeds FAILED
    org.apache.beam.sdk.Pipeline$PipelineExecutionException at ReifyTimestampsTest.java:92
        Caused by: java.lang.OutOfMemoryError

org.apache.beam.sdk.transforms.ReifyTimestampsTest > inValuesSucceeds FAILED
    org.apache.beam.sdk.Pipeline$PipelineExecutionException at ReifyTimestampsTest.java:60
        Caused by: java.lang.OutOfMemoryError

org.apache.beam.sdk.io.CountingSourceTest > testUnboundedSourceSplits FAILED
    org.apache.beam.sdk.Pipeline$PipelineExecutionException at CountingSourceTest.java:246
        Caused by: java.lang.OutOfMemoryError

org.apache.beam.sdk.io.CountingSourceTest > testBoundedSourceSplits FAILED
    org.apache.beam.sdk.Pipeline$PipelineExecutionException at CountingSourceTest.java:121
        Caused by: java.lang.OutOfMemoryError

207 tests completed, 195 failed, 1 skipped

> Task :beam-runners-samza:validatesRunner FAILED

FAILURE: Build failed with an exception.

* What went wrong:
Execution failed for task ':beam-runners-samza:validatesRunner'.
> There were failing tests. See the report at: file://<https://builds.apache.org/job/beam_PostCommit_Java_ValidatesRunner_Samza/ws/src/runners/samza/build/reports/tests/validatesRunner/index.html>

* Try:
Run with --stacktrace option to get the stack trace. Run with --info or --debug option to
get more log output. Run with --scan to get full insights.

* Get more help at https://help.gradle.org

Deprecated Gradle features were used in this build, making it incompatible with Gradle 6.0.
Use '--warning-mode all' to show the individual deprecation warnings.
See https://docs.gradle.org/5.2.1/userguide/command_line_interface.html#sec:command_line_warnings

BUILD FAILED in 2m 2s
47 actionable tasks: 35 executed, 12 from cache

Publishing build scan...
https://gradle.com/s/kfautyrdfntie

Build step 'Invoke Gradle script' changed build result to FAILURE
Build step 'Invoke Gradle script' marked build as failure

---------------------------------------------------------------------
To unsubscribe, e-mail: builds-unsubscribe@beam.apache.org
For additional commands, e-mail: builds-help@beam.apache.org


Mime
View raw message