beam-commits mailing list archives

Site index · List index
Message view « Date » · « Thread »
Top « Date » · « Thread »
From Kenneth Knowles <...@google.com>
Subject Re: Build failed in Jenkins: beam_PostCommit_MavenVerify #1522
Date Thu, 13 Oct 2016 23:18:48 GMT
FYI I am watching the subsequent results. This error was caused by the JVM
on the Jenkins worker getting OOM-killed, did not seem to relate to recent
changes. But I'll watch to make sure.

On Thu, Oct 13, 2016 at 3:35 PM Apache Jenkins Server <
jenkins@builds.apache.org> wrote:

> See <
> https://builds.apache.org/job/beam_PostCommit_MavenVerify/1522/changes>
>
> Changes:
>
> [klk] Move triggers to runners-core
>
> [klk] Rename runners-core Trigger to TriggerStateMachine
>
> [klk] Restore prior trigger files, for temporary compatibility
>
> ------------------------------------------
> [...truncated 3079 lines...]
> [INFO] Compiling 15 source files to <
> https://builds.apache.org/job/beam_PostCommit_MavenVerify/ws/sdks/java/io/google-cloud-platform/target/classes
> >
> [INFO] <
> https://builds.apache.org/job/beam_PostCommit_MavenVerify/ws/sdks/java/io/google-cloud-platform/src/main/java/org/apache/beam/sdk/io/gcp/datastore/DatastoreV1.java>:
> <
> https://builds.apache.org/job/beam_PostCommit_MavenVerify/ws/sdks/java/io/google-cloud-platform/src/main/java/org/apache/beam/sdk/io/gcp/datastore/DatastoreV1.java>
> uses or overrides a deprecated API.
> [INFO] <
> https://builds.apache.org/job/beam_PostCommit_MavenVerify/ws/sdks/java/io/google-cloud-platform/src/main/java/org/apache/beam/sdk/io/gcp/datastore/DatastoreV1.java>:
> Recompile with -Xlint:deprecation for details.
> [INFO]
> [INFO] --- maven-resources-plugin:2.7:testResources
> (default-testResources) @ beam-sdks-java-io-google-cloud-platform ---
> [INFO] Using 'UTF-8' encoding to copy filtered resources.
> [INFO] skip non existing resourceDirectory <
> https://builds.apache.org/job/beam_PostCommit_MavenVerify/ws/sdks/java/io/google-cloud-platform/src/test/resources
> >
> [INFO] Copying 3 resources
> [INFO]
> [INFO] --- maven-compiler-plugin:3.5.1:testCompile (default-testCompile) @
> beam-sdks-java-io-google-cloud-platform ---
> [INFO] Changes detected - recompiling the module!
> [INFO] Compiling 15 source files to <
> https://builds.apache.org/job/beam_PostCommit_MavenVerify/ws/sdks/java/io/google-cloud-platform/target/test-classes
> >
> [INFO] <
> https://builds.apache.org/job/beam_PostCommit_MavenVerify/ws/sdks/java/io/google-cloud-platform/src/test/java/org/apache/beam/sdk/io/gcp/datastore/V1TestUtil.java>:
> Some input files use or override a deprecated API.
> [INFO] <
> https://builds.apache.org/job/beam_PostCommit_MavenVerify/ws/sdks/java/io/google-cloud-platform/src/test/java/org/apache/beam/sdk/io/gcp/datastore/V1TestUtil.java>:
> Recompile with -Xlint:deprecation for details.
> [INFO]
> [INFO] --- maven-checkstyle-plugin:2.17:check (default) @
> beam-sdks-java-io-google-cloud-platform ---
> [INFO] Starting audit...
> Audit done.
> [INFO]
> [INFO] --- maven-surefire-plugin:2.19.1:test (default-test) @
> beam-sdks-java-io-google-cloud-platform ---
> [INFO] Surefire report directory: <
> https://builds.apache.org/job/beam_PostCommit_MavenVerify/ws/sdks/java/io/google-cloud-platform/target/surefire-reports
> >
> [INFO] Using configured provider
> org.apache.maven.surefire.junitcore.JUnitCoreProvider
> [INFO] parallel='none', perCoreThreadCount=true, threadCount=0,
> useUnlimitedThreads=false, threadCountSuites=0, threadCountClasses=0,
> threadCountMethods=0, parallelOptimized=true
>
> -------------------------------------------------------
>  T E S T S
> -------------------------------------------------------
> Running org.apache.beam.sdk.io.gcp.bigquery.BigQueryTableRowIteratorTest
> Tests run: 3, Failures: 0, Errors: 0, Skipped: 0, Time elapsed: 4.914 sec
> - in org.apache.beam.sdk.io.gcp.bigquery.BigQueryTableRowIteratorTest
> Running org.apache.beam.sdk.io.gcp.bigquery.BigQueryAvroUtilsTest
> Tests run: 1, Failures: 0, Errors: 0, Skipped: 0, Time elapsed: 0.442 sec
> - in org.apache.beam.sdk.io.gcp.bigquery.BigQueryAvroUtilsTest
> Running org.apache.beam.sdk.io.gcp.bigquery.BigQueryTableInserterTest
> Tests run: 4, Failures: 0, Errors: 0, Skipped: 0, Time elapsed: 1.577 sec
> - in org.apache.beam.sdk.io.gcp.bigquery.BigQueryTableInserterTest
> Running org.apache.beam.sdk.io.gcp.bigquery.BigQueryIOTest
> Tests run: 62, Failures: 0, Errors: 0, Skipped: 4, Time elapsed: 4.094 sec
> - in org.apache.beam.sdk.io.gcp.bigquery.BigQueryIOTest
> Running org.apache.beam.sdk.io.gcp.bigquery.BigQueryUtilTest
> Tests run: 9, Failures: 0, Errors: 0, Skipped: 0, Time elapsed: 6.062 sec
> - in org.apache.beam.sdk.io.gcp.bigquery.BigQueryUtilTest
> Running org.apache.beam.sdk.io.gcp.bigquery.BigQueryServicesImplTest
> Tests run: 14, Failures: 0, Errors: 0, Skipped: 0, Time elapsed: 0.143 sec
> - in org.apache.beam.sdk.io.gcp.bigquery.BigQueryServicesImplTest
> Running org.apache.beam.sdk.io.gcp.bigtable.BigtableIOTest
> Tests run: 25, Failures: 0, Errors: 0, Skipped: 0, Time elapsed: 4.991 sec
> - in org.apache.beam.sdk.io.gcp.bigtable.BigtableIOTest
> Running org.apache.beam.sdk.io.gcp.datastore.DatastoreV1Test
> Tests run: 43, Failures: 0, Errors: 0, Skipped: 0, Time elapsed: 0.308 sec
> - in org.apache.beam.sdk.io.gcp.datastore.DatastoreV1Test
>
> Results :
>
> Tests run: 161, Failures: 0, Errors: 0, Skipped: 4
>
> [JENKINS] Recording test results
> [INFO]
> [INFO] --- maven-jar-plugin:2.5:jar (default-jar) @
> beam-sdks-java-io-google-cloud-platform ---
> [INFO] Building jar: <
> https://builds.apache.org/job/beam_PostCommit_MavenVerify/ws/sdks/java/io/google-cloud-platform/target/beam-sdks-java-io-google-cloud-platform-0.3.0-incubating-SNAPSHOT.jar
> >
> [INFO]
> [INFO] --- maven-site-plugin:3.4:attach-descriptor (attach-descriptor) @
> beam-sdks-java-io-google-cloud-platform ---
> [INFO]
> [INFO] --- maven-source-plugin:2.4:jar-no-fork (attach-sources) @
> beam-sdks-java-io-google-cloud-platform ---
> [INFO] Building jar: <
> https://builds.apache.org/job/beam_PostCommit_MavenVerify/ws/sdks/java/io/google-cloud-platform/target/beam-sdks-java-io-google-cloud-platform-0.3.0-incubating-SNAPSHOT-sources.jar
> >
> [INFO]
> [INFO] --- maven-source-plugin:2.4:test-jar-no-fork (attach-test-sources)
> @ beam-sdks-java-io-google-cloud-platform ---
> [INFO] Building jar: <
> https://builds.apache.org/job/beam_PostCommit_MavenVerify/ws/sdks/java/io/google-cloud-platform/target/beam-sdks-java-io-google-cloud-platform-0.3.0-incubating-SNAPSHOT-test-sources.jar
> >
> [INFO]
> [INFO] --- maven-jar-plugin:2.5:test-jar (default-test-jar) @
> beam-sdks-java-io-google-cloud-platform ---
> [INFO] Building jar: <
> https://builds.apache.org/job/beam_PostCommit_MavenVerify/ws/sdks/java/io/google-cloud-platform/target/beam-sdks-java-io-google-cloud-platform-0.3.0-incubating-SNAPSHOT-tests.jar
> >
> [INFO]
> [INFO] --- maven-failsafe-plugin:2.19.1:integration-test (default) @
> beam-sdks-java-io-google-cloud-platform ---
> [INFO] Failsafe report directory: <
> https://builds.apache.org/job/beam_PostCommit_MavenVerify/ws/sdks/java/io/google-cloud-platform/target/failsafe-reports
> >
> [INFO] parallel='all', perCoreThreadCount=true, threadCount=4,
> useUnlimitedThreads=false, threadCountSuites=0, threadCountClasses=0,
> threadCountMethods=0, parallelOptimized=true
>
> -------------------------------------------------------
>  T E S T S
> -------------------------------------------------------
> Java HotSpot(TM) 64-Bit Server VM warning: INFO:
> os::commit_memory(0x00000007ad600000, 311951360, 0) failed; error='Cannot
> allocate memory' (errno=12)
> #
> # There is insufficient memory for the Java Runtime Environment to
> continue.
> # Native memory allocation (mmap) failed to map 311951360 bytes for
> committing reserved memory.
> # An error report file with more information is saved as:
> # <
> https://builds.apache.org/job/beam_PostCommit_MavenVerify/ws/sdks/java/io/google-cloud-platform/hs_err_pid16104.log
> >
>
> Results :
>
> Tests run: 0, Failures: 0, Errors: 0, Skipped: 0
>
> [JENKINS] Recording test results
> [INFO]
> [INFO]
> ------------------------------------------------------------------------
> [INFO] Skipping Apache Beam :: Parent
> [INFO] This project has been banned from the build due to previous
> failures.
> [INFO]
> ------------------------------------------------------------------------
> [INFO]
> ------------------------------------------------------------------------
> [INFO] Reactor Summary:
> [INFO]
> [INFO] Apache Beam :: Parent .............................. SUCCESS [
> 21.972 s]
> [INFO] Apache Beam :: SDKs ................................ SUCCESS [
> 2.559 s]
> [INFO] Apache Beam :: SDKs :: Java ........................ SUCCESS [
> 3.587 s]
> [INFO] Apache Beam :: SDKs :: Java :: Build Tools ......... SUCCESS [
> 4.526 s]
> [INFO] Apache Beam :: SDKs :: Java :: Core ................ SUCCESS [03:18
> min]
> [INFO] Apache Beam :: Runners ............................. SUCCESS [
> 4.212 s]
> [INFO] Apache Beam :: Runners :: Core Java ................ SUCCESS [
> 35.930 s]
> [INFO] Apache Beam :: Runners :: Direct Java .............. SUCCESS [02:17
> min]
> [INFO] Apache Beam :: Runners :: Google Cloud Dataflow .... SUCCESS [
> 52.276 s]
> [INFO] Apache Beam :: SDKs :: Java :: IO .................. SUCCESS [
> 3.611 s]
> [INFO] Apache Beam :: SDKs :: Java :: IO :: Google Cloud Platform FAILURE
> [ 44.369 s]
> [INFO] Apache Beam :: SDKs :: Java :: IO :: HDFS .......... SKIPPED
> [INFO] Apache Beam :: SDKs :: Java :: IO :: JMS ........... SKIPPED
> [INFO] Apache Beam :: SDKs :: Java :: IO :: Kafka ......... SKIPPED
> [INFO] Apache Beam :: SDKs :: Java :: IO :: Kinesis ....... SKIPPED
> [INFO] Apache Beam :: SDKs :: Java :: IO :: MongoDB ....... SKIPPED
> [INFO] Apache Beam :: SDKs :: Java :: IO :: JDBC .......... SKIPPED
> [INFO] Apache Beam :: SDKs :: Java :: Extensions .......... SKIPPED
> [INFO] Apache Beam :: SDKs :: Java :: Extensions :: Join library SKIPPED
> [INFO] Apache Beam :: SDKs :: Java :: Microbenchmarks ..... SKIPPED
> [INFO] Apache Beam :: SDKs :: Java :: Java 8 Tests ........ SKIPPED
> [INFO] Apache Beam :: Runners :: Flink .................... SKIPPED
> [INFO] Apache Beam :: Runners :: Flink :: Core ............ SKIPPED
> [INFO] Apache Beam :: Runners :: Flink :: Examples ........ SKIPPED
> [INFO] Apache Beam :: Runners :: Spark .................... SKIPPED
> [INFO] Apache Beam :: SDKs :: Java :: Maven Archetypes .... SKIPPED
> [INFO] Apache Beam :: SDKs :: Java :: Maven Archetypes :: Starter SKIPPED
> [INFO] Apache Beam :: SDKs :: Java :: Maven Archetypes :: Examples SKIPPED
> [INFO] Apache Beam :: Examples ............................ SKIPPED
> [INFO] Apache Beam :: Examples :: Java .................... SKIPPED
> [INFO] Apache Beam :: Examples :: Java 8 .................. SKIPPED
> [INFO]
> ------------------------------------------------------------------------
> [INFO] BUILD FAILURE
> [INFO]
> ------------------------------------------------------------------------
> [INFO] Total time: 09:00 min
> [INFO] Finished at: 2016-10-13T22:34:50+00:00
> [INFO] Final Memory: 111M/967M
> [INFO]
> ------------------------------------------------------------------------
> Waiting for Jenkins to finish collecting data
> [ERROR] Failed to execute goal
> org.apache.maven.plugins:maven-failsafe-plugin:2.19.1:integration-test
> (default) on project beam-sdks-java-io-google-cloud-platform: Execution
> default of goal
> org.apache.maven.plugins:maven-failsafe-plugin:2.19.1:integration-test
> failed: The forked VM terminated without properly saying goodbye. VM crash
> or System.exit called?
> [ERROR] Command was /bin/sh -c cd <
> https://builds.apache.org/job/beam_PostCommit_MavenVerify/ws/sdks/java/io/google-cloud-platform>
> && /usr/local/asfpackages/java/jdk1.8.0_102/jre/bin/java
> org.apache.maven.surefire.booter.ForkedBooter <
> https://builds.apache.org/job/beam_PostCommit_MavenVerify/ws/sdks/java/io/google-cloud-platform/target/surefire/surefire4134675155002765390tmp>
> <
> https://builds.apache.org/job/beam_PostCommit_MavenVerify/ws/sdks/java/io/google-cloud-platform/target/surefire/surefire_07832111587307387332tmp
> >
> [ERROR] -> [Help 1]
> org.apache.maven.lifecycle.LifecycleExecutionException: Failed to execute
> goal org.apache.maven.plugins:maven-failsafe-plugin:2.19.1:integration-test
> (default) on project beam-sdks-java-io-google-cloud-platform: Execution
> default of goal
> org.apache.maven.plugins:maven-failsafe-plugin:2.19.1:integration-test
> failed: The forked VM terminated without properly saying goodbye. VM crash
> or System.exit called?
> Command was /bin/sh -c cd <
> https://builds.apache.org/job/beam_PostCommit_MavenVerify/ws/sdks/java/io/google-cloud-platform>
> && /usr/local/asfpackages/java/jdk1.8.0_102/jre/bin/java
> org.apache.maven.surefire.booter.ForkedBooter <
> https://builds.apache.org/job/beam_PostCommit_MavenVerify/ws/sdks/java/io/google-cloud-platform/target/surefire/surefire4134675155002765390tmp>
> <
> https://builds.apache.org/job/beam_PostCommit_MavenVerify/ws/sdks/java/io/google-cloud-platform/target/surefire/surefire_07832111587307387332tmp
> >
>         at
> org.apache.maven.lifecycle.internal.MojoExecutor.execute(MojoExecutor.java:224)
>         at
> org.apache.maven.lifecycle.internal.MojoExecutor.execute(MojoExecutor.java:153)
>         at
> org.apache.maven.lifecycle.internal.MojoExecutor.execute(MojoExecutor.java:145)
>         at
> org.apache.maven.lifecycle.internal.LifecycleModuleBuilder.buildProject(LifecycleModuleBuilder.java:116)
>         at
> org.apache.maven.lifecycle.internal.LifecycleModuleBuilder.buildProject(LifecycleModuleBuilder.java:80)
>         at
> org.apache.maven.lifecycle.internal.builder.singlethreaded.SingleThreadedBuilder.build(SingleThreadedBuilder.java:51)
>         at
> org.apache.maven.lifecycle.internal.LifecycleStarter.execute(LifecycleStarter.java:128)
>         at org.apache.maven.DefaultMaven.doExecute(DefaultMaven.java:307)
>         at org.apache.maven.DefaultMaven.doExecute(DefaultMaven.java:193)
>         at org.apache.maven.DefaultMaven.execute(DefaultMaven.java:106)
>         at
> org.jvnet.hudson.maven3.launcher.Maven32Launcher.main(Maven32Launcher.java:132)
>         at sun.reflect.NativeMethodAccessorImpl.invoke0(Native Method)
>         at
> sun.reflect.NativeMethodAccessorImpl.invoke(NativeMethodAccessorImpl.java:62)
>         at
> sun.reflect.DelegatingMethodAccessorImpl.invoke(DelegatingMethodAccessorImpl.java:43)
>         at java.lang.reflect.Method.invoke(Method.java:498)
>         at
> org.codehaus.plexus.classworlds.launcher.Launcher.launchStandard(Launcher.java:330)
>         at
> org.codehaus.plexus.classworlds.launcher.Launcher.launch(Launcher.java:238)
>         at jenkins.maven3.agent.Maven32Main.launch(Maven32Main.java:186)
>         at sun.reflect.NativeMethodAccessorImpl.invoke0(Native Method)
>         at
> sun.reflect.NativeMethodAccessorImpl.invoke(NativeMethodAccessorImpl.java:62)
>         at
> sun.reflect.DelegatingMethodAccessorImpl.invoke(DelegatingMethodAccessorImpl.java:43)
>         at java.lang.reflect.Method.invoke(Method.java:498)
>         at hudson.maven.Maven3Builder.call(Maven3Builder.java:136)
>         at hudson.maven.Maven3Builder.call(Maven3Builder.java:71)
>         at hudson.remoting.UserRequest.perform(UserRequest.java:153)
>         at hudson.remoting.UserRequest.perform(UserRequest.java:50)
>         at hudson.remoting.Request$2.run(Request.java:332)
>         at
> hudson.remoting.InterceptingExecutorService$1.call(InterceptingExecutorService.java:68)
>         at java.util.concurrent.FutureTask.run(FutureTask.java:266)
>         at
> java.util.concurrent.ThreadPoolExecutor.runWorker(ThreadPoolExecutor.java:1142)
>         at
> java.util.concurrent.ThreadPoolExecutor$Worker.run(ThreadPoolExecutor.java:617)
>         at java.lang.Thread.run(Thread.java:745)
> Caused by: org.apache.maven.plugin.PluginExecutionException: Execution
> default of goal
> org.apache.maven.plugins:maven-failsafe-plugin:2.19.1:integration-test
> failed: The forked VM terminated without properly saying goodbye. VM crash
> or System.exit called?
> Command was /bin/sh -c cd <
> https://builds.apache.org/job/beam_PostCommit_MavenVerify/ws/sdks/java/io/google-cloud-platform>
> && /usr/local/asfpackages/java/jdk1.8.0_102/jre/bin/java
> org.apache.maven.surefire.booter.ForkedBooter <
> https://builds.apache.org/job/beam_PostCommit_MavenVerify/ws/sdks/java/io/google-cloud-platform/target/surefire/surefire4134675155002765390tmp>
> <
> https://builds.apache.org/job/beam_PostCommit_MavenVerify/ws/sdks/java/io/google-cloud-platform/target/surefire/surefire_07832111587307387332tmp
> >
>         at
> org.apache.maven.plugin.DefaultBuildPluginManager.executeMojo(DefaultBuildPluginManager.java:145)
>         at
> org.apache.maven.lifecycle.internal.MojoExecutor.execute(MojoExecutor.java:208)
>         ... 31 more
> Caused by: java.lang.RuntimeException: The forked VM terminated without
> properly saying goodbye. VM crash or System.exit called?
> Command was /bin/sh -c cd <
> https://builds.apache.org/job/beam_PostCommit_MavenVerify/ws/sdks/java/io/google-cloud-platform>
> && /usr/local/asfpackages/java/jdk1.8.0_102/jre/bin/java
> org.apache.maven.surefire.booter.ForkedBooter <
> https://builds.apache.org/job/beam_PostCommit_MavenVerify/ws/sdks/java/io/google-cloud-platform/target/surefire/surefire4134675155002765390tmp>
> <
> https://builds.apache.org/job/beam_PostCommit_MavenVerify/ws/sdks/java/io/google-cloud-platform/target/surefire/surefire_07832111587307387332tmp
> >
>         at
> org.apache.maven.plugin.surefire.booterclient.ForkStarter.fork(ForkStarter.java:590)
>         at
> org.apache.maven.plugin.surefire.booterclient.ForkStarter.fork(ForkStarter.java:460)
>         at
> org.apache.maven.plugin.surefire.booterclient.ForkStarter.run(ForkStarter.java:229)
>         at
> org.apache.maven.plugin.surefire.booterclient.ForkStarter.run(ForkStarter.java:201)
>         at
> org.apache.maven.plugin.surefire.AbstractSurefireMojo.executeProvider(AbstractSurefireMojo.java:1026)
>         at
> org.apache.maven.plugin.surefire.AbstractSurefireMojo.executeAfterPreconditionsChecked(AbstractSurefireMojo.java:862)
>         at
> org.apache.maven.plugin.surefire.AbstractSurefireMojo.execute(AbstractSurefireMojo.java:755)
>         at
> org.apache.maven.plugin.DefaultBuildPluginManager.executeMojo(DefaultBuildPluginManager.java:134)
>         ... 32 more
> [ERROR]
> [ERROR] Re-run Maven using the -X switch to enable full debug logging.
> [ERROR]
> [ERROR] For more information about the errors and possible solutions,
> please read the following articles:
> [ERROR] [Help 1]
> http://cwiki.apache.org/confluence/display/MAVEN/PluginExecutionException
> [ERROR]
> [ERROR] After correcting the problems, you can resume the build with the
> command
> [ERROR]   mvn <goals> -rf :beam-sdks-java-io-google-cloud-platform
> [JENKINS] Archiving <
> https://builds.apache.org/job/beam_PostCommit_MavenVerify/ws/sdks/java/io/pom.xml>
> to
> org.apache.beam/beam-sdks-java-io-parent/0.3.0-incubating-SNAPSHOT/beam-sdks-java-io-parent-0.3.0-incubating-SNAPSHOT.pom
> [JENKINS] Archiving <
> https://builds.apache.org/job/beam_PostCommit_MavenVerify/ws/sdks/java/microbenchmarks/pom.xml>
> to
> org.apache.beam/beam-sdks-java-microbenchmarks/0.3.0-incubating-SNAPSHOT/beam-sdks-java-microbenchmarks-0.3.0-incubating-SNAPSHOT.pom
> [JENKINS] Archiving <
> https://builds.apache.org/job/beam_PostCommit_MavenVerify/ws/runners/direct-java/dependency-reduced-pom.xml>
> to
> org.apache.beam/beam-runners-direct-java/0.3.0-incubating-SNAPSHOT/beam-runners-direct-java-0.3.0-incubating-SNAPSHOT.pom
> [JENKINS] Archiving <
> https://builds.apache.org/job/beam_PostCommit_MavenVerify/ws/runners/direct-java/target/beam-runners-direct-java-0.3.0-incubating-SNAPSHOT.jar>
> to
> org.apache.beam/beam-runners-direct-java/0.3.0-incubating-SNAPSHOT/beam-runners-direct-java-0.3.0-incubating-SNAPSHOT.jar
> [JENKINS] Archiving <
> https://builds.apache.org/job/beam_PostCommit_MavenVerify/ws/runners/direct-java/target/beam-runners-direct-java-0.3.0-incubating-SNAPSHOT-tests.jar>
> to
> org.apache.beam/beam-runners-direct-java/0.3.0-incubating-SNAPSHOT/beam-runners-direct-java-0.3.0-incubating-SNAPSHOT-tests.jar
> [JENKINS] Archiving <
> https://builds.apache.org/job/beam_PostCommit_MavenVerify/ws/runners/direct-java/target/beam-runners-direct-java-0.3.0-incubating-SNAPSHOT-sources.jar>
> to
> org.apache.beam/beam-runners-direct-java/0.3.0-incubating-SNAPSHOT/beam-runners-direct-java-0.3.0-incubating-SNAPSHOT-sources.jar
> [JENKINS] Archiving <
> https://builds.apache.org/job/beam_PostCommit_MavenVerify/ws/runners/direct-java/target/beam-runners-direct-java-0.3.0-incubating-SNAPSHOT-test-sources.jar>
> to
> org.apache.beam/beam-runners-direct-java/0.3.0-incubating-SNAPSHOT/beam-runners-direct-java-0.3.0-incubating-SNAPSHOT-test-sources.jar
> [JENKINS] Archiving <
> https://builds.apache.org/job/beam_PostCommit_MavenVerify/ws/runners/direct-java/target/beam-runners-direct-java-0.3.0-incubating-SNAPSHOT-javadoc.jar>
> to
> org.apache.beam/beam-runners-direct-java/0.3.0-incubating-SNAPSHOT/beam-runners-direct-java-0.3.0-incubating-SNAPSHOT-javadoc.jar
> [JENKINS] Archiving <
> https://builds.apache.org/job/beam_PostCommit_MavenVerify/ws/sdks/java/maven-archetypes/starter/pom.xml>
> to
> org.apache.beam/beam-sdks-java-maven-archetypes-starter/0.3.0-incubating-SNAPSHOT/beam-sdks-java-maven-archetypes-starter-0.3.0-incubating-SNAPSHOT.pom
> [JENKINS] Archiving <
> https://builds.apache.org/job/beam_PostCommit_MavenVerify/ws/examples/java/pom.xml>
> to
> org.apache.beam/beam-examples-java/0.3.0-incubating-SNAPSHOT/beam-examples-java-0.3.0-incubating-SNAPSHOT.pom
> [JENKINS] Archiving <
> https://builds.apache.org/job/beam_PostCommit_MavenVerify/ws/sdks/java/build-tools/pom.xml>
> to
> org.apache.beam/beam-sdks-java-build-tools/0.3.0-incubating-SNAPSHOT/beam-sdks-java-build-tools-0.3.0-incubating-SNAPSHOT.pom
> [JENKINS] Archiving <
> https://builds.apache.org/job/beam_PostCommit_MavenVerify/ws/sdks/java/build-tools/target/beam-sdks-java-build-tools-0.3.0-incubating-SNAPSHOT.jar>
> to
> org.apache.beam/beam-sdks-java-build-tools/0.3.0-incubating-SNAPSHOT/beam-sdks-java-build-tools-0.3.0-incubating-SNAPSHOT.jar
> [JENKINS] Archiving <
> https://builds.apache.org/job/beam_PostCommit_MavenVerify/ws/sdks/java/build-tools/target/beam-sdks-java-build-tools-0.3.0-incubating-SNAPSHOT-tests.jar>
> to
> org.apache.beam/beam-sdks-java-build-tools/0.3.0-incubating-SNAPSHOT/beam-sdks-java-build-tools-0.3.0-incubating-SNAPSHOT-tests.jar
> [JENKINS] Archiving <
> https://builds.apache.org/job/beam_PostCommit_MavenVerify/ws/sdks/java/core/dependency-reduced-pom.xml>
> to
> org.apache.beam/beam-sdks-java-core/0.3.0-incubating-SNAPSHOT/beam-sdks-java-core-0.3.0-incubating-SNAPSHOT.pom
> [JENKINS] Archiving <
> https://builds.apache.org/job/beam_PostCommit_MavenVerify/ws/sdks/java/core/target/beam-sdks-java-core-0.3.0-incubating-SNAPSHOT.jar>
> to
> org.apache.beam/beam-sdks-java-core/0.3.0-incubating-SNAPSHOT/beam-sdks-java-core-0.3.0-incubating-SNAPSHOT.jar
> [JENKINS] Archiving <
> https://builds.apache.org/job/beam_PostCommit_MavenVerify/ws/sdks/java/core/target/beam-sdks-java-core-0.3.0-incubating-SNAPSHOT-tests.jar>
> to
> org.apache.beam/beam-sdks-java-core/0.3.0-incubating-SNAPSHOT/beam-sdks-java-core-0.3.0-incubating-SNAPSHOT-tests.jar
> [JENKINS] Archiving <
> https://builds.apache.org/job/beam_PostCommit_MavenVerify/ws/sdks/java/core/target/beam-sdks-java-core-0.3.0-incubating-SNAPSHOT-sources.jar>
> to
> org.apache.beam/beam-sdks-java-core/0.3.0-incubating-SNAPSHOT/beam-sdks-java-core-0.3.0-incubating-SNAPSHOT-sources.jar
> [JENKINS] Archiving <
> https://builds.apache.org/job/beam_PostCommit_MavenVerify/ws/sdks/java/core/target/beam-sdks-java-core-0.3.0-incubating-SNAPSHOT-test-sources.jar>
> to
> org.apache.beam/beam-sdks-java-core/0.3.0-incubating-SNAPSHOT/beam-sdks-java-core-0.3.0-incubating-SNAPSHOT-test-sources.jar
> [JENKINS] Archiving <
> https://builds.apache.org/job/beam_PostCommit_MavenVerify/ws/sdks/java/core/target/beam-sdks-java-core-0.3.0-incubating-SNAPSHOT-javadoc.jar>
> to
> org.apache.beam/beam-sdks-java-core/0.3.0-incubating-SNAPSHOT/beam-sdks-java-core-0.3.0-incubating-SNAPSHOT-javadoc.jar
> [JENKINS] Archiving <
> https://builds.apache.org/job/beam_PostCommit_MavenVerify/ws/runners/flink/examples/pom.xml>
> to
> org.apache.beam/beam-runners-flink_2.10-examples/0.3.0-incubating-SNAPSHOT/beam-runners-flink_2.10-examples-0.3.0-incubating-SNAPSHOT.pom
> [JENKINS] Archiving <
> https://builds.apache.org/job/beam_PostCommit_MavenVerify/ws/runners/core-java/dependency-reduced-pom.xml>
> to
> org.apache.beam/beam-runners-core-java/0.3.0-incubating-SNAPSHOT/beam-runners-core-java-0.3.0-incubating-SNAPSHOT.pom
> [JENKINS] Archiving <
> https://builds.apache.org/job/beam_PostCommit_MavenVerify/ws/runners/core-java/target/beam-runners-core-java-0.3.0-incubating-SNAPSHOT.jar>
> to
> org.apache.beam/beam-runners-core-java/0.3.0-incubating-SNAPSHOT/beam-runners-core-java-0.3.0-incubating-SNAPSHOT.jar
> [JENKINS] Archiving <
> https://builds.apache.org/job/beam_PostCommit_MavenVerify/ws/runners/core-java/target/beam-runners-core-java-0.3.0-incubating-SNAPSHOT-tests.jar>
> to
> org.apache.beam/beam-runners-core-java/0.3.0-incubating-SNAPSHOT/beam-runners-core-java-0.3.0-incubating-SNAPSHOT-tests.jar
> [JENKINS] Archiving <
> https://builds.apache.org/job/beam_PostCommit_MavenVerify/ws/runners/core-java/target/beam-runners-core-java-0.3.0-incubating-SNAPSHOT-sources.jar>
> to
> org.apache.beam/beam-runners-core-java/0.3.0-incubating-SNAPSHOT/beam-runners-core-java-0.3.0-incubating-SNAPSHOT-sources.jar
> [JENKINS] Archiving <
> https://builds.apache.org/job/beam_PostCommit_MavenVerify/ws/runners/core-java/target/beam-runners-core-java-0.3.0-incubating-SNAPSHOT-test-sources.jar>
> to
> org.apache.beam/beam-runners-core-java/0.3.0-incubating-SNAPSHOT/beam-runners-core-java-0.3.0-incubating-SNAPSHOT-test-sources.jar
> [JENKINS] Archiving <
> https://builds.apache.org/job/beam_PostCommit_MavenVerify/ws/runners/core-java/target/beam-runners-core-java-0.3.0-incubating-SNAPSHOT-javadoc.jar>
> to
> org.apache.beam/beam-runners-core-java/0.3.0-incubating-SNAPSHOT/beam-runners-core-java-0.3.0-incubating-SNAPSHOT-javadoc.jar
> [JENKINS] Archiving <
> https://builds.apache.org/job/beam_PostCommit_MavenVerify/ws/sdks/java/io/kinesis/pom.xml>
> to
> org.apache.beam/beam-sdks-java-io-kinesis/0.3.0-incubating-SNAPSHOT/beam-sdks-java-io-kinesis-0.3.0-incubating-SNAPSHOT.pom
> [JENKINS] Archiving <
> https://builds.apache.org/job/beam_PostCommit_MavenVerify/ws/sdks/java/io/kafka/pom.xml>
> to
> org.apache.beam/beam-sdks-java-io-kafka/0.3.0-incubating-SNAPSHOT/beam-sdks-java-io-kafka-0.3.0-incubating-SNAPSHOT.pom
> [JENKINS] Archiving <
> https://builds.apache.org/job/beam_PostCommit_MavenVerify/ws/runners/flink/runner/pom.xml>
> to
> org.apache.beam/beam-runners-flink_2.10/0.3.0-incubating-SNAPSHOT/beam-runners-flink_2.10-0.3.0-incubating-SNAPSHOT.pom
> [JENKINS] Archiving <
> https://builds.apache.org/job/beam_PostCommit_MavenVerify/ws/sdks/java/io/google-cloud-platform/pom.xml>
> to
> org.apache.beam/beam-sdks-java-io-google-cloud-platform/0.3.0-incubating-SNAPSHOT/beam-sdks-java-io-google-cloud-platform-0.3.0-incubating-SNAPSHOT.pom
> [JENKINS] Archiving <
> https://builds.apache.org/job/beam_PostCommit_MavenVerify/ws/sdks/java/io/google-cloud-platform/target/beam-sdks-java-io-google-cloud-platform-0.3.0-incubating-SNAPSHOT.jar>
> to
> org.apache.beam/beam-sdks-java-io-google-cloud-platform/0.3.0-incubating-SNAPSHOT/beam-sdks-java-io-google-cloud-platform-0.3.0-incubating-SNAPSHOT.jar
> [JENKINS] Archiving <
> https://builds.apache.org/job/beam_PostCommit_MavenVerify/ws/sdks/java/io/google-cloud-platform/target/beam-sdks-java-io-google-cloud-platform-0.3.0-incubating-SNAPSHOT-sources.jar>
> to
> org.apache.beam/beam-sdks-java-io-google-cloud-platform/0.3.0-incubating-SNAPSHOT/beam-sdks-java-io-google-cloud-platform-0.3.0-incubating-SNAPSHOT-sources.jar
> [JENKINS] Archiving <
> https://builds.apache.org/job/beam_PostCommit_MavenVerify/ws/sdks/java/io/google-cloud-platform/target/beam-sdks-java-io-google-cloud-platform-0.3.0-incubating-SNAPSHOT-test-sources.jar>
> to
> org.apache.beam/beam-sdks-java-io-google-cloud-platform/0.3.0-incubating-SNAPSHOT/beam-sdks-java-io-google-cloud-platform-0.3.0-incubating-SNAPSHOT-test-sources.jar
> [JENKINS] Archiving <
> https://builds.apache.org/job/beam_PostCommit_MavenVerify/ws/sdks/java/io/google-cloud-platform/target/beam-sdks-java-io-google-cloud-platform-0.3.0-incubating-SNAPSHOT-tests.jar>
> to
> org.apache.beam/beam-sdks-java-io-google-cloud-platform/0.3.0-incubating-SNAPSHOT/beam-sdks-java-io-google-cloud-platform-0.3.0-incubating-SNAPSHOT-tests.jar
> [JENKINS] Archiving <
> https://builds.apache.org/job/beam_PostCommit_MavenVerify/ws/sdks/java/pom.xml>
> to
> org.apache.beam/beam-sdks-java-parent/0.3.0-incubating-SNAPSHOT/beam-sdks-java-parent-0.3.0-incubating-SNAPSHOT.pom
> [JENKINS] Archiving <
> https://builds.apache.org/job/beam_PostCommit_MavenVerify/ws/pom.xml> to
> org.apache.beam/beam-parent/0.3.0-incubating-SNAPSHOT/beam-parent-0.3.0-incubating-SNAPSHOT.pom
> Compressed 39.86 KB of artifacts by 80.3% relative to #1521
> [JENKINS] Archiving <
> https://builds.apache.org/job/beam_PostCommit_MavenVerify/ws/sdks/java/maven-archetypes/examples/pom.xml>
> to
> org.apache.beam/beam-sdks-java-maven-archetypes-examples/0.3.0-incubating-SNAPSHOT/beam-sdks-java-maven-archetypes-examples-0.3.0-incubating-SNAPSHOT.pom
> [JENKINS] Archiving <
> https://builds.apache.org/job/beam_PostCommit_MavenVerify/ws/runners/spark/pom.xml>
> to
> org.apache.beam/beam-runners-spark/0.3.0-incubating-SNAPSHOT/beam-runners-spark-0.3.0-incubating-SNAPSHOT.pom
> [JENKINS] Archiving <
> https://builds.apache.org/job/beam_PostCommit_MavenVerify/ws/sdks/java/io/hdfs/pom.xml>
> to
> org.apache.beam/beam-sdks-java-io-hdfs/0.3.0-incubating-SNAPSHOT/beam-sdks-java-io-hdfs-0.3.0-incubating-SNAPSHOT.pom
> [JENKINS] Archiving <
> https://builds.apache.org/job/beam_PostCommit_MavenVerify/ws/runners/google-cloud-dataflow-java/dependency-reduced-pom.xml>
> to
> org.apache.beam/beam-runners-google-cloud-dataflow-java/0.3.0-incubating-SNAPSHOT/beam-runners-google-cloud-dataflow-java-0.3.0-incubating-SNAPSHOT.pom
> [JENKINS] Archiving <
> https://builds.apache.org/job/beam_PostCommit_MavenVerify/ws/runners/google-cloud-dataflow-java/target/beam-runners-google-cloud-dataflow-java-0.3.0-incubating-SNAPSHOT.jar>
> to
> org.apache.beam/beam-runners-google-cloud-dataflow-java/0.3.0-incubating-SNAPSHOT/beam-runners-google-cloud-dataflow-java-0.3.0-incubating-SNAPSHOT.jar
> [JENKINS] Archiving <
> https://builds.apache.org/job/beam_PostCommit_MavenVerify/ws/runners/google-cloud-dataflow-java/target/beam-runners-google-cloud-dataflow-java-0.3.0-incubating-SNAPSHOT-tests.jar>
> to
> org.apache.beam/beam-runners-google-cloud-dataflow-java/0.3.0-incubating-SNAPSHOT/beam-runners-google-cloud-dataflow-java-0.3.0-incubating-SNAPSHOT-tests.jar
> [JENKINS] Archiving <
> https://builds.apache.org/job/beam_PostCommit_MavenVerify/ws/runners/google-cloud-dataflow-java/target/beam-runners-google-cloud-dataflow-java-0.3.0-incubating-SNAPSHOT-sources.jar>
> to
> org.apache.beam/beam-runners-google-cloud-dataflow-java/0.3.0-incubating-SNAPSHOT/beam-runners-google-cloud-dataflow-java-0.3.0-incubating-SNAPSHOT-sources.jar
> [JENKINS] Archiving <
> https://builds.apache.org/job/beam_PostCommit_MavenVerify/ws/runners/google-cloud-dataflow-java/target/beam-runners-google-cloud-dataflow-java-0.3.0-incubating-SNAPSHOT-test-sources.jar>
> to
> org.apache.beam/beam-runners-google-cloud-dataflow-java/0.3.0-incubating-SNAPSHOT/beam-runners-google-cloud-dataflow-java-0.3.0-incubating-SNAPSHOT-test-sources.jar
> [JENKINS] Archiving <
> https://builds.apache.org/job/beam_PostCommit_MavenVerify/ws/runners/google-cloud-dataflow-java/target/beam-runners-google-cloud-dataflow-java-0.3.0-incubating-SNAPSHOT-javadoc.jar>
> to
> org.apache.beam/beam-runners-google-cloud-dataflow-java/0.3.0-incubating-SNAPSHOT/beam-runners-google-cloud-dataflow-java-0.3.0-incubating-SNAPSHOT-javadoc.jar
> [JENKINS] Archiving <
> https://builds.apache.org/job/beam_PostCommit_MavenVerify/ws/sdks/java/maven-archetypes/pom.xml>
> to
> org.apache.beam/beam-sdks-java-maven-archetypes-parent/0.3.0-incubating-SNAPSHOT/beam-sdks-java-maven-archetypes-parent-0.3.0-incubating-SNAPSHOT.pom
> [JENKINS] Archiving <
> https://builds.apache.org/job/beam_PostCommit_MavenVerify/ws/sdks/java/io/jms/pom.xml>
> to
> org.apache.beam/beam-sdks-java-io-jms/0.3.0-incubating-SNAPSHOT/beam-sdks-java-io-jms-0.3.0-incubating-SNAPSHOT.pom
> [JENKINS] Archiving <
> https://builds.apache.org/job/beam_PostCommit_MavenVerify/ws/runners/flink/pom.xml>
> to
> org.apache.beam/beam-runners-flink-parent/0.3.0-incubating-SNAPSHOT/beam-runners-flink-parent-0.3.0-incubating-SNAPSHOT.pom
> [JENKINS] Archiving <
> https://builds.apache.org/job/beam_PostCommit_MavenVerify/ws/sdks/java/io/mongodb/pom.xml>
> to
> org.apache.beam/beam-sdks-java-io-mongodb/0.3.0-incubating-SNAPSHOT/beam-sdks-java-io-mongodb-0.3.0-incubating-SNAPSHOT.pom
> [JENKINS] Archiving <
> https://builds.apache.org/job/beam_PostCommit_MavenVerify/ws/sdks/pom.xml>
> to
> org.apache.beam/beam-sdks-parent/0.3.0-incubating-SNAPSHOT/beam-sdks-parent-0.3.0-incubating-SNAPSHOT.pom
> [JENKINS] Archiving <
> https://builds.apache.org/job/beam_PostCommit_MavenVerify/ws/sdks/java/extensions/join-library/pom.xml>
> to
> org.apache.beam/beam-sdks-java-extensions-join-library/0.3.0-incubating-SNAPSHOT/beam-sdks-java-extensions-join-library-0.3.0-incubating-SNAPSHOT.pom
> [JENKINS] Archiving <
> https://builds.apache.org/job/beam_PostCommit_MavenVerify/ws/runners/pom.xml>
> to
> org.apache.beam/beam-runners-parent/0.3.0-incubating-SNAPSHOT/beam-runners-parent-0.3.0-incubating-SNAPSHOT.pom
> [JENKINS] Archiving <
> https://builds.apache.org/job/beam_PostCommit_MavenVerify/ws/sdks/java/io/jdbc/pom.xml>
> to
> org.apache.beam/beam-sdks-java-io-jdbc/0.3.0-incubating-SNAPSHOT/beam-sdks-java-io-jdbc-0.3.0-incubating-SNAPSHOT.pom
> [JENKINS] Archiving <
> https://builds.apache.org/job/beam_PostCommit_MavenVerify/ws/sdks/java/extensions/pom.xml>
> to
> org.apache.beam/beam-sdks-java-extensions-parent/0.3.0-incubating-SNAPSHOT/beam-sdks-java-extensions-parent-0.3.0-incubating-SNAPSHOT.pom
> [JENKINS] Archiving <
> https://builds.apache.org/job/beam_PostCommit_MavenVerify/ws/examples/pom.xml>
> to
> org.apache.beam/beam-examples-parent/0.3.0-incubating-SNAPSHOT/beam-examples-parent-0.3.0-incubating-SNAPSHOT.pom
> Sending e-mails to: commits@beam.incubator.apache.org
> channel stopped
>

Mime
View raw message