beam-commits mailing list archives

Site index · List index
Message view « Date » · « Thread »
Top « Date » · « Thread »
From Apache Jenkins Server <jenk...@builds.apache.org>
Subject Build failed in Jenkins: beam_PostCommit_RunnableOnService_GoogleCloudDataflow #1462
Date Tue, 01 Nov 2016 01:55:39 GMT
See <https://builds.apache.org/job/beam_PostCommit_RunnableOnService_GoogleCloudDataflow/1462/changes>

Changes:

[lcwik] Move resource filtering later to avoid spurious rebuilds

[dhalperi] Add NestedValueProvider

------------------------------------------
[...truncated 134 lines...]
[INFO] ------------------------------------------------------------------------
[INFO] Reactor Build Order:
[INFO] 
[INFO] Apache Beam :: Parent
[INFO] Apache Beam :: SDKs
[INFO] Apache Beam :: SDKs :: Java
[INFO] Apache Beam :: SDKs :: Java :: Build Tools
[INFO] Apache Beam :: SDKs :: Java :: Core
[INFO] Apache Beam :: Runners
[INFO] Apache Beam :: Runners :: Google Cloud Dataflow
[INFO]                                                                         
[INFO] ------------------------------------------------------------------------
[INFO] Building Apache Beam :: Parent 0.4.0-incubating-SNAPSHOT
[INFO] ------------------------------------------------------------------------
[INFO] 
[INFO] --- maven-clean-plugin:2.5:clean (default-clean) @ beam-parent ---
[INFO] Deleting <https://builds.apache.org/job/beam_PostCommit_RunnableOnService_GoogleCloudDataflow/ws/target>
[INFO] 
[INFO] --- maven-enforcer-plugin:1.3.1:enforce (enforce) @ beam-parent ---
[INFO] 
[INFO] --- maven-remote-resources-plugin:1.5:process (default) @ beam-parent ---
[INFO] 
[INFO] --- maven-site-plugin:3.4:attach-descriptor (attach-descriptor) @ beam-parent ---
[INFO] 
[INFO] --- maven-dependency-plugin:2.10:analyze-only (default) @ beam-parent ---
[INFO] Skipping pom project
[INFO]                                                                         
[INFO] ------------------------------------------------------------------------
[INFO] Building Apache Beam :: SDKs 0.4.0-incubating-SNAPSHOT
[INFO] ------------------------------------------------------------------------
[INFO] 
[INFO] --- maven-clean-plugin:2.5:clean (default-clean) @ beam-sdks-parent ---
[INFO] Deleting <https://builds.apache.org/job/beam_PostCommit_RunnableOnService_GoogleCloudDataflow/ws/sdks/target>
[INFO] 
[INFO] --- maven-enforcer-plugin:1.3.1:enforce (enforce) @ beam-sdks-parent ---
[INFO] 
[INFO] --- maven-remote-resources-plugin:1.5:process (default) @ beam-sdks-parent ---
[INFO] 
[INFO] --- maven-site-plugin:3.4:attach-descriptor (attach-descriptor) @ beam-sdks-parent
---
[INFO] 
[INFO] --- maven-dependency-plugin:2.10:analyze-only (default) @ beam-sdks-parent ---
[INFO] Skipping pom project
[INFO]                                                                         
[INFO] ------------------------------------------------------------------------
[INFO] Building Apache Beam :: SDKs :: Java 0.4.0-incubating-SNAPSHOT
[INFO] ------------------------------------------------------------------------
[INFO] 
[INFO] --- maven-clean-plugin:2.5:clean (default-clean) @ beam-sdks-java-parent ---
[INFO] Deleting <https://builds.apache.org/job/beam_PostCommit_RunnableOnService_GoogleCloudDataflow/ws/sdks/java/target>
[INFO] 
[INFO] --- maven-enforcer-plugin:1.3.1:enforce (enforce) @ beam-sdks-java-parent ---
[INFO] 
[INFO] --- maven-remote-resources-plugin:1.5:process (default) @ beam-sdks-java-parent ---
[INFO] 
[INFO] --- maven-site-plugin:3.4:attach-descriptor (attach-descriptor) @ beam-sdks-java-parent
---
[INFO] 
[INFO] --- maven-dependency-plugin:2.10:analyze-only (default) @ beam-sdks-java-parent ---
[INFO] Skipping pom project
[INFO]                                                                         
[INFO] ------------------------------------------------------------------------
[INFO] Building Apache Beam :: SDKs :: Java :: Build Tools 0.4.0-incubating-SNAPSHOT
[INFO] ------------------------------------------------------------------------
[INFO] 
[INFO] --- maven-clean-plugin:2.5:clean (default-clean) @ beam-sdks-java-build-tools ---
[INFO] Deleting <https://builds.apache.org/job/beam_PostCommit_RunnableOnService_GoogleCloudDataflow/ws/sdks/java/build-tools/target>
[INFO] 
[INFO] --- maven-enforcer-plugin:1.3.1:enforce (enforce) @ beam-sdks-java-build-tools ---
[INFO] 
[INFO] --- maven-remote-resources-plugin:1.5:process (default) @ beam-sdks-java-build-tools
---
[INFO] 
[INFO] --- maven-resources-plugin:2.7:resources (default-resources) @ beam-sdks-java-build-tools
---
[INFO] Using 'UTF-8' encoding to copy filtered resources.
[INFO] Copying 3 resources
[INFO] Copying 3 resources
[INFO] 
[INFO] --- maven-compiler-plugin:3.5.1:compile (default-compile) @ beam-sdks-java-build-tools
---
[INFO] No sources to compile
[INFO] 
[INFO] --- maven-compiler-plugin:3.5.1:compile (compile-package-info) @ beam-sdks-java-build-tools
---
[INFO] No sources to compile
[INFO] 
[INFO] --- maven-resources-plugin:2.7:testResources (default-testResources) @ beam-sdks-java-build-tools
---
[INFO] Using 'UTF-8' encoding to copy filtered resources.
[INFO] skip non existing resourceDirectory <https://builds.apache.org/job/beam_PostCommit_RunnableOnService_GoogleCloudDataflow/ws/sdks/java/build-tools/src/test/resources>
[INFO] Copying 3 resources
[INFO] 
[INFO] --- maven-compiler-plugin:3.5.1:testCompile (default-testCompile) @ beam-sdks-java-build-tools
---
[INFO] No sources to compile
[INFO] 
[INFO] --- maven-surefire-plugin:2.19.1:test (default-test) @ beam-sdks-java-build-tools ---
[WARNING] useSystemClassloader setting has no effect when not forking
[JENKINS] Recording test results
[INFO] 
[INFO] --- maven-jar-plugin:2.5:jar (default-jar) @ beam-sdks-java-build-tools ---
[INFO] Building jar: <https://builds.apache.org/job/beam_PostCommit_RunnableOnService_GoogleCloudDataflow/ws/sdks/java/build-tools/target/beam-sdks-java-build-tools-0.4.0-incubating-SNAPSHOT.jar>
[INFO] 
[INFO] --- maven-site-plugin:3.4:attach-descriptor (attach-descriptor) @ beam-sdks-java-build-tools
---
[INFO] 
[INFO] --- maven-jar-plugin:2.5:test-jar (default-test-jar) @ beam-sdks-java-build-tools ---
[INFO] Building jar: <https://builds.apache.org/job/beam_PostCommit_RunnableOnService_GoogleCloudDataflow/ws/sdks/java/build-tools/target/beam-sdks-java-build-tools-0.4.0-incubating-SNAPSHOT-tests.jar>
[INFO] 
[INFO] --- maven-dependency-plugin:2.10:analyze-only (default) @ beam-sdks-java-build-tools
---
[INFO] No dependency problems found
[INFO]                                                                         
[INFO] ------------------------------------------------------------------------
[INFO] Building Apache Beam :: SDKs :: Java :: Core 0.4.0-incubating-SNAPSHOT
[INFO] ------------------------------------------------------------------------
[INFO] Downloading: https://repo.maven.apache.org/maven2/org/apache/maven/plugins/maven-shade-plugin/2.4.3/maven-shade-plugin-2.4.3.pom
[INFO] Downloaded: https://repo.maven.apache.org/maven2/org/apache/maven/plugins/maven-shade-plugin/2.4.3/maven-shade-plugin-2.4.3.pom
(9 KB at 30.0 KB/sec)
[INFO] Downloading: https://repo.maven.apache.org/maven2/org/apache/maven/plugins/maven-shade-plugin/2.4.3/maven-shade-plugin-2.4.3.jar
[INFO] Downloaded: https://repo.maven.apache.org/maven2/org/apache/maven/plugins/maven-shade-plugin/2.4.3/maven-shade-plugin-2.4.3.jar
(102 KB at 1281.5 KB/sec)
[INFO] Downloading: https://repo.maven.apache.org/maven2/io/netty/netty-codec-http2/maven-metadata.xml
[INFO] Downloading: http://repository.apache.org/snapshots/io/netty/netty-codec-http2/maven-metadata.xml
[INFO] Downloaded: https://repo.maven.apache.org/maven2/io/netty/netty-codec-http2/maven-metadata.xml
(2 KB at 29.1 KB/sec)
[INFO] 
[INFO] --- maven-clean-plugin:2.5:clean (default-clean) @ beam-sdks-java-core ---
[INFO] Deleting <https://builds.apache.org/job/beam_PostCommit_RunnableOnService_GoogleCloudDataflow/ws/sdks/java/core/target>
[INFO] 
[INFO] --- maven-enforcer-plugin:1.3.1:enforce (enforce) @ beam-sdks-java-core ---
[INFO] 
[INFO] --- jacoco-maven-plugin:0.7.5.201505241946:prepare-agent (default) @ beam-sdks-java-core
---
[INFO] argLine set to -javaagent:<https://builds.apache.org/job/beam_PostCommit_RunnableOnService_GoogleCloudDataflow/ws/.repository/org/jacoco/org.jacoco.agent/0.7.5.201505241946/org.jacoco.agent-0.7.5.201505241946-runtime.jar=destfile=/home/jenkins/jenkins-slave/workspace/beam_PostCommit_RunnableOnService_GoogleCloudDataflow/sdks/java/core/target/jacoco.exec,excludes=**/AutoValue_*.class,dumponexit=true,output=file>
[INFO] 
[INFO] --- avro-maven-plugin:1.8.1:schema (schemas) @ beam-sdks-java-core ---
[INFO] 
[INFO] --- maven-remote-resources-plugin:1.5:process (default) @ beam-sdks-java-core ---
[INFO] artifact io.netty:netty-codec-http2: checking for updates from central
[INFO] 
[INFO] --- maven-resources-plugin:2.7:resources (default-resources) @ beam-sdks-java-core
---
[INFO] Using 'UTF-8' encoding to copy filtered resources.
[INFO] Copying 1 resource
[INFO] Copying 3 resources
[INFO] 
[INFO] --- maven-compiler-plugin:3.5.1:compile (default-compile) @ beam-sdks-java-core ---
[INFO] Changes detected - recompiling the module!
[INFO] Compiling 383 source files to <https://builds.apache.org/job/beam_PostCommit_RunnableOnService_GoogleCloudDataflow/ws/sdks/java/core/target/classes>
[INFO] <https://builds.apache.org/job/beam_PostCommit_RunnableOnService_GoogleCloudDataflow/ws/sdks/java/core/src/main/java/org/apache/beam/sdk/util/CombineContextFactory.java>:
Some input files use or override a deprecated API.
[INFO] <https://builds.apache.org/job/beam_PostCommit_RunnableOnService_GoogleCloudDataflow/ws/sdks/java/core/src/main/java/org/apache/beam/sdk/util/CombineContextFactory.java>:
Recompile with -Xlint:deprecation for details.
[INFO] <https://builds.apache.org/job/beam_PostCommit_RunnableOnService_GoogleCloudDataflow/ws/sdks/java/core/src/main/java/org/apache/beam/sdk/options/ValueProvider.java>:
Some input files use unchecked or unsafe operations.
[INFO] <https://builds.apache.org/job/beam_PostCommit_RunnableOnService_GoogleCloudDataflow/ws/sdks/java/core/src/main/java/org/apache/beam/sdk/options/ValueProvider.java>:
Recompile with -Xlint:unchecked for details.
[INFO] 
[INFO] --- maven-compiler-plugin:3.5.1:compile (compile-package-info) @ beam-sdks-java-core
---
[INFO] Changes detected - recompiling the module!
[INFO] Compiling 21 source files to <https://builds.apache.org/job/beam_PostCommit_RunnableOnService_GoogleCloudDataflow/ws/sdks/java/core/target/classes>
[WARNING] bootstrap class path not set in conjunction with -source 1.7
[INFO] 
[INFO] --- maven-resources-plugin:2.7:resources (resources) @ beam-sdks-java-core ---
[INFO] Using 'UTF-8' encoding to copy filtered resources.
[INFO] Copying 1 resource
[INFO] Copying 3 resources
[INFO] 
[INFO] --- build-helper-maven-plugin:1.10:add-test-source (add-test-source) @ beam-sdks-java-core
---
[INFO] Test Source directory: <https://builds.apache.org/job/beam_PostCommit_RunnableOnService_GoogleCloudDataflow/ws/sdks/java/core/target/generated-test-sources/java>
added.
[INFO] 
[INFO] --- maven-resources-plugin:2.7:testResources (default-testResources) @ beam-sdks-java-core
---
[INFO] Using 'UTF-8' encoding to copy filtered resources.
[INFO] skip non existing resourceDirectory <https://builds.apache.org/job/beam_PostCommit_RunnableOnService_GoogleCloudDataflow/ws/sdks/java/core/src/test/resources>
[INFO] Copying 3 resources
[INFO] 
[INFO] --- maven-compiler-plugin:3.5.1:testCompile (default-testCompile) @ beam-sdks-java-core
---
[INFO] Changes detected - recompiling the module!
[INFO] Compiling 250 source files to <https://builds.apache.org/job/beam_PostCommit_RunnableOnService_GoogleCloudDataflow/ws/sdks/java/core/target/test-classes>
[INFO] <https://builds.apache.org/job/beam_PostCommit_RunnableOnService_GoogleCloudDataflow/ws/sdks/java/core/src/test/java/org/apache/beam/sdk/AggregatorPipelineExtractorTest.java>:
Some input files use or override a deprecated API.
[INFO] <https://builds.apache.org/job/beam_PostCommit_RunnableOnService_GoogleCloudDataflow/ws/sdks/java/core/src/test/java/org/apache/beam/sdk/AggregatorPipelineExtractorTest.java>:
Recompile with -Xlint:deprecation for details.
[INFO] <https://builds.apache.org/job/beam_PostCommit_RunnableOnService_GoogleCloudDataflow/ws/sdks/java/core/src/test/java/org/apache/beam/sdk/transforms/CombineFnsTest.java>:
Some input files use unchecked or unsafe operations.
[INFO] <https://builds.apache.org/job/beam_PostCommit_RunnableOnService_GoogleCloudDataflow/ws/sdks/java/core/src/test/java/org/apache/beam/sdk/transforms/CombineFnsTest.java>:
Recompile with -Xlint:unchecked for details.
[INFO] 
[INFO] --- maven-checkstyle-plugin:2.17:check (default) @ beam-sdks-java-core ---
[INFO] Starting audit...
[ERROR] <https://builds.apache.org/job/beam_PostCommit_RunnableOnService_GoogleCloudDataflow/ws/sdks/java/core/src/main/java/org/apache/beam/sdk/options/ValueProvider.java>:100:3:
Redundant 'static' modifier. [RedundantModifier]
Audit done.
[INFO] There is 1 error reported by Checkstyle 6.19 with beam/checkstyle.xml ruleset.
[ERROR] src/main/java/org/apache/beam/sdk/options/ValueProvider.java:[100,3] (modifier) RedundantModifier:
Redundant 'static' modifier.
[INFO] ------------------------------------------------------------------------
[INFO] Reactor Summary:
[INFO] 
[INFO] Apache Beam :: Parent .............................. SUCCESS [  5.928 s]
[INFO] Apache Beam :: SDKs ................................ SUCCESS [  0.535 s]
[INFO] Apache Beam :: SDKs :: Java ........................ SUCCESS [  1.003 s]
[INFO] Apache Beam :: SDKs :: Java :: Build Tools ......... SUCCESS [  4.743 s]
[INFO] Apache Beam :: SDKs :: Java :: Core ................ FAILURE [ 42.986 s]
[INFO] Apache Beam :: Runners ............................. SKIPPED
[INFO] Apache Beam :: Runners :: Google Cloud Dataflow .... SKIPPED
[INFO] ------------------------------------------------------------------------
[INFO] BUILD FAILURE
[INFO] ------------------------------------------------------------------------
[INFO] Total time: 01:38 min
[INFO] Finished at: 2016-11-01T01:55:29+00:00
[INFO] Final Memory: 67M/843M
[INFO] ------------------------------------------------------------------------
Waiting for Jenkins to finish collecting data
[ERROR] Failed to execute goal org.apache.maven.plugins:maven-checkstyle-plugin:2.17:check
(default) on project beam-sdks-java-core: You have 1 Checkstyle violation. -> [Help 1]
org.apache.maven.lifecycle.LifecycleExecutionException: Failed to execute goal org.apache.maven.plugins:maven-checkstyle-plugin:2.17:check
(default) on project beam-sdks-java-core: You have 1 Checkstyle violation.
	at org.apache.maven.lifecycle.internal.MojoExecutor.execute(MojoExecutor.java:212)
	at org.apache.maven.lifecycle.internal.MojoExecutor.execute(MojoExecutor.java:153)
	at org.apache.maven.lifecycle.internal.MojoExecutor.execute(MojoExecutor.java:145)
	at org.apache.maven.lifecycle.internal.LifecycleModuleBuilder.buildProject(LifecycleModuleBuilder.java:116)
	at org.apache.maven.lifecycle.internal.LifecycleModuleBuilder.buildProject(LifecycleModuleBuilder.java:80)
	at org.apache.maven.lifecycle.internal.builder.singlethreaded.SingleThreadedBuilder.build(SingleThreadedBuilder.java:51)
	at org.apache.maven.lifecycle.internal.LifecycleStarter.execute(LifecycleStarter.java:128)
	at org.apache.maven.DefaultMaven.doExecute(DefaultMaven.java:307)
	at org.apache.maven.DefaultMaven.doExecute(DefaultMaven.java:193)
	at org.apache.maven.DefaultMaven.execute(DefaultMaven.java:106)
	at org.jvnet.hudson.maven3.launcher.Maven32Launcher.main(Maven32Launcher.java:132)
	at sun.reflect.NativeMethodAccessorImpl.invoke0(Native Method)
	at sun.reflect.NativeMethodAccessorImpl.invoke(NativeMethodAccessorImpl.java:62)
	at sun.reflect.DelegatingMethodAccessorImpl.invoke(DelegatingMethodAccessorImpl.java:43)
	at java.lang.reflect.Method.invoke(Method.java:498)
	at org.codehaus.plexus.classworlds.launcher.Launcher.launchStandard(Launcher.java:330)
	at org.codehaus.plexus.classworlds.launcher.Launcher.launch(Launcher.java:238)
	at jenkins.maven3.agent.Maven32Main.launch(Maven32Main.java:186)
	at sun.reflect.NativeMethodAccessorImpl.invoke0(Native Method)
	at sun.reflect.NativeMethodAccessorImpl.invoke(NativeMethodAccessorImpl.java:62)
	at sun.reflect.DelegatingMethodAccessorImpl.invoke(DelegatingMethodAccessorImpl.java:43)
	at java.lang.reflect.Method.invoke(Method.java:498)
	at hudson.maven.Maven3Builder.call(Maven3Builder.java:136)
	at hudson.maven.Maven3Builder.call(Maven3Builder.java:71)
	at hudson.remoting.UserRequest.perform(UserRequest.java:153)
	at hudson.remoting.UserRequest.perform(UserRequest.java:50)
	at hudson.remoting.Request$2.run(Request.java:332)
	at hudson.remoting.InterceptingExecutorService$1.call(InterceptingExecutorService.java:68)
	at java.util.concurrent.FutureTask.run(FutureTask.java:266)
	at java.util.concurrent.ThreadPoolExecutor.runWorker(ThreadPoolExecutor.java:1142)
	at java.util.concurrent.ThreadPoolExecutor$Worker.run(ThreadPoolExecutor.java:617)
	at java.lang.Thread.run(Thread.java:745)
Caused by: org.apache.maven.plugin.MojoFailureException: You have 1 Checkstyle violation.
	at org.apache.maven.plugin.checkstyle.CheckstyleViolationCheckMojo.execute(CheckstyleViolationCheckMojo.java:588)
	at org.apache.maven.plugin.DefaultBuildPluginManager.executeMojo(DefaultBuildPluginManager.java:134)
	at org.apache.maven.lifecycle.internal.MojoExecutor.execute(MojoExecutor.java:208)
	... 31 more
[ERROR] 
[ERROR] Re-run Maven using the -X switch to enable full debug logging.
[ERROR] 
[ERROR] For more information about the errors and possible solutions, please read the following
articles:
[ERROR] [Help 1] http://cwiki.apache.org/confluence/display/MAVEN/MojoFailureException
[ERROR] 
[ERROR] After correcting the problems, you can resume the build with the command
[ERROR]   mvn <goals> -rf :beam-sdks-java-core
[JENKINS] Archiving <https://builds.apache.org/job/beam_PostCommit_RunnableOnService_GoogleCloudDataflow/ws/sdks/java/build-tools/pom.xml>
to org.apache.beam/beam-sdks-java-build-tools/0.4.0-incubating-SNAPSHOT/beam-sdks-java-build-tools-0.4.0-incubating-SNAPSHOT.pom
[JENKINS] Archiving <https://builds.apache.org/job/beam_PostCommit_RunnableOnService_GoogleCloudDataflow/ws/sdks/java/build-tools/target/beam-sdks-java-build-tools-0.4.0-incubating-SNAPSHOT.jar>
to org.apache.beam/beam-sdks-java-build-tools/0.4.0-incubating-SNAPSHOT/beam-sdks-java-build-tools-0.4.0-incubating-SNAPSHOT.jar
[JENKINS] Archiving <https://builds.apache.org/job/beam_PostCommit_RunnableOnService_GoogleCloudDataflow/ws/sdks/java/build-tools/target/beam-sdks-java-build-tools-0.4.0-incubating-SNAPSHOT-tests.jar>
to org.apache.beam/beam-sdks-java-build-tools/0.4.0-incubating-SNAPSHOT/beam-sdks-java-build-tools-0.4.0-incubating-SNAPSHOT-tests.jar
[JENKINS] Archiving <https://builds.apache.org/job/beam_PostCommit_RunnableOnService_GoogleCloudDataflow/ws/sdks/java/core/pom.xml>
to org.apache.beam/beam-sdks-java-core/0.4.0-incubating-SNAPSHOT/beam-sdks-java-core-0.4.0-incubating-SNAPSHOT.pom
[JENKINS] Archiving <https://builds.apache.org/job/beam_PostCommit_RunnableOnService_GoogleCloudDataflow/ws/sdks/java/pom.xml>
to org.apache.beam/beam-sdks-java-parent/0.4.0-incubating-SNAPSHOT/beam-sdks-java-parent-0.4.0-incubating-SNAPSHOT.pom
[JENKINS] Archiving <https://builds.apache.org/job/beam_PostCommit_RunnableOnService_GoogleCloudDataflow/ws/pom.xml>
to org.apache.beam/beam-parent/0.4.0-incubating-SNAPSHOT/beam-parent-0.4.0-incubating-SNAPSHOT.pom
Compressed 41.08 KB of artifacts by 77.9% relative to #1461
[JENKINS] Archiving <https://builds.apache.org/job/beam_PostCommit_RunnableOnService_GoogleCloudDataflow/ws/runners/google-cloud-dataflow-java/pom.xml>
to org.apache.beam/beam-runners-google-cloud-dataflow-java/0.4.0-incubating-SNAPSHOT/beam-runners-google-cloud-dataflow-java-0.4.0-incubating-SNAPSHOT.pom
[JENKINS] Archiving <https://builds.apache.org/job/beam_PostCommit_RunnableOnService_GoogleCloudDataflow/ws/sdks/pom.xml>
to org.apache.beam/beam-sdks-parent/0.4.0-incubating-SNAPSHOT/beam-sdks-parent-0.4.0-incubating-SNAPSHOT.pom
[JENKINS] Archiving <https://builds.apache.org/job/beam_PostCommit_RunnableOnService_GoogleCloudDataflow/ws/runners/pom.xml>
to org.apache.beam/beam-runners-parent/0.4.0-incubating-SNAPSHOT/beam-runners-parent-0.4.0-incubating-SNAPSHOT.pom
channel stopped

Mime
View raw message